{"text_format":"3","workbook":"xlsx","n_sheets":13,"sheets":["Clima Beam","cal","NL","EN","DE","FR","NR","SP","SW","TS","ExtraTaal1","ExtraTaal2","ExtraTaal3"],"not_rendered":{"charts":4,"images":4,"macros":1,"defined_names":35,"comments":1},"read":"whole","date_system":"1900"}

{"sheet":"Clima Beam","index":0,"n_rows":33,"n_cols":11,"rows_kept":33,"merged":[[1,1,1,8],[3,5,3,8],[3,9,3,10],[4,1,4,2],[4,5,4,8],[4,9,4,10],[5,5,5,8],[5,9,5,10],[6,5,6,8],[6,9,6,10],[9,9,9,10],[10,9,13,10],[16,1,16,10],[29,1,29,6],[30,1,30,10],[31,1,31,10],[32,1,32,10],[38,0,39,11]]}
[]
[null,"Selectiontool Clima Beam"]
[]
[{"$nulls":5},"Taal/Language/Sprache/Språk/Jazyk",{"$nulls":3},"Deutsch"]
[{"$nulls":5},{"$f":"cal!D5","v":"Ausführung:"},{"$nulls":3},"Einbau"]
[{"$nulls":5},{"$f":"cal!D6","v":"Höhe [cm]:"},{"$nulls":3},"9,6"]
[{"$nulls":5},{"$f":"cal!D7","v":"Drehzahlstufe:"},{"$nulls":3},"Comfort"]
[]
[null,{"$f":"cal!B9","v":"Temperaturen"}]
[null,{"$f":"cal!B10","v":"Heizen:"},{"$nulls":3},{"$f":"cal!F10","v":"Kühlen:"},{"$nulls":3},{"$f":"cal!J10","v":"Einheiten"}]
[null,{"$f":"cal!B11","v":"Vorlauftemp."},null,75,{"$f":"cal!E11","v":"°C"},{"$f":"cal!F11","v":"Vorlauftemp."},null,15.999999999999998,{"$f":"E11","v":"°C"}]
[null,{"$f":"cal!B12","v":"Rücklauftemp."},null,65,{"$f":"E11","v":"°C"},{"$f":"cal!F12","v":"Rücklauftemp."},null,18.000000000000004,{"$f":"E11","v":"°C"}]
[null,{"$f":"cal!B13","v":"Raumtemp."},null,20,{"$f":"E11","v":"°C"},{"$f":"cal!F13","v":"Raumtemp."},null,26.999999999999996,{"$f":"E11","v":"°C"}]
[]
[]
[null,{"$f":"cal!B16","v":"Länge [cm]"},{"$f":"cal!C16","v":"Wärmeleistung in [W]"},{"$f":"cal!D16","v":"Heizmittelstrom in [l/h]"},{"$f":"cal!E16","v":"zug. wassers. Druckverlust [kPa]"},{"$f":"cal!F16","v":"Sens. kälteleistung in [W]"},{"$f":"cal!G16","v":"Kühlmittelstrom in [l/h]"},{"$f":"cal!H16","v":"zug. wassers. Druckverlust [kPa]"},{"$f":"cal!I16","v":"Luftvolumenstrom [m³/h]"},{"$f":"cal!J16","v":"Schalldruckpegel* [dB(A)]"},{"$f":"cal!K16","v":"Elektr. leistung [W]"}]
[null,{"$f":"cal!B17","v":"Clima Beam -  H9,6 B33 Typ 8"}]
[null,{"$f":"IF(UnitsNo=1,ROUND(cal!B18,0),IF(UnitsNo=2,ROUND(cal!B18*0.393700787,1),))","v":70},{"$f":"IF(UnitsNo=1,cal!C18,IF(UnitsNo=2,cal!C18*3.412141633,))","v":{"v":595.6000000000001,"d":"596"}},{"$f":"IF(UnitsNo=1,cal!D18,IF(UnitsNo=2,cal!D18/227.124707,))","v":{"v":51.21238177128118,"d":"51.2"}},{"$f":"IF(UnitsNo=1,cal!E18,IF(UnitsNo=2,cal!E18*0.334562))","v":{"v":3.883766623303083,"d":"3.9"}},{"$f":"IF(UnitsNo=1,cal!F18,IF(UnitsNo=2,cal!F18*3.412141633,))","v":{"v":138.79999999999998,"d":"139"}},{"$f":"IF(UnitsNo=1,cal!G18,IF(UnitsNo=2,cal!G18/227.124707,))","v":{"v":59.67325881341342,"d":"59.7"}},{"$f":"IF(UnitsNo=1,cal!H18,IF(UnitsNo=2,cal!H18*0.334562))","v":{"v":5.262792155102422,"d":"5.3"}},{"$f":"IF(UnitsNo=1,cal!I18,IF(UnitsNo=2,cal!I18/1.69901082,))","v":{"v":56.800000000000004,"d":"57"}},{"$f":"cal!J18","v":16},{"$f":"cal!K18","v":{"v":4.5,"d":"5"}}]
[null,{"$f":"IF(UnitsNo=1,ROUND(cal!B19,0),IF(UnitsNo=2,ROUND(cal!B19*0.393700787,1),))","v":90},{"$f":"IF(UnitsNo=1,cal!C19,IF(UnitsNo=2,cal!C19*3.412141633,))","v":{"v":893.4000000000001,"d":"893"}},{"$f":"IF(UnitsNo=1,cal!D19,IF(UnitsNo=2,cal!D19/227.124707,))","v":{"v":76.81857265692176,"d":"76.8"}},{"$f":"IF(UnitsNo=1,cal!E19,IF(UnitsNo=2,cal!E19*0.334562))","v":{"v":8.87151071497894,"d":"8.9"}},{"$f":"IF(UnitsNo=1,cal!F19,IF(UnitsNo=2,cal!F19*3.412141633,))","v":{"v":208.19999999999996,"d":"208"}},{"$f":"IF(UnitsNo=1,cal!G19,IF(UnitsNo=2,cal!G19/227.124707,))","v":{"v":89.50988822012012,"d":"89.5"}},{"$f":"IF(UnitsNo=1,cal!H19,IF(UnitsNo=2,cal!H19*0.334562))","v":{"v":12.016173050742543,"d":"12.0"}},{"$f":"IF(UnitsNo=1,cal!I19,IF(UnitsNo=2,cal!I19/1.69901082,))","v":{"v":94.4,"d":"94"}},{"$f":"cal!J19","v":18},{"$f":"cal!K19","v":{"v":6.3,"d":"6"}}]
[null,{"$f":"IF(UnitsNo=1,ROUND(cal!B20,0),IF(UnitsNo=2,ROUND(cal!B20*0.393700787,1),))","v":100},{"$f":"IF(UnitsNo=1,cal!C20,IF(UnitsNo=2,cal!C20*3.412141633,))","v":{"v":1042.3000000000002,"d":"1042"}},{"$f":"IF(UnitsNo=1,cal!D20,IF(UnitsNo=2,cal!D20/227.124707,))","v":{"v":89.62166809974205,"d":"89.6"}},{"$f":"IF(UnitsNo=1,cal!E20,IF(UnitsNo=2,cal!E20*0.334562))","v":{"v":12.162562615676404,"d":"12.2"}},{"$f":"IF(UnitsNo=1,cal!F20,IF(UnitsNo=2,cal!F20*3.412141633,))","v":{"v":242.89999999999995,"d":"243"}},{"$f":"IF(UnitsNo=1,cal!G20,IF(UnitsNo=2,cal!G20/227.124707,))","v":{"v":104.42820292347346,"d":"104.4"}},{"$f":"IF(UnitsNo=1,cal!H20,IF(UnitsNo=2,cal!H20*0.334562))","v":{"v":16.47031068421827,"d":"16.5"}},{"$f":"IF(UnitsNo=1,cal!I20,IF(UnitsNo=2,cal!I20/1.69901082,))","v":{"v":113.60000000000001,"d":"114"}},{"$f":"cal!J20","v":19},{"$f":"cal!K20","v":{"v":7.2,"d":"7"}}]
[null,{"$f":"IF(UnitsNo=1,ROUND(cal!B21,0),IF(UnitsNo=2,ROUND(cal!B21*0.393700787,1),))","v":120},{"$f":"IF(UnitsNo=1,cal!C21,IF(UnitsNo=2,cal!C21*3.412141633,))","v":{"v":1340.1000000000001,"d":"1340"}},{"$f":"IF(UnitsNo=1,cal!D21,IF(UnitsNo=2,cal!D21/227.124707,))","v":{"v":115.22785898538264,"d":"115.2"}},{"$f":"IF(UnitsNo=1,cal!E21,IF(UnitsNo=2,cal!E21*0.334562))","v":{"v":20.385813322958697,"d":"20.4"}},{"$f":"IF(UnitsNo=1,cal!F21,IF(UnitsNo=2,cal!F21*3.412141633,))","v":{"v":312.29999999999995,"d":"312"}},{"$f":"IF(UnitsNo=1,cal!G21,IF(UnitsNo=2,cal!G21/227.124707,))","v":{"v":134.26483233018018,"d":"134.3"}},{"$f":"IF(UnitsNo=1,cal!H21,IF(UnitsNo=2,cal!H21*0.334562))","v":{"v":27.594987411547475,"d":"27.6"}},{"$f":"IF(UnitsNo=1,cal!I21,IF(UnitsNo=2,cal!I21/1.69901082,))","v":{"v":150.4,"d":"150"}},{"$f":"cal!J21","v":20},{"$f":"cal!K21","v":{"v":8.73,"d":"9"}}]
[null,{"$f":"IF(UnitsNo=1,ROUND(cal!B22,0),IF(UnitsNo=2,ROUND(cal!B22*0.393700787,1),))","v":150},{"$f":"IF(UnitsNo=1,cal!C22,IF(UnitsNo=2,cal!C22*3.412141633,))","v":{"v":1786.8000000000002,"d":"1787"}},{"$f":"IF(UnitsNo=1,cal!D22,IF(UnitsNo=2,cal!D22/227.124707,))","v":{"v":153.63714531384352,"d":"153.6"}},{"$f":"IF(UnitsNo=1,cal!E22,IF(UnitsNo=2,cal!E22*0.334562))","v":{"v":36.95676247130579,"d":"37.0"}},{"$f":"IF(UnitsNo=1,cal!F22,IF(UnitsNo=2,cal!F22*3.412141633,))","v":{"v":416.3999999999999,"d":"416"}},{"$f":"IF(UnitsNo=1,cal!G22,IF(UnitsNo=2,cal!G22/227.124707,))","v":{"v":179.01977644024024,"d":"179.0"}},{"$f":"IF(UnitsNo=1,cal!H22,IF(UnitsNo=2,cal!H22*0.334562))","v":{"v":49.998120352930925,"d":"50.0"}},{"$f":"IF(UnitsNo=1,cal!I22,IF(UnitsNo=2,cal!I22/1.69901082,))","v":{"v":188.8,"d":"189"}},{"$f":"cal!J22","v":{"v":21.41028567288496,"d":"21"}},{"$f":"cal!K22","v":{"v":10.53,"d":"11"}}]
[null,{"$f":"IF(UnitsNo=1,ROUND(cal!B23,0),IF(UnitsNo=2,ROUND(cal!B23*0.393700787,1),))","v":170},{"$f":"IF(UnitsNo=1,cal!C23,IF(UnitsNo=2,cal!C23*3.412141633,))","v":{"v":2084.6000000000004,"d":"2085"}},{"$f":"IF(UnitsNo=1,cal!D23,IF(UnitsNo=2,cal!D23/227.124707,))","v":{"v":179.2433361994841,"d":"179.2"}},{"$f":"IF(UnitsNo=1,cal!E23,IF(UnitsNo=2,cal!E23*0.334562))","v":{"v":50.92745668932959,"d":"50.9"}},{"$f":"IF(UnitsNo=1,cal!F23,IF(UnitsNo=2,cal!F23*3.412141633,))","v":{"v":485.7999999999999,"d":"486"}},{"$f":"IF(UnitsNo=1,cal!G23,IF(UnitsNo=2,cal!G23/227.124707,))","v":{"v":208.85640584694693,"d":"208.9"}},{"$f":"IF(UnitsNo=1,cal!H23,IF(UnitsNo=2,cal!H23*0.334562))","v":{"v":68.87488924006986,"d":"68.9"}},{"$f":"IF(UnitsNo=1,cal!I23,IF(UnitsNo=2,cal!I23/1.69901082,))","v":{"v":226.4,"d":"226"}},{"$f":"cal!J23","v":{"v":22.20209813336121,"d":"22"}},{"$f":"cal!K23","v":{"v":12.33,"d":"12"}}]
[null,{"$f":"IF(UnitsNo=1,ROUND(cal!B24,0),IF(UnitsNo=2,ROUND(cal!B24*0.393700787,1),))","v":190},{"$f":"IF(UnitsNo=1,cal!C24,IF(UnitsNo=2,cal!C24*3.412141633,))","v":{"v":2382.4000000000005,"d":"2382"}},{"$f":"IF(UnitsNo=1,cal!D24,IF(UnitsNo=2,cal!D24/227.124707,))","v":{"v":204.84952708512472,"d":"204.8"}},{"$f":"IF(UnitsNo=1,cal!E24,IF(UnitsNo=2,cal!E24*0.334562))","v":{"v":67.31326494086602,"d":"67.3"}},{"$f":"IF(UnitsNo=1,cal!F24,IF(UnitsNo=2,cal!F24*3.412141633,))","v":{"v":555.1999999999999,"d":"555"}},{"$f":"IF(UnitsNo=1,cal!G24,IF(UnitsNo=2,cal!G24/227.124707,))","v":{"v":238.69303525365368,"d":"238.7"}},{"$f":"IF(UnitsNo=1,cal!H24,IF(UnitsNo=2,cal!H24*0.334562))","v":{"v":91.00516979496945,"d":"91.0"}},{"$f":"IF(UnitsNo=1,cal!I24,IF(UnitsNo=2,cal!I24/1.69901082,))","v":264},{"$f":"cal!J24","v":{"v":22.871566029667342,"d":"23"}},{"$f":"cal!K24","v":{"v":14.129999999999999,"d":"14"}}]
[null,{"$f":"IF(UnitsNo=1,ROUND(cal!B25,0),IF(UnitsNo=2,ROUND(cal!B25*0.393700787,1),))","v":210},{"$f":"IF(UnitsNo=1,cal!C25,IF(UnitsNo=2,cal!C25*3.412141633,))","v":{"v":2680.2000000000003,"d":"2680"}},{"$f":"IF(UnitsNo=1,cal!D25,IF(UnitsNo=2,cal!D25/227.124707,))","v":{"v":230.45571797076528,"d":"230.5"}},{"$f":"IF(UnitsNo=1,cal!E25,IF(UnitsNo=2,cal!E25*0.334562))","v":{"v":86.17752394524335,"d":"86.2"}},{"$f":"IF(UnitsNo=1,cal!F25,IF(UnitsNo=2,cal!F25*3.412141633,))","v":{"v":624.5999999999999,"d":"625"}},{"$f":"IF(UnitsNo=1,cal!G25,IF(UnitsNo=2,cal!G25/227.124707,))","v":{"v":268.52966466036037,"d":"268.5"}},{"$f":"IF(UnitsNo=1,cal!H25,IF(UnitsNo=2,cal!H25*0.334562))","v":{"v":116.47222533657032,"d":"116.5"}},{"$f":"IF(UnitsNo=1,cal!I25,IF(UnitsNo=2,cal!I25/1.69901082,))","v":{"v":301.6,"d":"302"}},{"$f":"cal!J25","v":{"v":22.871566029667342,"d":"23"}},{"$f":"cal!K25","v":{"v":16.2,"d":"16"}}]
[null,{"$f":"IF(UnitsNo=1,ROUND(cal!B26,0),IF(UnitsNo=2,ROUND(cal!B26*0.393700787,1),))","v":230},{"$f":"IF(UnitsNo=1,cal!C26,IF(UnitsNo=2,cal!C26*3.412141633,))","v":{"v":2978.0000000000005,"d":"2978"}},{"$f":"IF(UnitsNo=1,cal!D26,IF(UnitsNo=2,cal!D26/227.124707,))","v":{"v":256.06190885640586,"d":"256.1"}},{"$f":"IF(UnitsNo=1,cal!E26,IF(UnitsNo=2,cal!E26*0.334562))","v":{"v":107.58197016992357,"d":"107.6"}},{"$f":"IF(UnitsNo=1,cal!F26,IF(UnitsNo=2,cal!F26*3.412141633,))","v":{"v":693.9999999999999,"d":"694"}},{"$f":"IF(UnitsNo=1,cal!G26,IF(UnitsNo=2,cal!G26/227.124707,))","v":{"v":298.3662940670671,"d":"298.4"}},{"$f":"IF(UnitsNo=1,cal!H26,IF(UnitsNo=2,cal!H26*0.334562))","v":{"v":145.3572154707863,"d":"145.4"}},{"$f":"IF(UnitsNo=1,cal!I26,IF(UnitsNo=2,cal!I26/1.69901082,))","v":{"v":301.6,"d":"302"}},{"$f":"cal!J26","v":{"v":23.45148549944421,"d":"23"}},{"$f":"cal!K26","v":{"v":15.93,"d":"16"}}]
[null,{"$f":"IF(UnitsNo=1,ROUND(cal!B27,0),IF(UnitsNo=2,ROUND(cal!B27*0.393700787,1),))","v":250},{"$f":"IF(UnitsNo=1,cal!C27,IF(UnitsNo=2,cal!C27*3.412141633,))","v":{"v":3275.8000000000006,"d":"3276"}},{"$f":"IF(UnitsNo=1,cal!D27,IF(UnitsNo=2,cal!D27/227.124707,))","v":{"v":281.6680997420465,"d":"281.7"}},{"$f":"IF(UnitsNo=1,cal!E27,IF(UnitsNo=2,cal!E27*0.334562))","v":{"v":131.58694759996138,"d":"131.6"}},{"$f":"IF(UnitsNo=1,cal!F27,IF(UnitsNo=2,cal!F27*3.412141633,))","v":{"v":763.4,"d":"763"}},{"$f":"IF(UnitsNo=1,cal!G27,IF(UnitsNo=2,cal!G27/227.124707,))","v":{"v":328.2029234737738,"d":"328.2"}},{"$f":"IF(UnitsNo=1,cal!H27,IF(UnitsNo=2,cal!H27*0.334562))","v":{"v":177.73946922708157,"d":"177.7"}},{"$f":"IF(UnitsNo=1,cal!I27,IF(UnitsNo=2,cal!I27/1.69901082,))","v":{"v":358.40000000000003,"d":"358"}},{"$f":"cal!J27","v":{"v":23.963010723918025,"d":"24"}},{"$f":"cal!K27","v":{"v":18.900000000000002,"d":"19"}}]
[null,{"$f":"IF(UnitsNo=1,ROUND(cal!B28,0),IF(UnitsNo=2,ROUND(cal!B28*0.393700787,1),))","v":270},{"$f":"IF(UnitsNo=1,cal!C28,IF(UnitsNo=2,cal!C28*3.412141633,))","v":{"v":3573.6000000000004,"d":"3574"}},{"$f":"IF(UnitsNo=1,cal!D28,IF(UnitsNo=2,cal!D28/227.124707,))","v":{"v":307.27429062768704,"d":"307.3"}},{"$f":"IF(UnitsNo=1,cal!E28,IF(UnitsNo=2,cal!E28*0.334562))","v":{"v":158.25157093403237,"d":"158.3"}},{"$f":"IF(UnitsNo=1,cal!F28,IF(UnitsNo=2,cal!F28*3.412141633,))","v":{"v":832.7999999999998,"d":"833"}},{"$f":"IF(UnitsNo=1,cal!G28,IF(UnitsNo=2,cal!G28/227.124707,))","v":{"v":358.03955288048047,"d":"358.0"}},{"$f":"IF(UnitsNo=1,cal!H28,IF(UnitsNo=2,cal!H28*0.334562))","v":{"v":213.69669959820527,"d":"213.7"}},{"$f":"IF(UnitsNo=1,cal!I28,IF(UnitsNo=2,cal!I28/1.69901082,))","v":{"v":377.6,"d":"378"}},{"$f":"cal!J28","v":{"v":24.420585629524773,"d":"24"}},{"$f":"cal!K28","v":{"v":19.53,"d":"20"}}]
[null,{"$f":"IF(UnitsNo=1,ROUND(cal!B29,0),IF(UnitsNo=2,ROUND(cal!B29*0.393700787,1),))","v":290},{"$f":"IF(UnitsNo=1,cal!C29,IF(UnitsNo=2,cal!C29*3.412141633,))","v":{"v":3871.4000000000005,"d":"3871"}},{"$f":"IF(UnitsNo=1,cal!D29,IF(UnitsNo=2,cal!D29/227.124707,))","v":{"v":332.88048151332765,"d":"332.9"}},{"$f":"IF(UnitsNo=1,cal!E29,IF(UnitsNo=2,cal!E29*0.334562))","v":{"v":187.63385688704525,"d":"187.6"}},{"$f":"IF(UnitsNo=1,cal!F29,IF(UnitsNo=2,cal!F29*3.412141633,))","v":{"v":902.1999999999998,"d":"902"}},{"$f":"IF(UnitsNo=1,cal!G29,IF(UnitsNo=2,cal!G29/227.124707,))","v":{"v":387.8761822871872,"d":"387.9"}},{"$f":"IF(UnitsNo=1,cal!H29,IF(UnitsNo=2,cal!H29*0.334562))","v":{"v":253.30517615240404,"d":"253.3"}},{"$f":"IF(UnitsNo=1,cal!I29,IF(UnitsNo=2,cal!I29/1.69901082,))","v":{"v":415.20000000000005,"d":"415"}},{"$f":"cal!J29","v":{"v":24.834512481107026,"d":"25"}},{"$f":"cal!K29","v":{"v":21.33,"d":"21"}}]
[null,{"$f":"cal!B30","v":"* Schalldruck bei einer angenommenen Raumdämpfung von 8dB (A)"},{"$nulls":8},"v2021-06-16"]
[null,{"$f":"cal!B31","v":"Beachtung:\nDie Temperatur, bei der Wasserdampf in der Umgebungsluft zu kondensieren beginnt, wird als Taupunkttemperatur bezeichnet. Kondensat kann sowohl das Gerät als auch seine Umgebung beschädigen. Das Gerät schaltet sich nicht aus, wenn der Taupunkt erreicht ist. Der Kunde sollte daher die Taupunkttemperatur überprüfen und verhindern, dass die Temperatur unter den Taupunkt fällt. Jaga N.V. kann nicht für Schäden haftbar gemacht werden, die durch Kondensat verursacht werden."}]
[null,{"$f":"cal!B32","v":"JAGA N.V. • Verbindingslaan 16 • 3590 Diepenbeek Belgium • T +32 (0)11 29 41 11 • F +32 (0)11 32 35 78 • info@jaga.be •  www.jaga.com"}]
[null,{"$f":"cal!B33","v":"KBC IBAN: BE16 459 250 300 174 BIC:KREDBEBB • ING IBAN: BE97 335 009 564 549 BIC: BBRUBEBB • RPR Hasselt 45.752 • BE0413.382.425"}]

{"sheet":"cal","index":1,"n_rows":33,"n_cols":79,"rows_kept":33,"hidden":true,"merged":[[1,1,1,8],[3,3,3,6],[3,7,3,8],[4,1,4,2],[4,3,4,6],[4,7,4,8],[5,3,5,6],[5,7,5,8],[6,3,6,6],[6,7,6,8],[9,9,9,10],[10,9,13,10],[16,1,16,10],[17,19,17,20],[18,19,18,20],[18,29,18,30],[18,39,18,40],[18,49,18,50],[18,59,18,60],[19,13,19,22],[19,23,19,32],[19,33,19,42],[19,43,19,52],[19,53,19,62],[19,63,19,72],[29,1,29,10],[30,1,30,10],[31,1,31,10],[32,1,32,10]]}
[{"$nulls":11},"Nederlands"]
[{"$nulls":11},"English"]
[{"$nulls":11},"Deutsch",{"$nulls":3},{"$f":"IF($M$5=1,NL!M9,IF($M$5=2,EN!M9,IF($M$5=3,DE!M9,IF($M$5=4,FR!M9,IF($M$5=5,NR!M9,IF($M$5=6,SP!M9,IF($M$5=7,SW!M9,IF($M$5=8,TS!M9,IF($M$5=9,ExtraTaal1!M9,IF($M$5=10,ExtraTaal2!M9,IF($M$5=11,ExtraTaal3!M9,)))))))))))","v":"Daten kopieren"}]
[{"$nulls":3},"Taal/Language/Sprache/Langue/Språk/Lengua",{"$nulls":3},{"$f":"'Clima Beam'!J4","v":"Deutsch"},{"$nulls":3},"Français",{"$nulls":3},{"$f":"IF($M$5=1,NL!M10,IF($M$5=2,EN!M10,IF($M$5=3,DE!M10,IF($M$5=4,FR!M10,IF($M$5=5,NR!M10,IF($M$5=6,SP!M10,IF($M$5=7,SW!M10,IF($M$5=8,TS!M10,IF($M$5=9,ExtraTaal1!M10,IF($M$5=10,ExtraTaal2!M10,IF($M$5=11,ExtraTaal3!M10,)))))))))))","v":"SI-einheiten"}]
[{"$nulls":3},{"$f":"IF($M$5=1,NL!F5,IF($M$5=2,EN!F5,IF($M$5=3,DE!F5,IF($M$5=4,FR!F5,IF($M$5=5,NR!F5,IF($M$5=6,SP!F5,IF($M$5=7,SW!F5,IF($M$5=8,TS!F5,IF($M$5=9,ExtraTaal1!F5,IF($M$5=10,ExtraTaal2!F5,IF($M$5=11,ExtraTaal3!F5,)))))))))))","v":"Ausführung:"},{"$nulls":3},{"$f":"'Clima Beam'!J5","v":"Einbau"},{"$nulls":3},"Norsk",{"$f":"IF('Clima Beam'!$J$4=cal!$L$1,1,IF('Clima Beam'!$J$4=cal!$L$2,2,IF('Clima Beam'!$J$4=cal!$L$3,3,IF('Clima Beam'!$J$4=cal!$L$4,4,IF('Clima Beam'!$J$4=cal!$L$5,5,IF('Clima Beam'!$J$4=cal!$L$6,6,IF('Clima Beam'!$J$4=cal!$L$7,7,IF('Clima Beam'!$J$4=cal!$L$8,8,IF('Clima Beam'!$J$4=cal!$L$9,9,IF('Clima Beam'!$J$4=cal!$L$10,10,IF('Clima Beam'!$J$4=cal!$L$11,11,)))))))))))","v":3},1,null,{"$f":"IF($M$5=1,NL!M11,IF($M$5=2,EN!M11,IF($M$5=3,DE!M11,IF($M$5=4,FR!M11,IF($M$5=5,NR!M11,IF($M$5=6,SP!M11,IF($M$5=7,SW!M11,IF($M$5=8,TS!M11,IF($M$5=9,ExtraTaal1!M11,IF($M$5=10,ExtraTaal2!M11,IF($M$5=11,ExtraTaal3!M11,)))))))))))","v":"Imperiale-einheiten"}]
[{"$nulls":3},{"$f":"IF($M$5=1,NL!F6,IF($M$5=2,EN!F6,IF($M$5=3,DE!F6,IF($M$5=4,FR!F6,IF($M$5=5,NR!F6,IF($M$5=6,SP!F6,IF($M$5=7,SW!F6,IF($M$5=8,TS!F6,IF($M$5=9,ExtraTaal1!F6,IF($M$5=10,ExtraTaal2!F6,IF($M$5=11,ExtraTaal3!F6,)))))))))))","v":"Höhe [cm]:"},{"$nulls":3},{"$f":"'Clima Beam'!J6","v":"9,6"},{"$nulls":3},"Español"]
[{"$nulls":3},{"$f":"IF($M$5=1,NL!F7,IF($M$5=2,EN!F7,IF($M$5=3,DE!F7,IF($M$5=4,FR!F7,IF($M$5=5,NR!F7,IF($M$5=6,SP!F7,IF($M$5=7,SW!F7,IF($M$5=8,TS!F7,IF($M$5=9,ExtraTaal1!F7,IF($M$5=10,ExtraTaal2!F7,IF($M$5=11,ExtraTaal3!F7,)))))))))))&\":\"","v":"Drehzahlstufe:"},{"$nulls":3},{"$f":"'Clima Beam'!J7","v":"Comfort"},null,{"$f":"IF(cal!H7=cal!O13,cal!P13,cal!P14)","v":"6V"},null,"Svenska"]
[{"$nulls":11},"Čeština"]
[null,{"$f":"IF($M$5=1,NL!B9,IF($M$5=2,EN!B9,IF($M$5=3,DE!B9,IF($M$5=4,FR!B9,IF($M$5=5,NR!B9,IF($M$5=6,SP!B9,IF($M$5=7,SW!B9,IF($M$5=8,TS!B9,IF($M$5=9,ExtraTaal1!B9,IF($M$5=10,ExtraTaal2!B9,IF($M$5=11,ExtraTaal3!B9,)))))))))))","v":"Temperaturen"},{"$nulls":9},"ExtraTaal1"]
[null,{"$f":"IF($M$5=1,NL!B10,IF($M$5=2,EN!B10,IF($M$5=3,DE!B10,IF($M$5=4,FR!B10,IF($M$5=5,NR!B10,IF($M$5=6,SP!B10,IF($M$5=7,SW!B10,IF($M$5=8,TS!B10,IF($M$5=9,ExtraTaal1!B10,IF($M$5=10,ExtraTaal2!B10,IF($M$5=11,ExtraTaal3!B10,)))))))))))","v":"Heizen:"},{"$nulls":3},{"$f":"IF($M$5=1,NL!F10,IF($M$5=2,EN!F10,IF($M$5=3,DE!F10,IF($M$5=4,FR!F10,IF($M$5=5,NR!F10,IF($M$5=6,SP!F10,IF($M$5=7,SW!F10,IF($M$5=8,TS!F10,IF($M$5=9,ExtraTaal1!F10,IF($M$5=10,ExtraTaal2!F10,IF($M$5=11,ExtraTaal3!F10,)))))))))))","v":"Kühlen:"},{"$nulls":3},{"$f":"IF($M$5=1,NL!J10,IF($M$5=2,EN!J10,IF($M$5=3,DE!J10,IF($M$5=4,FR!J10,IF($M$5=5,NR!J10,IF($M$5=6,SP!J10,IF($M$5=7,SW!J10,IF($M$5=8,TS!J10,IF($M$5=9,ExtraTaal1!J10,IF($M$5=10,ExtraTaal2!J10,IF($M$5=11,ExtraTaal3!J10,)))))))))))","v":"Einheiten"},{"$f":"IF($M$5=1,NL!K10,IF($M$5=2,EN!K10,IF($M$5=3,DE!K10,IF($M$5=4,FR!K10,IF($M$5=5,NR!K10,IF($M$5=6,SP!K10,IF($M$5=7,SW!K10,IF($M$5=8,TS!K10,IF($M$5=9,ExtraTaal1!K10,IF($M$5=10,ExtraTaal2!K10,IF($M$5=11,ExtraTaal3!K10,)))))))))))","v":0},"ExtraTaal2",{"$nulls":4},"Heating",null,"Cooling"]
[null,{"$f":"IF($M$5=1,NL!B11,IF($M$5=2,EN!B11,IF($M$5=3,DE!B11,IF($M$5=4,FR!B11,IF($M$5=5,NR!B11,IF($M$5=6,SP!B11,IF($M$5=7,SW!B11,IF($M$5=8,TS!B11,IF($M$5=9,ExtraTaal1!B11,IF($M$5=10,ExtraTaal2!B11,IF($M$5=11,ExtraTaal3!B11,)))))))))))","v":"Vorlauftemp."},null,{"$f":"'Clima Beam'!D11","v":75},{"$f":"IF(UnitsNo=1,\"°C\",IF(UnitsNo=2,\"°F\",))","v":"°C"},{"$f":"IF($M$5=1,NL!F11,IF($M$5=2,EN!F11,IF($M$5=3,DE!F11,IF($M$5=4,FR!F11,IF($M$5=5,NR!F11,IF($M$5=6,SP!F11,IF($M$5=7,SW!F11,IF($M$5=8,TS!F11,IF($M$5=9,ExtraTaal1!F11,IF($M$5=10,ExtraTaal2!F11,IF($M$5=11,ExtraTaal3!F11,)))))))))))","v":"Vorlauftemp."},null,{"$f":"'Clima Beam'!H11","v":15.999999999999998},{"$f":"E11","v":"°C"},null,null,"ExtraTaal3",{"$nulls":4},{"$f":"IF(UnitsNo=1,D11,IF(UnitsNo=2,(D11-32)/1.8,))","v":75},null,{"$f":"IF(UnitsNo=1,H11,IF(UnitsNo=2,(H11-32)/1.8,))","v":15.999999999999998},{"$nulls":45},"V Comfort [m³/h]"]
[null,{"$f":"IF($M$5=1,NL!B12,IF($M$5=2,EN!B12,IF($M$5=3,DE!B12,IF($M$5=4,FR!B12,IF($M$5=5,NR!B12,IF($M$5=6,SP!B12,IF($M$5=7,SW!B12,IF($M$5=8,TS!B12,IF($M$5=9,ExtraTaal1!B12,IF($M$5=10,ExtraTaal2!B12,IF($M$5=11,ExtraTaal3!B12,)))))))))))","v":"Rücklauftemp."},null,{"$f":"'Clima Beam'!D12","v":65},{"$f":"E11","v":"°C"},{"$f":"IF($M$5=1,NL!F12,IF($M$5=2,EN!F12,IF($M$5=3,DE!F12,IF($M$5=4,FR!F12,IF($M$5=5,NR!F12,IF($M$5=6,SP!F12,IF($M$5=7,SW!F12,IF($M$5=8,TS!F12,IF($M$5=9,ExtraTaal1!F12,IF($M$5=10,ExtraTaal2!F12,IF($M$5=11,ExtraTaal3!F12,)))))))))))","v":"Rücklauftemp."},null,{"$f":"'Clima Beam'!H12","v":18.000000000000004},{"$f":"E11","v":"°C"},null,null,"Hilfsvariablen:",{"$nulls":4},{"$f":"IF(UnitsNo=1,D12,IF(UnitsNo=2,(D12-32)/1.8,))","v":65},null,{"$f":"IF(UnitsNo=1,H12,IF(UnitsNo=2,(H12-32)/1.8,))","v":18.000000000000004},{"$nulls":45},"V Boost[m³/h]"]
[null,{"$f":"IF($M$5=1,NL!B13,IF($M$5=2,EN!B13,IF($M$5=3,DE!B13,IF($M$5=4,FR!B13,IF($M$5=5,NR!B13,IF($M$5=6,SP!B13,IF($M$5=7,SW!B13,IF($M$5=8,TS!B13,IF($M$5=9,ExtraTaal1!B13,IF($M$5=10,ExtraTaal2!B13,IF($M$5=11,ExtraTaal3!B13,)))))))))))","v":"Raumtemp."},null,{"$f":"'Clima Beam'!D13","v":20},{"$f":"E11","v":"°C"},{"$f":"IF($M$5=1,NL!F13,IF($M$5=2,EN!F13,IF($M$5=3,DE!F13,IF($M$5=4,FR!F13,IF($M$5=5,NR!F13,IF($M$5=6,SP!F13,IF($M$5=7,SW!F13,IF($M$5=8,TS!F13,IF($M$5=9,ExtraTaal1!F13,IF($M$5=10,ExtraTaal2!F13,IF($M$5=11,ExtraTaal3!F13,)))))))))))","v":"Raumtemp."},null,{"$f":"'Clima Beam'!H13","v":26.999999999999996},{"$f":"E11","v":"°C"},null,null,{"$f":"\"9,6\"","v":"9,6"},{"$f":"IF($M$5=1,U13,IF($M$5=2,V13,IF($M$5=3,W13,IF($M$5=4,X13,IF($M$5=5,Y13,IF($M$5=6,Z13,IF($M$5=7,Y13,IF($M$5=8,AA13,IF($M$5=9,AA11,IF($M$5=10,AA9,IF($M$5=11,AA7,)))))))))))","v":"Einbau"},null,"Comfort","6V",{"$f":"IF(UnitsNo=1,D13,IF(UnitsNo=2,(D13-32)/1.8,))","v":20},null,{"$f":"IF(UnitsNo=1,H13,IF(UnitsNo=2,(H13-32)/1.8,))","v":26.999999999999996},null,{"$f":"NL!M5","v":"Inbouw"},{"$f":"EN!M5","v":"Built-in"},{"$f":"DE!M5","v":"Einbau"},{"$f":"FR!M5","v":"Intégré"},{"$f":"NR!M5","v":"Innebygd"},{"$f":"SP!$M$5","v":"Empotrado"},{"$f":"TS!$M$5","v":"Vestavba"},{"$f":"IF($M$5=1,U13,IF($M$5=2,V13,IF($M$5=3,W13,IF($M$5=4,X13,IF($M$5=5,Y13,IF($M$5=6,Z13,IF($M$5=7,Y13,IF($M$5=8,AA13,IF($M$5=9,AA11,IF($M$5=10,AA9,IF($M$5=11,AA7,)))))))))))","v":"Einbau"},{"$nulls":36},"Schalldruckpegel Comfort [dB(A)]"]
[{"$nulls":11},{"$f":"\"15,3\"","v":"15,3"},{"$f":"IF($M$5=1,U14,IF($M$5=2,V14,IF($M$5=3,W14,IF($M$5=4,X14,IF($M$5=5,Y14,IF($M$5=6,Z14,IF($M$5=7,Y14,IF($M$5=8,AA14,IF($M$5=9,AA12,IF($M$5=10,AA10,IF($M$5=11,AA8,)))))))))))","v":"mit Verkleidung"},null,"Boost","9V",{"$nulls":4},{"$f":"NL!M6","v":"Met omkasting"},{"$f":"EN!M6","v":"With casing"},{"$f":"DE!M6","v":"mit Verkleidung"},{"$f":"FR!M6","v":"Avec caisson"},{"$f":"NR!M6","v":"Med hus"},{"$f":"SP!$M$6","v":"Con Carcasa"},{"$f":"TS!$M$6","v":"s pouzdrem"},{"$f":"IF($M$5=1,U14,IF($M$5=2,V14,IF($M$5=3,W14,IF($M$5=4,X14,IF($M$5=5,Y14,IF($M$5=6,Z14,IF($M$5=7,Y14,IF($M$5=8,AA14,IF($M$5=9,AA12,IF($M$5=10,AA10,IF($M$5=11,AA8,)))))))))))","v":"mit Verkleidung"},{"$nulls":36},"Schalldruckpegel Boost [dB(A)]"]
[{"$nulls":11},{"$f":"\"25,3\"","v":"25,3"},{"$f":"IF($H$5=U13,33,IF($H$5=V13,33,IF($H$5=W13,33,IF($H$5=X13,33,IF($H$5=Y13,33,IF($H$5=Z13,33,IF($H$5=AA13,33,IF($H$5=AA11,33,IF($H$5=AA9,33,IF($H$5=AA7,33,IF($H$5=U14,36,IF($H$5=V14,36,IF($H$5=W14,36,IF($H$5=X14,36,IF($H$5=Y14,36,IF($H$5=Z14,36,IF($H$5=AA14,36,IF($H$5=AA12,36,IF($H$5=AA10,36,IF($H$5=AA8,36,))))))))))))))))))))","v":33},{"$nulls":51},"Comfort elektr. Leistungsaufnahme [W]"]
[null,{"$f":"IF($M$5=1,NL!B16,IF($M$5=2,EN!B16,IF($M$5=3,DE!B16,IF($M$5=4,FR!B16,IF($M$5=5,NR!B16,IF($M$5=6,SP!B16,IF($M$5=7,SW!B16,IF($M$5=8,TS!B16,IF($M$5=9,ExtraTaal1!B16,IF($M$5=10,ExtraTaal2!B16,IF($M$5=11,ExtraTaal3!B16,)))))))))))","v":"Länge [cm]"},{"$f":"IF($M$5=1,NL!C16,IF($M$5=2,EN!C16,IF($M$5=3,DE!C16,IF($M$5=4,FR!C16,IF($M$5=5,NR!C16,IF($M$5=6,SP!C16,IF($M$5=7,SW!C16,IF($M$5=8,TS!C16,IF($M$5=9,ExtraTaal1!C16,IF($M$5=10,ExtraTaal2!C16,IF($M$5=11,ExtraTaal3!C16,)))))))))))","v":"Wärmeleistung in [W]"},{"$f":"IF($M$5=1,NL!D16,IF($M$5=2,EN!D16,IF($M$5=3,DE!D16,IF($M$5=4,FR!D16,IF($M$5=5,NR!D16,IF($M$5=6,SP!D16,IF($M$5=7,SW!D16,IF($M$5=8,TS!D16,IF($M$5=9,ExtraTaal1!D16,IF($M$5=10,ExtraTaal2!D16,IF($M$5=11,ExtraTaal3!D16,)))))))))))","v":"Heizmittelstrom in [l/h]"},{"$f":"IF($M$5=1,NL!E16,IF($M$5=2,EN!E16,IF($M$5=3,DE!E16,IF($M$5=4,FR!E16,IF($M$5=5,NR!E16,IF($M$5=6,SP!E16,IF($M$5=7,SW!E16,IF($M$5=8,TS!E16,IF($M$5=9,ExtraTaal1!E16,IF($M$5=10,ExtraTaal2!E16,IF($M$5=11,ExtraTaal3!E16,)))))))))))","v":"zug. wassers. Druckverlust [kPa]"},{"$f":"IF($M$5=1,NL!F16,IF($M$5=2,EN!F16,IF($M$5=3,DE!F16,IF($M$5=4,FR!F16,IF($M$5=5,NR!F16,IF($M$5=6,SP!F16,IF($M$5=7,SW!F16,IF($M$5=8,TS!F16,IF($M$5=9,ExtraTaal1!F16,IF($M$5=10,ExtraTaal2!F16,IF($M$5=11,ExtraTaal3!F16,)))))))))))","v":"Sens. kälteleistung in [W]"},{"$f":"IF($M$5=1,NL!G16,IF($M$5=2,EN!G16,IF($M$5=3,DE!G16,IF($M$5=4,FR!G16,IF($M$5=5,NR!G16,IF($M$5=6,SP!G16,IF($M$5=7,SW!G16,IF($M$5=8,TS!G16,IF($M$5=9,ExtraTaal1!G16,IF($M$5=10,ExtraTaal2!G16,IF($M$5=11,ExtraTaal3!G16,)))))))))))","v":"Kühlmittelstrom in [l/h]"},{"$f":"IF($M$5=1,NL!H16,IF($M$5=2,EN!H16,IF($M$5=3,DE!H16,IF($M$5=4,FR!H16,IF($M$5=5,NR!H16,IF($M$5=6,SP!H16,IF($M$5=7,SW!H16,IF($M$5=8,TS!H16,IF($M$5=9,ExtraTaal1!H16,IF($M$5=10,ExtraTaal2!H16,IF($M$5=11,ExtraTaal3!H16,)))))))))))","v":"zug. wassers. Druckverlust [kPa]"},{"$f":"IF($M$5=1,NL!I16,IF($M$5=2,EN!I16,IF($M$5=3,DE!I16,IF($M$5=4,FR!I16,IF($M$5=5,NR!I16,IF($M$5=6,SP!I16,IF($M$5=7,SW!I16,IF($M$5=8,TS!I16,IF($M$5=9,ExtraTaal1!I16,IF($M$5=10,ExtraTaal2!I16,IF($M$5=11,ExtraTaal3!I16,)))))))))))","v":"Luftvolumenstrom [m³/h]"},{"$f":"IF($M$5=1,NL!J16,IF($M$5=2,EN!J16,IF($M$5=3,DE!J16,IF($M$5=4,FR!J16,IF($M$5=5,NR!J16,IF($M$5=6,SP!J16,IF($M$5=7,SW!J16,IF($M$5=8,TS!J16,IF($M$5=9,ExtraTaal1!J16,IF($M$5=10,ExtraTaal2!J16,IF($M$5=11,ExtraTaal3!J16,)))))))))))","v":"Schalldruckpegel* [dB(A)]"},{"$f":"IF($M$5=1,NL!K16,IF($M$5=2,EN!K16,IF($M$5=3,DE!K16,IF($M$5=4,FR!K16,IF($M$5=5,NR!K16,IF($M$5=6,SP!K16,IF($M$5=7,SW!K16,IF($M$5=8,TS!K16,IF($M$5=9,ExtraTaal1!K16,IF($M$5=10,ExtraTaal2!K16,IF($M$5=11,ExtraTaal3!K16,)))))))))))","v":"Elektr. leistung [W]"},{"$f":"IF($H$6=\"15,3\",\"20\",IF($H$6=\"25,3\",\"21\",\"8\"))","v":"8"},{"$nulls":43},{"$f":"0.7-0.42","v":{"v":0.27999999999999997,"d":"0.280"}},{"$nulls":8},"Boost elektr. Leistungsaufnahme [W]"]
[null,{"$f":"IF($M$5=1,NL!B17,IF($M$5=2,EN!B17,IF($M$5=3,DE!B17,IF($M$5=4,FR!B17,IF($M$5=5,NR!B17,IF($M$5=6,SP!B17,IF($M$5=7,SW!B17,IF($M$5=8,TS!B17,IF($M$5=9,ExtraTaal1!B17,IF($M$5=10,ExtraTaal2!B17,IF($M$5=11,ExtraTaal3!B17,)))))))))))","v":"Clima Beam -  H9,6 B33 Typ 8"},{"$f":"IF($M$5=1,NL!C17,IF($M$5=2,EN!C17,IF($M$5=3,DE!C17,IF($M$5=4,FR!C17,IF($M$5=5,NR!C17,IF($M$5=6,SP!C17,IF($M$5=7,SW!C17,IF($M$5=8,TS!C17,IF($M$5=9,ExtraTaal1!C17,IF($M$5=10,ExtraTaal2!C17,IF($M$5=11,ExtraTaal3!C17,)))))))))))","v":0},{"$f":"IF($M$5=1,NL!D17,IF($M$5=2,EN!D17,IF($M$5=3,DE!D17,IF($M$5=4,FR!D17,IF($M$5=5,NR!D17,IF($M$5=6,SP!D17,IF($M$5=7,SW!D17,IF($M$5=8,TS!D17,IF($M$5=9,ExtraTaal1!D17,IF($M$5=10,ExtraTaal2!D17,IF($M$5=11,ExtraTaal3!D17,)))))))))))","v":0},{"$f":"IF($M$5=1,NL!E17,IF($M$5=2,EN!E17,IF($M$5=3,DE!E17,IF($M$5=4,FR!E17,IF($M$5=5,NR!E17,IF($M$5=6,SP!E17,IF($M$5=7,SW!E17,IF($M$5=8,TS!E17,IF($M$5=9,ExtraTaal1!E17,IF($M$5=10,ExtraTaal2!E17,IF($M$5=11,ExtraTaal3!E17,)))))))))))","v":0},{"$f":"IF($M$5=1,NL!F17,IF($M$5=2,EN!F17,IF($M$5=3,DE!F17,IF($M$5=4,FR!F17,IF($M$5=5,NR!F17,IF($M$5=6,SP!F17,IF($M$5=7,SW!F17,IF($M$5=8,TS!F17,IF($M$5=9,ExtraTaal1!F17,IF($M$5=10,ExtraTaal2!F17,IF($M$5=11,ExtraTaal3!F17,)))))))))))","v":0},{"$f":"IF($M$5=1,NL!G17,IF($M$5=2,EN!G17,IF($M$5=3,DE!G17,IF($M$5=4,FR!G17,IF($M$5=5,NR!G17,IF($M$5=6,SP!G17,IF($M$5=7,SW!G17,IF($M$5=8,TS!G17,IF($M$5=9,ExtraTaal1!G17,IF($M$5=10,ExtraTaal2!G17,IF($M$5=11,ExtraTaal3!G17,)))))))))))","v":0},{"$f":"IF($M$5=1,NL!H17,IF($M$5=2,EN!H17,IF($M$5=3,DE!H17,IF($M$5=4,FR!H17,IF($M$5=5,NR!H17,IF($M$5=6,SP!H17,IF($M$5=7,SW!H17,IF($M$5=8,TS!H17,IF($M$5=9,ExtraTaal1!H17,IF($M$5=10,ExtraTaal2!H17,IF($M$5=11,ExtraTaal3!H17,)))))))))))","v":0},{"$f":"IF($M$5=1,NL!I17,IF($M$5=2,EN!I17,IF($M$5=3,DE!I17,IF($M$5=4,FR!I17,IF($M$5=5,NR!I17,IF($M$5=6,SP!I17,IF($M$5=7,SW!I17,IF($M$5=8,TS!I17,IF($M$5=9,ExtraTaal1!I17,IF($M$5=10,ExtraTaal2!I17,IF($M$5=11,ExtraTaal3!I17,)))))))))))","v":0},{"$f":"IF($M$5=1,NL!J17,IF($M$5=2,EN!J17,IF($M$5=3,DE!J17,IF($M$5=4,FR!J17,IF($M$5=5,NR!J17,IF($M$5=6,SP!J17,IF($M$5=7,SW!J17,IF($M$5=8,TS!J17,IF($M$5=9,ExtraTaal1!J17,IF($M$5=10,ExtraTaal2!J17,IF($M$5=11,ExtraTaal3!J17,)))))))))))","v":0},{"$f":"IF($M$5=1,NL!K17,IF($M$5=2,EN!K17,IF($M$5=3,DE!K17,IF($M$5=4,FR!K17,IF($M$5=5,NR!K17,IF($M$5=6,SP!K17,IF($M$5=7,SW!K17,IF($M$5=8,TS!K17,IF($M$5=9,ExtraTaal1!K17,IF($M$5=10,ExtraTaal2!K17,IF($M$5=11,ExtraTaal3!K17,)))))))))))","v":0},{"$nulls":10},"K1","n","t","K2"]
[null,70,{"$f":"VLOOKUP($B18,$M$22:$BU$33,3+$L$18+$M$18+$P$18,TRUE)*((($Q$11-$Q$12)/LN(($Q$11-$Q$13)/($Q$12-$Q$13)))/((75-65)/LN((75-20)/(65-20))))","v":{"v":595.6000000000001,"d":"596"}},{"$f":"C18/(($Q$11-$Q$12)*1.163)","v":{"v":51.21238177128118,"d":"51.2"}},{"$f":"$V$18*(D18^$W$18)*((($B18-14.4)*$X$18)/1000)+($Y$18*D18*D18)","v":{"v":3.883766623303083,"d":"3.9"}},{"$f":"VLOOKUP($B18,$M$22:$BU$33,1+$L$18+$M$18+$P$18,TRUE)*((($S$11-$S$12)/LN(($S$11-$S$13)/($S$12-$S$13)))/((16-18)/LN((16-27)/(18-27))))","v":{"v":138.79999999999998,"d":"139"}},{"$f":"F18/(($S$12-$S$11)*1.163)","v":{"v":59.67325881341342,"d":"59.7"}},{"$f":"$V$18*(G18^$W$18)*((($B18-14.4)*$X$18)/1000)+($Y$18*G18*G18)","v":{"v":5.262792155102422,"d":"5.3"}},{"$f":"IF(VLOOKUP($B18,$M$22:$BU$33,5+$L$18+$M$18+$P$18,TRUE)=0,\"///////////\",VLOOKUP($B18,$M$22:$BU$33,5+$L$18+$M$18+$P$18,TRUE))","v":{"v":56.800000000000004,"d":"57"}},{"$f":"IF(VLOOKUP($B18,$M$22:$BU$33,7+$L$18+$M$18+$P$18,TRUE)=0,\"////////////\",VLOOKUP($B18,$M$22:$BU$33,7+$L$18+$M$18+$P$18,TRUE))","v":16},{"$f":"IF(VLOOKUP($B18,$M$22:$BU$33,9+$L$18+$M$18+$P$18,TRUE)=0,\"///////////\",VLOOKUP($B18,$M$22:$BU$33,9+$L$18+$M$18+$P$18,TRUE))","v":{"v":4.5,"d":"5"}},{"$f":"IF(L16=\"20\",1,IF(L16=\"21\",11,41))","v":41},{"$f":"IF(L16=\"8\",IF(M15=33,0,IF(M15=36,10,)),IF(M15=33,0,IF(M15=36,20,)))","v":0},null,null,{"$f":"IF(J7=\"6V\",0,1)","v":0},{"$nulls":3},"Coëfficienten dP",null,{"$f":"IF($L$16=\"20\",V$19,IF($L$16=\"21\",AF$19,BJ$19))","v":0.000937},{"$f":"IF($L$16=\"20\",W$19,IF($L$16=\"21\",AG$19,BK$19))","v":1.789},4,1.39E-3]
[null,90,{"$f":"VLOOKUP($B19,$M$22:$BU$33,3+$L$18+$M$18+$P$18,TRUE)*((($Q$11-$Q$12)/LN(($Q$11-$Q$13)/($Q$12-$Q$13)))/((75-65)/LN((75-20)/(65-20))))","v":{"v":893.4000000000001,"d":"893"}},{"$f":"C19/(($Q$11-$Q$12)*1.163)","v":{"v":76.81857265692176,"d":"76.8"}},{"v":8.87151071497894,"d":"8.9"},{"$f":"VLOOKUP($B19,$M$22:$BU$33,1+$L$18+$M$18+$P$18,TRUE)*((($S$11-$S$12)/LN(($S$11-$S$13)/($S$12-$S$13)))/((16-18)/LN((16-27)/(18-27))))","v":{"v":208.19999999999996,"d":"208"}},{"v":89.50988822012012,"d":"89.5"},{"v":12.016173050742543,"d":"12.0"},{"$f":"IF(VLOOKUP($B19,$M$22:$BU$33,5+$L$18+$M$18+$P$18,TRUE)=0,\"///////////\",VLOOKUP($B19,$M$22:$BU$33,5+$L$18+$M$18+$P$18,TRUE))","v":{"v":94.4,"d":"94"}},{"$f":"IF(VLOOKUP($B19,$M$22:$BU$33,7+$L$18+$M$18+$P$18,TRUE)=0,\"///////////\",VLOOKUP($B19,$M$22:$BU$33,7+$L$18+$M$18+$P$18,TRUE))","v":18},{"$f":"IF(VLOOKUP($B19,$M$22:$BU$33,9+$L$18+$M$18+$P$18,TRUE)=0,\"///////////\",VLOOKUP($B19,$M$22:$BU$33,9+$L$18+$M$18+$P$18,TRUE))","v":{"v":6.3,"d":"6"}},{"$nulls":8},"Coëfficienten dP",null,0.000128,1.722,2,0.00037,{"$nulls":4},"Coëfficienten dP",null,0.000128,1.722,4,5.44E-4,{"$nulls":4},"Coëfficienten dP",{"$nulls":9},"Coëfficienten dP",{"$nulls":9},"Coëfficienten dP",null,0.000937,1.789,4,1.39E-3]
[null,100,{"$f":"VLOOKUP($B20,$M$22:$BU$33,3+$L$18+$M$18+$P$18,TRUE)*((($Q$11-$Q$12)/LN(($Q$11-$Q$13)/($Q$12-$Q$13)))/((75-65)/LN((75-20)/(65-20))))","v":{"v":1042.3000000000002,"d":"1042"}},{"$f":"C20/(($Q$11-$Q$12)*1.163)","v":{"v":89.62166809974205,"d":"89.6"}},{"v":12.162562615676404,"d":"12.2"},{"$f":"VLOOKUP($B20,$M$22:$BU$33,1+$L$18+$M$18+$P$18,TRUE)*((($S$11-$S$12)/LN(($S$11-$S$13)/($S$12-$S$13)))/((16-18)/LN((16-27)/(18-27))))","v":{"v":242.89999999999995,"d":"243"}},{"v":104.42820292347346,"d":"104.4"},{"v":16.47031068421827,"d":"16.5"},{"$f":"IF(VLOOKUP($B20,$M$22:$BU$33,5+$L$18+$M$18+$P$18,TRUE)=0,\"///////////\",VLOOKUP($B20,$M$22:$BU$33,5+$L$18+$M$18+$P$18,TRUE))","v":{"v":113.60000000000001,"d":"114"}},{"$f":"IF(VLOOKUP($B20,$M$22:$BU$33,7+$L$18+$M$18+$P$18,TRUE)=0,\"///////////\",VLOOKUP($B20,$M$22:$BU$33,7+$L$18+$M$18+$P$18,TRUE))","v":19},{"$f":"IF(VLOOKUP($B20,$M$22:$BU$33,9+$L$18+$M$18+$P$18,TRUE)=0,\"///////////\",VLOOKUP($B20,$M$22:$BU$33,9+$L$18+$M$18+$P$18,TRUE))","v":{"v":7.2,"d":"7"}},null,null,"Typ 20 Einbau",{"$nulls":9},"Typ 21 Einbau",{"$nulls":9},"Typ 20 mit Verkleidung",{"$nulls":9},"Typ 21 mit Verkleidung",{"$nulls":9},"Typ 08 Einbau",{"$nulls":9},"Typ 08 mit Verkleidung"]
[null,120,{"v":1340.1000000000001,"d":"1340"},{"v":115.22785898538264,"d":"115.2"},{"v":20.385813322958697,"d":"20.4"},{"v":312.29999999999995,"d":"312"},{"v":134.26483233018018,"d":"134.3"},{"v":27.594987411547475,"d":"27.6"},{"v":150.4,"d":"150"},20,{"v":8.73,"d":"9"},null,null," K Comfort Stufe  [W]","K Boost Stufe  [W]","H Comfort Stufe  [W]"," H Boost Stufe  [W]","V Comfort [m³/h]","V Boost[m³/h]","Schalldruckpegel Comfort [dB(A)]","Schalldruckpegel Boost [dB(A)]","Comfort elektr. Leistungsaufnahme [W]","Boost elektr. Leistungsaufnahme [W]","Comfort Stufe  [W]","Boost Stufe  [W]","Comfort Stufe  [W]","Boost Stufe  [W]","V Comfort [m³/h]","V Boost[m³/h]","Schalldruckpegel Comfort [dB(A)]","Schalldruckpegel Boost [dB(A)]","Comfort elektr. Leistungsaufnahme [W]","Boost elektr. Leistungsaufnahme [W]","Comfort Stufe  [W]","Boost Stufe  [W]","Comfort Stufe  [W]","Boost Stufe  [W]","V Comfort [m³/h]","V Boost[m³/h]","Schalldruckpegel Comfort [dB(A)]","Schalldruckpegel Boost [dB(A)]","Comfort elektr. Leistungsaufnahme [W]","Boost elektr. Leistungsaufnahme [W]","Comfort Stufe  [W]","Boost Stufe  [W]","Comfort Stufe  [W]","Boost Stufe  [W]","V Comfort [m³/h]","V Boost[m³/h]","Schalldruckpegel Comfort [dB(A)]","Schalldruckpegel Boost [dB(A)]","Comfort elektr. Leistungsaufnahme [W]","Boost elektr. Leistungsaufnahme [W]","Comfort Stufe  [W]","Boost Stufe  [W]","Comfort Stufe  [W]","Boost Stufe  [W]","V Comfort [m³/h]","V Boost[m³/h]","Schalldruckpegel Comfort [dB(A)]","Schalldruckpegel Boost [dB(A)]","Comfort elektr. Leistungsaufnahme [W]","Boost elektr. Leistungsaufnahme [W]","Comfort Stufe  [W]","Boost Stufe  [W]","Comfort Stufe  [W]","Boost Stufe  [W]","V Comfort [m³/h]","V Boost[m³/h]","Schalldruckpegel Comfort [dB(A)]","Schalldruckpegel Boost [dB(A)]","Comfort elektr. Leistungsaufnahme [W]","Boost elektr. Leistungsaufnahme [W]"]
[null,150,{"v":1786.8000000000002,"d":"1787"},{"v":153.63714531384352,"d":"153.6"},{"v":36.95676247130579,"d":"37.0"},{"v":416.3999999999999,"d":"416"},{"v":179.01977644024024,"d":"179.0"},{"v":49.998120352930925,"d":"50.0"},{"v":188.8,"d":"189"},{"v":21.41028567288496,"d":"21"},{"v":10.53,"d":"11"},null,70,{"$f":"(N$25/($M$25-30))*($M22-30)","v":{"v":188.4,"d":"188"}},{"v":235.60000000000002,"d":"236"},{"v":874.4,"d":"874"},{"v":1267.6,"d":"1268"},71,112,17,30,5,7,{"$f":"(X$25/($M$25-30))*($M22-30)","v":{"v":285.20000000000005,"d":"285"}},{"v":348.4,"d":"348"},{"v":944.8000000000001,"d":"945"},{"v":1492.4,"d":"1492"},75,159,17,27,4,5,{"$f":"N22/1.111","v":{"v":169.57695769576958,"d":"170"}},{"$f":"O22/1.111","v":{"v":212.06120612061207,"d":"212"}},{"$f":"P22/1.111","v":{"v":787.038703870387,"d":"787"}},{"$f":"Q22/1.111","v":{"v":1140.954095409541,"d":"1141"}},55,85,17,30,5,7,{"$f":"X22/1.111","v":{"v":256.70567056705676,"d":"257"}},{"$f":"Y22/1.111","v":{"v":313.5913591359136,"d":"314"}},{"$f":"Z22/1.111","v":{"v":850.4050405040505,"d":"850"}},{"$f":"AA22/1.111","v":{"v":1343.2943294329434,"d":"1343"}},57,119,17,27,4,5,{"$f":"(BB$25/($M$25-30))*($M22-30)","v":{"v":138.8,"d":"139"}},{"v":185.2,"d":"185"},{"v":595.6000000000001,"d":"596"},{"v":802.4000000000001,"d":"802"},{"$f":"R22*0.8","v":{"v":56.800000000000004,"d":"57"}},{"$f":"S22*0.8","v":{"v":89.60000000000001,"d":"90"}},{"$f":"T22-1","v":16},{"$f":"U22-1","v":29},{"$f":"V22*0.9","v":4.5},{"$f":"W22*0.9","v":6.3},{"$f":"BB22/1.111","v":{"v":124.93249324932495,"d":"125"}},{"$f":"BC22/1.111","v":{"v":166.6966696669667,"d":"167"}},{"$f":"BD22/1.111","v":{"v":536.0936093609362,"d":"536"}},{"v":722.2322232223223,"d":"722"},{"$f":"BF22/1.315789","v":{"v":43.1680155404856,"d":"43"}},{"$f":"BG22/1.338","v":{"v":66.96562032884903,"d":"67"}},{"$f":"BH22","v":16},{"$f":"BI22","v":29},{"$f":"BJ22","v":{"v":4.5,"d":"5"}},{"$f":"BK22","v":{"v":6.3,"d":"6"}},"T20 C","T20 B","T21 C","T21 B","T08 C","T08 B"]
[null,170,{"v":2084.6000000000004,"d":"2085"},{"v":179.2433361994841,"d":"179.2"},{"v":50.92745668932959,"d":"50.9"},{"v":485.7999999999999,"d":"486"},{"v":208.85640584694693,"d":"208.9"},{"v":68.87488924006986,"d":"68.9"},{"v":226.4,"d":"226"},{"v":22.20209813336121,"d":"22"},{"v":12.33,"d":"12"},null,90,{"v":282.6,"d":"283"},{"v":353.40000000000003,"d":"353"},{"v":1311.6,"d":"1312"},{"v":1901.3999999999999,"d":"1901"},118,197,19,32,7,10,{"v":427.80000000000007,"d":"428"},{"v":522.5999999999999,"d":"523"},{"v":1417.2,"d":"1417"},{"v":2238.6000000000004,"d":"2239"},100,212,18,29,5,{"v":6.5,"d":"7"},{"v":254.3654365436544,"d":"254"},{"v":318.0918091809181,"d":"318"},{"v":1180.5580558055806,"d":"1181"},{"v":1711.4311431143112,"d":"1711"},92,142,19,32,{"$f":"(0.0805*$M23)-0.2343","v":{"v":7.0107,"d":"7"}},10,{"v":385.0585058505851,"d":"385"},{"v":470.3870387038703,"d":"470"},{"v":1275.6075607560756,"d":"1276"},{"v":2014.9414941494153,"d":"2015"},76,158,18,29,5,{"v":6.5,"d":"7"},{"v":208.20000000000002,"d":"208"},{"v":277.8,"d":"278"},{"v":893.4000000000001,"d":"893"},{"v":1203.6000000000001,"d":"1204"},{"$f":"R23*0.8","v":{"v":94.4,"d":"94"}},{"$f":"S23*0.8","v":{"v":157.60000000000002,"d":"158"}},{"$f":"T23-1","v":18},31,{"$f":"V23*0.9","v":6.3},{"v":9,"d":"9.0"},{"v":187.3987398739874,"d":"187"},{"v":250.04500450045006,"d":"250"},{"v":804.1404140414043,"d":"804"},{"v":1083.3483348334835,"d":"1083"},{"$f":"BF23/1.315789","v":{"v":71.7440258278493,"d":"72"}},{"$f":"BG23/1.338","v":{"v":117.78774289985053,"d":"118"}},{"$f":"BH23","v":18},31,{"$f":"BJ23","v":{"v":6.3,"d":"6"}},{"$f":"BK23","v":9},{"$f":"R23/R$22","v":{"v":1.6619718309859155,"d":"1.661972"}},{"$f":"S23/S$22","v":{"v":1.7589285714285714,"d":"1.758929"}},{"$f":"AB23/AB$22","v":{"v":1.3333333333333333,"d":"1.333333"}},{"$f":"AC23/AC$22","v":{"v":1.3333333333333333,"d":"1.333333"}},{"$f":"BV23+((BV23-BX23)*0.85)","v":{"v":1.9413145539906105,"d":"1.941315"}},{"$f":"BW23+((BW23-BY23)*0.85)","v":{"v":2.120684523809524,"d":"2.120685"}}]
[null,190,{"v":2382.4000000000005,"d":"2382"},{"v":204.84952708512472,"d":"204.8"},{"v":67.31326494086602,"d":"67.3"},{"v":555.1999999999999,"d":"555"},{"v":238.69303525365368,"d":"238.7"},{"v":91.00516979496945,"d":"91.0"},264,{"v":22.871566029667342,"d":"23"},{"v":14.129999999999999,"d":"14"},null,100,{"v":329.7,"d":"330"},{"v":412.30000000000007,"d":"412"},{"v":1530.2,"d":"1530"},{"v":2218.2999999999997,"d":"2218"},142,224,20,33,8,12,{"v":499.1000000000001,"d":"499"},{"v":609.6999999999999,"d":"610"},{"v":1653.4,"d":"1653"},{"v":2611.7000000000003,"d":"2612"},100,212,18,29,5,{"v":6.5,"d":"7"},{"v":296.75967596759676,"d":"297"},{"v":371.1071107110712,"d":"371"},{"v":1377.3177317731775,"d":"1377"},{"v":1996.6696669666965,"d":"1997"},110,170,20,33,8,12,{"v":449.2349234923493,"d":"449"},{"v":548.7848784878487,"d":"549"},{"v":1488.2088208820883,"d":"1488"},{"v":2350.765076507651,"d":"2351"},76,158,18,29,5,{"v":6.5,"d":"7"},{"v":242.9,"d":"243"},{"v":324.09999999999997,"d":"324"},{"v":1042.3000000000002,"d":"1042"},{"v":1404.2000000000003,"d":"1404"},{"v":113.60000000000001,"d":"114"},{"v":179.20000000000002,"d":"179"},19,32,7.2,10.8,{"v":218.63186318631864,"d":"219"},{"v":291.7191719171917,"d":"292"},{"v":938.1638163816383,"d":"938"},{"v":1263.906390639064,"d":"1264"},{"v":86.3360310809712,"d":"86"},{"v":133.93124065769805,"d":"134"},19,32,{"$f":"BJ24","v":{"v":7.2,"d":"7"}},{"$f":"BK24","v":{"v":10.8,"d":"11"}},{"v":2,"d":"2.000000"},{"v":2,"d":"2.000000"},{"$f":"AB24/AB$22","v":{"v":1.3333333333333333,"d":"1.333333"}},{"$f":"AC24/AC$22","v":{"v":1.3333333333333333,"d":"1.333333"}},{"$f":"BV24+((BV24-BX24)*0.85)","v":{"v":2.566666666666667,"d":"2.566667"}},{"v":2.566666666666667,"d":"2.566667"}]
[null,210,{"v":2680.2000000000003,"d":"2680"},{"v":230.45571797076528,"d":"230.5"},{"v":86.17752394524335,"d":"86.2"},{"v":624.5999999999999,"d":"625"},{"v":268.52966466036037,"d":"268.5"},{"v":116.47222533657032,"d":"116.5"},{"v":301.6,"d":"302"},{"v":22.871566029667342,"d":"23"},{"v":16.2,"d":"16"},null,120,{"$f":"471*0.9","v":{"v":423.90000000000003,"d":"424"}},{"$f":"0.9*589","v":{"v":530.1,"d":"530"}},{"$f":"0.9*2186","v":{"v":1967.4,"d":"1967"}},{"$f":"0.9*3169","v":{"v":2852.1,"d":"2852"}},188,298,21,34,{"v":9.7,"d":"10"},15.3,{"$f":"0.9*713","v":{"v":641.7,"d":"642"}},{"$f":"0.9*871","v":{"v":783.9,"d":"784"}},{"$f":"0.9*2362","v":{"v":2125.8,"d":"2126"}},{"$f":"0.9*3731","v":{"v":3357.9,"d":"3358"}},150,{"$f":"AC22*2","v":318},20,32,{"v":6.5,"d":"7"},9,{"v":381.5481548154816,"d":"382"},{"v":477.13771377137715,"d":"477"},{"v":1770.837083708371,"d":"1771"},{"v":2567.146714671467,"d":"2567"},146,226,21,34,{"v":9.7,"d":"10"},15.3,{"v":577.5877587758777,"d":"578"},{"v":705.5805580558056,"d":"706"},{"v":1913.4113411341136,"d":"1913"},{"v":3022.4122412241227,"d":"3022"},114,238,20,32,{"v":6.5,"d":"7"},9,{"$f":"0.9*347","v":{"v":312.3,"d":"312"}},{"$f":"0.9*463","v":{"v":416.7,"d":"417"}},{"$f":"0.9*1489","v":{"v":1340.1000000000001,"d":"1340"}},{"$f":"0.9*2006","v":{"v":1805.4,"d":"1805"}},{"v":150.4,"d":"150"},{"v":238.4,"d":"238"},20,33,{"v":8.73,"d":"8.7"},{"v":13.770000000000001,"d":"13.8"},{"v":281.0981098109811,"d":"281"},{"v":375.0675067506751,"d":"375"},{"v":1206.2106210621064,"d":"1206"},{"v":1625.0225022502252,"d":"1625"},{"v":114.3040411494548,"d":"114"},{"v":178.17638266068758,"d":"178"},20,33,{"v":8.73,"d":"9"},{"v":13.770000000000001,"d":"14"},{"v":2.647887323943662,"d":"2.647887"},{"v":2.6607142857142856,"d":"2.660714"},{"v":2,"d":"2.000000"},{"v":2,"d":"2.000000"},{"v":3.1985915492957746,"d":"3.198592"},{"v":3.222321428571428,"d":"3.222321"}]
[null,230,{"v":2978.0000000000005,"d":"2978"},{"v":256.06190885640586,"d":"256.1"},{"v":107.58197016992357,"d":"107.6"},{"v":693.9999999999999,"d":"694"},{"v":298.3662940670671,"d":"298.4"},{"v":145.3572154707863,"d":"145.4"},{"v":301.6,"d":"302"},{"v":23.45148549944421,"d":"23"},{"v":15.93,"d":"16"},null,150,{"$f":"(N$25/($M$25-30))*($M26-30)","v":{"v":565.2,"d":"565"}},{"v":706.8000000000001,"d":"707"},{"v":2623.2,"d":"2623"},{"v":3802.7999999999997,"d":"3803"},236,373,{"v":22.41028567288496,"d":"22"},{"v":34.86049728245427,"d":"35"},{"v":11.7,"d":"12"},18.7,{"$f":"(X$25/($M$25-30))*($M26-30)","v":{"v":855.6000000000001,"d":"856"}},{"v":1045.1999999999998,"d":"1045"},{"v":2834.4,"d":"2834"},{"v":4477.200000000001,"d":"4477"},175,371,{"v":20.6,"d":"21"},{"v":32.6,"d":"33"},{"v":7.3,"d":"7"},10.1,{"v":508.7308730873088,"d":"509"},{"v":636.1836183618362,"d":"636"},{"v":2361.116111611161,"d":"2361"},{"v":3422.8622862286225,"d":"3423"},183,283,{"v":22.41028567288496,"d":"22"},{"v":34.86049728245427,"d":"35"},{"v":11.7,"d":"12"},18.7,{"v":770.1170117011702,"d":"770"},{"v":940.7740774077406,"d":"941"},{"v":2551.215121512151,"d":"2551"},{"v":4029.8829882988307,"d":"4030"},133,277,{"v":20.6,"d":"21"},{"v":32.6,"d":"33"},{"v":7.3,"d":"7"},10.1,{"$f":"(BB$25/($M$25-30))*($M26-30)","v":{"v":416.40000000000003,"d":"416"}},{"v":555.6,"d":"556"},{"v":1786.8000000000002,"d":"1787"},{"v":2407.2000000000003,"d":"2407"},{"v":188.8,"d":"189"},{"v":298.40000000000003,"d":"298"},{"v":21.41028567288496,"d":"21"},{"v":33.86049728245427,"d":"34"},{"v":10.53,"d":"10.5"},{"v":16.83,"d":"16.8"},{"v":374.7974797479748,"d":"375"},{"v":500.0900090009001,"d":"500"},{"v":1608.2808280828085,"d":"1608"},{"v":2166.696669666967,"d":"2167"},{"v":143.4880516556986,"d":"143"},{"v":223.01943198804187,"d":"223"},{"v":21.41028567288496,"d":"21"},{"v":33.86049728245427,"d":"34"},{"v":10.53,"d":"11"},{"v":16.83,"d":"17"},{"v":3.323943661971831,"d":"3.323944"},{"v":3.330357142857143,"d":"3.330357"},{"v":2.3333333333333335,"d":"2.333333"},{"v":2.3333333333333335,"d":"2.333333"},{"v":4.165962441314554,"d":"4.165962"},{"v":4.1778273809523805,"d":"4.177827"}]
[null,250,{"v":3275.8000000000006,"d":"3276"},{"v":281.6680997420465,"d":"281.7"},{"v":131.58694759996138,"d":"131.6"},{"v":763.4,"d":"763"},{"v":328.2029234737738,"d":"328.2"},{"v":177.73946922708157,"d":"177.7"},{"v":358.40000000000003,"d":"358"},{"v":23.963010723918025,"d":"24"},{"v":18.900000000000002,"d":"19"},null,170,{"v":659.4,"d":"659"},{"v":824.6000000000001,"d":"825"},{"v":3060.4,"d":"3060"},{"v":4436.599999999999,"d":"4437"},283,448,{"v":23.20209813336121,"d":"23"},{"v":35.65230974293052,"d":"36"},{"v":13.7,"d":"14"},22.1,{"v":998.2000000000002,"d":"998"},{"v":1219.3999999999999,"d":"1219"},{"v":3306.8,"d":"3307"},{"v":5223.400000000001,"d":"5223"},225,477,{"v":21.6,"d":"22"},{"v":33.7,"d":"34"},{"v":8.9,"d":"9"},12.5,{"v":593.5193519351935,"d":"594"},{"v":742.2142214221424,"d":"742"},{"v":2754.635463546355,"d":"2755"},{"v":3993.339333933393,"d":"3993"},219,340,{"v":23.20209813336121,"d":"23"},{"v":35.65230974293052,"d":"36"},{"v":13.7,"d":"14"},22.1,{"v":898.4698469846986,"d":"898"},{"v":1097.5697569756974,"d":"1098"},{"v":2976.4176417641766,"d":"2976"},{"v":4701.530153015302,"d":"4702"},171,356,{"v":21.6,"d":"22"},{"v":33.7,"d":"34"},{"v":8.9,"d":"9"},12.5,{"v":485.8,"d":"486"},{"v":648.1999999999999,"d":"648"},{"v":2084.6000000000004,"d":"2085"},{"v":2808.4000000000005,"d":"2808"},{"v":226.4,"d":"226"},{"v":358.40000000000003,"d":"358"},{"v":22.20209813336121,"d":"22"},{"v":34.65230974293052,"d":"35"},{"v":12.33,"d":"12.3"},{"v":19.89,"d":"19.9"},{"v":437.2637263726373,"d":"437"},{"v":583.4383438343834,"d":"583"},{"v":1876.3276327632766,"d":"1876"},{"v":2527.812781278128,"d":"2528"},{"v":172.06406194306228,"d":"172"},{"v":267.8624813153961,"d":"268"},{"v":22.20209813336121,"d":"22"},{"v":34.65230974293052,"d":"35"},{"v":12.33,"d":"12"},{"v":19.89,"d":"20"},{"v":3.9859154929577465,"d":"3.985915"},{"v":4,"d":"4.000000"},{"v":3,"d":"3.000000"},{"v":3,"d":"3.000000"},{"v":4.823943661971831,"d":"4.823944"},{"v":4.85,"d":"4.850000"}]
[null,270,{"v":3573.6000000000004,"d":"3574"},{"v":307.27429062768704,"d":"307.3"},{"v":158.25157093403237,"d":"158.3"},{"v":832.7999999999998,"d":"833"},{"v":358.03955288048047,"d":"358.0"},{"v":213.69669959820527,"d":"213.7"},{"v":377.6,"d":"378"},{"v":24.420585629524773,"d":"24"},{"v":19.53,"d":"20"},null,190,{"v":753.6,"d":"754"},{"v":942.4000000000001,"d":"942"},{"v":3497.6,"d":"3498"},{"v":5070.4,"d":"5070"},330,522,{"v":23.871566029667342,"d":"24"},{"v":36.32177763923665,"d":"36"},{"v":15.7,"d":"16"},25.5,{"v":1140.8000000000002,"d":"1141"},{"v":1393.6,"d":"1394"},{"v":3779.2000000000003,"d":"3779"},{"v":5969.6,"d":"5970"},250,530,{"v":22.1,"d":"22"},{"v":34.1,"d":"34"},{"v":9.7,"d":"10"},13.7,{"v":678.3078307830783,"d":"678"},{"v":848.2448244824483,"d":"848"},{"v":3148.154815481548,"d":"3148"},{"v":4563.816381638164,"d":"4564"},256,396,{"v":23.871566029667342,"d":"24"},{"v":36.32177763923665,"d":"36"},{"v":15.7,"d":"16"},25.5,{"v":1026.822682268227,"d":"1027"},{"v":1254.3654365436544,"d":"1254"},{"v":3401.620162016202,"d":"3402"},{"v":5373.177317731774,"d":"5373"},190,396,{"v":22.1,"d":"22"},{"v":34.1,"d":"34"},{"v":9.7,"d":"10"},13.7,{"v":555.2,"d":"555"},{"v":740.8,"d":"741"},{"v":2382.4000000000005,"d":"2382"},{"v":3209.6000000000004,"d":"3210"},264,{"v":417.6,"d":"418"},{"v":22.871566029667342,"d":"23"},{"v":35.32177763923665,"d":"35"},{"v":14.129999999999999,"d":"14.1"},{"v":22.95,"d":"23.0"},{"v":499.7299729972998,"d":"500"},{"v":666.7866786678668,"d":"667"},{"v":2144.3744374437447,"d":"2144"},{"v":2888.9288928892893,"d":"2889"},{"v":200.640072230426,"d":"201"},{"v":312.10762331838566,"d":"312"},{"v":22.871566029667342,"d":"23"},{"v":35.32177763923665,"d":"35"},{"v":14.129999999999999,"d":"14"},{"v":22.95,"d":"23"},{"v":4.647887323943662,"d":"4.647887"},{"v":4.660714285714286,"d":"4.660714"},{"v":3.3333333333333335,"d":"3.333333"},{"v":3.3333333333333335,"d":"3.333333"},{"v":5.765258215962441,"d":"5.765258"},{"v":5.7889880952380945,"d":"5.788988"}]
[null,290,{"v":3871.4000000000005,"d":"3871"},{"v":332.88048151332765,"d":"332.9"},{"v":187.63385688704525,"d":"187.6"},{"v":902.1999999999998,"d":"902"},{"v":387.8761822871872,"d":"387.9"},{"v":253.30517615240404,"d":"253.3"},{"v":415.20000000000005,"d":"415"},{"v":24.834512481107026,"d":"25"},{"v":21.33,"d":"21"},null,210,{"v":847.8,"d":"848"},{"v":1060.2,"d":"1060"},{"v":3934.7999999999997,"d":"3935"},{"v":5704.2,"d":"5704"},377,597,{"v":23.871566029667342,"d":"24"},37,18,29,{"v":1283.4,"d":"1283"},{"v":1567.7999999999997,"d":"1568"},{"v":4251.6,"d":"4252"},{"v":6715.8,"d":"6716"},275,583,23,35,{"v":10.5,"d":"11"},14.9,{"v":763.0963096309631,"d":"763"},{"v":954.2754275427543,"d":"954"},{"v":3541.6741674167415,"d":"3542"},{"v":5134.293429342934,"d":"5134"},293,453,{"v":23.871566029667342,"d":"24"},{"v":36.32177763923665,"d":"36"},18,19,{"v":1155.1755175517553,"d":"1155"},{"v":1411.161116111611,"d":"1411"},{"v":3826.8226822682273,"d":"3827"},{"v":6044.824482448245,"d":"6045"},209,436,{"v":22.1,"d":"22"},{"v":34.1,"d":"34"},{"v":10.5,"d":"11"},14.9,{"v":624.6,"d":"625"},{"v":833.4,"d":"833"},{"v":2680.2000000000003,"d":"2680"},{"v":3610.8,"d":"3611"},{"v":301.6,"d":"302"},{"v":477.6,"d":"478"},{"v":22.871566029667342,"d":"23"},36,16.2,26.1,{"v":562.1962196219622,"d":"562"},{"v":750.1350135013502,"d":"750"},{"v":2412.4212421242128,"d":"2412"},{"v":3250.0450045004504,"d":"3250"},{"v":229.21608251778972,"d":"229"},{"v":356.9506726457399,"d":"357"},{"v":22.871566029667342,"d":"23"},36,{"v":16.2,"d":"16"},{"v":26.1,"d":"26"},{"v":5.309859154929577,"d":"5.309859"},{"v":5.330357142857143,"d":"5.330357"},{"v":3.6666666666666665,"d":"3.666667"},{"v":3.6666666666666665,"d":"3.666667"},{"v":6.706572769953051,"d":"6.706573"},{"v":6.744494047619049,"d":"6.744494"}]
[null,{"$f":"IF($M$5=1,NL!B31,IF($M$5=2,EN!B31,IF($M$5=3,DE!B31,IF($M$5=4,FR!B31,IF($M$5=5,NR!B31,IF($M$5=6,SP!B31,IF($M$5=7,SW!B31,IF($M$5=8,TS!B31,IF($M$5=9,ExtraTaal1!B31,IF($M$5=10,ExtraTaal2!B31,IF($M$5=11,ExtraTaal3!B31,)))))))))))","v":"* Schalldruck bei einer angenommenen Raumdämpfung von 8dB (A)"},{"$f":"IF($M$5=1,NL!C30,IF($M$5=2,EN!C30,IF($M$5=3,DE!C30,IF($M$5=4,FR!C30,IF($M$5=5,NR!C30,IF($M$5=6,SP!C30,IF($M$5=7,SW!C30,IF($M$5=8,TS!C30,IF($M$5=9,ExtraTaal1!C30,IF($M$5=10,ExtraTaal2!C30,IF($M$5=11,ExtraTaal3!C30,)))))))))))","v":0},{"$f":"IF($M$5=1,NL!D30,IF($M$5=2,EN!D30,IF($M$5=3,DE!D30,IF($M$5=4,FR!D30,IF($M$5=5,NR!D30,IF($M$5=6,SP!D30,IF($M$5=7,SW!D30,IF($M$5=8,TS!D30,IF($M$5=9,ExtraTaal1!D30,IF($M$5=10,ExtraTaal2!D30,IF($M$5=11,ExtraTaal3!D30,)))))))))))","v":0},{"$f":"IF($M$5=1,NL!E30,IF($M$5=2,EN!E30,IF($M$5=3,DE!E30,IF($M$5=4,FR!E30,IF($M$5=5,NR!E30,IF($M$5=6,SP!E30,IF($M$5=7,SW!E30,IF($M$5=8,TS!E30,IF($M$5=9,ExtraTaal1!E30,IF($M$5=10,ExtraTaal2!E30,IF($M$5=11,ExtraTaal3!E30,)))))))))))","v":0},{"$f":"IF($M$5=1,NL!F30,IF($M$5=2,EN!F30,IF($M$5=3,DE!F30,IF($M$5=4,FR!F30,IF($M$5=5,NR!F30,IF($M$5=6,SP!F30,IF($M$5=7,SW!F30,IF($M$5=8,TS!F30,IF($M$5=9,ExtraTaal1!F30,IF($M$5=10,ExtraTaal2!F30,IF($M$5=11,ExtraTaal3!F30,)))))))))))","v":0},{"$f":"IF($M$5=1,NL!G30,IF($M$5=2,EN!G30,IF($M$5=3,DE!G30,IF($M$5=4,FR!G30,IF($M$5=5,NR!G30,IF($M$5=6,SP!G30,IF($M$5=7,SW!G30,IF($M$5=8,TS!G30,IF($M$5=9,ExtraTaal1!G30,IF($M$5=10,ExtraTaal2!G30,IF($M$5=11,ExtraTaal3!G30,)))))))))))","v":0},{"$f":"IF($M$5=1,NL!H30,IF($M$5=2,EN!H30,IF($M$5=3,DE!H30,IF($M$5=4,FR!H30,IF($M$5=5,NR!H30,IF($M$5=6,SP!H30,IF($M$5=7,SW!H30,IF($M$5=8,TS!H30,IF($M$5=9,ExtraTaal1!H30,IF($M$5=10,ExtraTaal2!H30,IF($M$5=11,ExtraTaal3!H30,)))))))))))","v":0},{"$f":"IF($M$5=1,NL!I30,IF($M$5=2,EN!I30,IF($M$5=3,DE!I30,IF($M$5=4,FR!I30,IF($M$5=5,NR!I30,IF($M$5=6,SP!I30,IF($M$5=7,SW!I30,IF($M$5=8,TS!I30,IF($M$5=9,ExtraTaal1!I30,IF($M$5=10,ExtraTaal2!I30,IF($M$5=11,ExtraTaal3!I30,)))))))))))","v":0},{"$f":"IF($M$5=1,NL!J30,IF($M$5=2,EN!J30,IF($M$5=3,DE!J30,IF($M$5=4,FR!J30,IF($M$5=5,NR!J30,IF($M$5=6,SP!J30,IF($M$5=7,SW!J30,IF($M$5=8,TS!J30,IF($M$5=9,ExtraTaal1!J30,IF($M$5=10,ExtraTaal2!J30,IF($M$5=11,ExtraTaal3!J30,)))))))))))","v":0},{"$f":"IF($M$5=1,NL!K30,IF($M$5=2,EN!K30,IF($M$5=3,DE!K30,IF($M$5=4,FR!K30,IF($M$5=5,NR!K30,IF($M$5=6,SP!K30,IF($M$5=7,SW!K30,IF($M$5=8,TS!K30,IF($M$5=9,ExtraTaal1!K30,IF($M$5=10,ExtraTaal2!K30,IF($M$5=11,ExtraTaal3!K30,)))))))))))","v":0},null,230,942,1178,4372,6338,377,597,{"v":24.45148549944421,"d":"24"},{"v":36.90169710901352,"d":"37"},{"v":17.7,"d":"18"},28.9,{"v":1426.0000000000002,"d":"1426"},{"v":1741.9999999999998,"d":"1742"},4724,7462,300,636,{"v":22.9,"d":"23"},{"v":34.9,"d":"35"},{"v":11.3,"d":"11"},16.1,{"v":847.8847884788479,"d":"848"},{"v":1060.3060306030602,"d":"1060"},{"v":3935.1935193519353,"d":"3935"},{"v":5704.770477047705,"d":"5705"},293,453,{"v":24.45148549944421,"d":"24"},{"v":36.90169710901352,"d":"37"},{"v":17.7,"d":"18"},28.9,{"v":1283.5283528352838,"d":"1284"},{"v":1567.9567956795677,"d":"1568"},{"v":4252.025202520252,"d":"4252"},{"v":6716.471647164716,"d":"6716"},228,475,{"v":22.9,"d":"23"},{"v":34.9,"d":"35"},{"v":11.3,"d":"11"},16.1,694,926,{"v":2978.0000000000005,"d":"2978"},{"v":4012.0000000000005,"d":"4012"},{"v":301.6,"d":"302"},{"v":477.6,"d":"478"},{"v":23.45148549944421,"d":"23"},{"v":35.90169710901352,"d":"36"},{"v":15.93,"d":"15.9"},{"v":26.009999999999998,"d":"26.0"},{"$f":"BB30/1.111","v":{"v":624.6624662466247,"d":"625"}},{"$f":"BC30/1.111","v":{"v":833.4833483348335,"d":"833"}},{"$f":"BD30/1.111","v":{"v":2680.468046804681,"d":"2680"}},{"$f":"BE30/1.111","v":{"v":3611.1611161116116,"d":"3611"}},{"v":229.21608251778972,"d":"229"},{"v":356.9506726457399,"d":"357"},{"v":23.45148549944421,"d":"23"},{"v":35.90169710901352,"d":"36"},{"v":15.93,"d":"16"},{"v":26.009999999999998,"d":"26"},{"v":5.309859154929577,"d":"5.309859"},{"v":5.330357142857143,"d":"5.330357"},{"v":4,"d":"4.000000"},{"v":4,"d":"4.000000"},{"v":6.423239436619717,"d":"6.423239"},{"v":6.461160714285715,"d":"6.461161"}]
[null,{"$f":"IF($M$5=1,NL!B32,IF($M$5=2,EN!B32,IF($M$5=3,DE!B32,IF($M$5=4,FR!B32,IF($M$5=5,NR!B32,IF($M$5=6,SP!B32,IF($M$5=7,SW!B32,IF($M$5=8,TS!B32,IF($M$5=9,ExtraTaal1!B32,IF($M$5=10,ExtraTaal2!B32,IF($M$5=11,ExtraTaal3!B32,)))))))))))","v":"Beachtung:\nDie Temperatur, bei der Wasserdampf in der Umgebungsluft zu kondensieren beginnt, wird als Taupunkttemperatur bezeichnet. Kondensat kann sowohl das Gerät als auch seine Umgebung beschädigen. Das Gerät schaltet sich nicht aus, wenn der Taupunkt erreicht ist. Der Kunde sollte daher die Taupunkttemperatur überprüfen und verhindern, dass die Temperatur unter den Taupunkt fällt. Jaga N.V. kann nicht für Schäden haftbar gemacht werden, die durch Kondensat verursacht werden."},{"$f":"IF($M$5=1,NL!C31,IF($M$5=2,EN!C31,IF($M$5=3,DE!C31,IF($M$5=4,FR!C31,IF($M$5=5,NR!C31,IF($M$5=6,SP!C31,IF($M$5=7,SW!C31,IF($M$5=8,TS!C31,IF($M$5=9,ExtraTaal1!C31,IF($M$5=10,ExtraTaal2!C31,IF($M$5=11,ExtraTaal3!C31,)))))))))))","v":0},{"$f":"IF($M$5=1,NL!D31,IF($M$5=2,EN!D31,IF($M$5=3,DE!D31,IF($M$5=4,FR!D31,IF($M$5=5,NR!D31,IF($M$5=6,SP!D31,IF($M$5=7,SW!D31,IF($M$5=8,TS!D31,IF($M$5=9,ExtraTaal1!D31,IF($M$5=10,ExtraTaal2!D31,IF($M$5=11,ExtraTaal3!D31,)))))))))))","v":0},{"$f":"IF($M$5=1,NL!E31,IF($M$5=2,EN!E31,IF($M$5=3,DE!E31,IF($M$5=4,FR!E31,IF($M$5=5,NR!E31,IF($M$5=6,SP!E31,IF($M$5=7,SW!E31,IF($M$5=8,TS!E31,IF($M$5=9,ExtraTaal1!E31,IF($M$5=10,ExtraTaal2!E31,IF($M$5=11,ExtraTaal3!E31,)))))))))))","v":0},{"$f":"IF($M$5=1,NL!F31,IF($M$5=2,EN!F31,IF($M$5=3,DE!F31,IF($M$5=4,FR!F31,IF($M$5=5,NR!F31,IF($M$5=6,SP!F31,IF($M$5=7,SW!F31,IF($M$5=8,TS!F31,IF($M$5=9,ExtraTaal1!F31,IF($M$5=10,ExtraTaal2!F31,IF($M$5=11,ExtraTaal3!F31,)))))))))))","v":0},{"$f":"IF($M$5=1,NL!G31,IF($M$5=2,EN!G31,IF($M$5=3,DE!G31,IF($M$5=4,FR!G31,IF($M$5=5,NR!G31,IF($M$5=6,SP!G31,IF($M$5=7,SW!G31,IF($M$5=8,TS!G31,IF($M$5=9,ExtraTaal1!G31,IF($M$5=10,ExtraTaal2!G31,IF($M$5=11,ExtraTaal3!G31,)))))))))))","v":0},{"$f":"IF($M$5=1,NL!H31,IF($M$5=2,EN!H31,IF($M$5=3,DE!H31,IF($M$5=4,FR!H31,IF($M$5=5,NR!H31,IF($M$5=6,SP!H31,IF($M$5=7,SW!H31,IF($M$5=8,TS!H31,IF($M$5=9,ExtraTaal1!H31,IF($M$5=10,ExtraTaal2!H31,IF($M$5=11,ExtraTaal3!H31,)))))))))))","v":0},{"$f":"IF($M$5=1,NL!I31,IF($M$5=2,EN!I31,IF($M$5=3,DE!I31,IF($M$5=4,FR!I31,IF($M$5=5,NR!I31,IF($M$5=6,SP!I31,IF($M$5=7,SW!I31,IF($M$5=8,TS!I31,IF($M$5=9,ExtraTaal1!I31,IF($M$5=10,ExtraTaal2!I31,IF($M$5=11,ExtraTaal3!I31,)))))))))))","v":0},{"$f":"IF($M$5=1,NL!J31,IF($M$5=2,EN!J31,IF($M$5=3,DE!J31,IF($M$5=4,FR!J31,IF($M$5=5,NR!J31,IF($M$5=6,SP!J31,IF($M$5=7,SW!J31,IF($M$5=8,TS!J31,IF($M$5=9,ExtraTaal1!J31,IF($M$5=10,ExtraTaal2!J31,IF($M$5=11,ExtraTaal3!J31,)))))))))))","v":0},{"$f":"IF($M$5=1,NL!K31,IF($M$5=2,EN!K31,IF($M$5=3,DE!K31,IF($M$5=4,FR!K31,IF($M$5=5,NR!K31,IF($M$5=6,SP!K31,IF($M$5=7,SW!K31,IF($M$5=8,TS!K31,IF($M$5=9,ExtraTaal1!K31,IF($M$5=10,ExtraTaal2!K31,IF($M$5=11,ExtraTaal3!K31,)))))))))))","v":0},null,250,{"v":1036.2,"d":"1036"},{"v":1295.8000000000002,"d":"1296"},{"v":4809.2,"d":"4809"},{"v":6971.799999999999,"d":"6972"},448,709,{"v":24.963010723918025,"d":"25"},{"v":37.41322233348733,"d":"37"},21,34,{"v":1568.6000000000001,"d":"1569"},{"v":1916.1999999999998,"d":"1916"},{"v":5196.400000000001,"d":"5196"},{"v":8208.2,"d":"8208"},350,742,{"v":23.6,"d":"24"},{"v":35.6,"d":"36"},{"v":12.9,"d":"13"},18.5,{"v":932.6732673267327,"d":"933"},{"v":1166.3366336633665,"d":"1166"},{"v":4328.712871287129,"d":"4329"},{"v":6275.247524752474,"d":"6275"},348,538,{"v":24.963010723918025,"d":"25"},{"v":37.41322233348733,"d":"37"},21,34,{"v":1411.8811881188121,"d":"1412"},{"v":1724.7524752475247,"d":"1725"},{"v":4677.227722772278,"d":"4677"},{"v":7388.118811881189,"d":"7388"},266,554,{"v":23.6,"d":"24"},{"v":35.6,"d":"36"},{"v":12.9,"d":"13"},18.5,{"v":763.4000000000001,"d":"763"},{"v":1018.6,"d":"1019"},{"v":3275.8000000000006,"d":"3276"},{"v":4413.200000000001,"d":"4413"},{"v":358.40000000000003,"d":"358"},{"v":567.2,"d":"567"},{"v":23.963010723918025,"d":"24"},{"v":36.41322233348733,"d":"36"},{"v":18.900000000000002,"d":"18.9"},30.6,{"$f":"BB31/1.111","v":{"v":687.1287128712872,"d":"687"}},{"$f":"BC31/1.111","v":{"v":916.8316831683169,"d":"917"}},{"$f":"BD31/1.111","v":{"v":2948.514851485149,"d":"2949"}},{"v":3972.2772277227727,"d":"3972"},{"v":272.3840980582753,"d":"272"},{"v":423.91629297458894,"d":"424"},{"v":23.963010723918025,"d":"24"},{"v":36.41322233348733,"d":"36"},{"v":18.900000000000002,"d":"19"},{"v":30.6,"d":"31"},{"v":6.309859154929577,"d":"6.309859"},{"v":6.330357142857143,"d":"6.330357"},{"v":4.666666666666667,"d":"4.666667"},{"v":4.666666666666667,"d":"4.666667"},{"v":7.70657276995305,"d":"7.706573"},{"v":7.744494047619048,"d":"7.744494"}]
[null,"JAGA N.V. • Verbindingslaan 16 • 3590 Diepenbeek Belgium • T +32 (0)11 29 41 11 • F +32 (0)11 32 35 78 • info@jaga.be •  www.jaga.com",{"$nulls":10},270,{"v":1130.4,"d":"1130"},{"v":1413.6000000000001,"d":"1414"},{"v":5246.4,"d":"5246"},{"v":7605.599999999999,"d":"7606"},472,746,{"v":25.420585629524773,"d":"25"},{"v":37.87079723909408,"d":"38"},{"v":21.7,"d":"22"},35.7,{"v":1711.2000000000003,"d":"1711"},{"v":2090.3999999999996,"d":"2090"},{"v":5668.8,"d":"5669"},{"v":8954.400000000001,"d":"8954"},375,795,{"v":23.9,"d":"24"},{"v":35.9,"d":"36"},{"v":13.7,"d":"14"},19.7,{"v":1017.4617461746176,"d":"1017"},{"v":1272.3672367236725,"d":"1272"},{"v":4722.232223222322,"d":"4722"},{"v":6845.724572457245,"d":"6846"},366,566,{"v":25.420585629524773,"d":"25"},{"v":37.87079723909408,"d":"38"},{"v":21.7,"d":"22"},35.7,{"v":1540.2340234023404,"d":"1540"},{"v":1881.5481548154812,"d":"1882"},{"v":5102.430243024302,"d":"5102"},{"v":8059.765976597661,"d":"8060"},285,594,{"v":23.9,"d":"24"},{"v":35.9,"d":"36"},{"v":13.7,"d":"14"},19.7,{"v":832.8000000000001,"d":"833"},{"v":1111.2,"d":"1111"},{"v":3573.6000000000004,"d":"3574"},{"v":4814.400000000001,"d":"4814"},{"v":377.6,"d":"378"},{"v":596.8000000000001,"d":"597"},{"v":24.420585629524773,"d":"24"},{"v":36.87079723909408,"d":"37"},{"v":19.53,"d":"19.5"},{"v":32.13,"d":"32.1"},{"v":749.5949594959496,"d":"750"},{"v":1000.1800180018002,"d":"1000"},{"v":3216.561656165617,"d":"3217"},{"v":4333.393339333934,"d":"4333"},{"v":286.9761033113972,"d":"287"},{"v":446.03886397608375,"d":"446"},{"v":24.420585629524773,"d":"24"},{"v":36.87079723909408,"d":"37"},{"v":19.53,"d":"20"},{"v":32.13,"d":"32"},{"v":6.647887323943662,"d":"6.647887"},{"v":6.660714285714286,"d":"6.660714"},{"v":5,"d":"5.000000"},{"v":5,"d":"5.000000"},{"v":8.048591549295775,"d":"8.048592"},{"v":8.072321428571428,"d":"8.072321"}]
[null,"KBC IBAN: BE16 459 250 300 174 BIC:KREDBEBB • ING IBAN: BE97 335 009 564 549 BIC: BBRUBEBB • RPR Hasselt 45.752 • BE0413.382.425",{"$nulls":10},290,{"v":1224.6,"d":"1225"},{"v":1531.4,"d":"1531"},{"v":5683.599999999999,"d":"5684"},{"v":8239.4,"d":"8239"},519,821,{"v":25.834512481107026,"d":"26"},{"v":38.284724090676335,"d":"38"},{"v":23.7,"d":"24"},39.1,{"v":1853.8000000000002,"d":"1854"},{"v":2264.6,"d":"2265"},{"v":6141.2,"d":"6141"},{"v":9700.6,"d":"9701"},400,848,25,37,{"v":14.5,"d":"15"},20.9,{"v":1102.2502250225023,"d":"1102"},{"v":1378.3978397839785,"d":"1378"},{"v":5115.751575157516,"d":"5116"},{"v":7416.201620162016,"d":"7416"},403,623,{"v":25.834512481107026,"d":"26"},{"v":38.284724090676335,"d":"38"},{"v":23.7,"d":"24"},39.1,{"v":1668.5868586858687,"d":"1669"},{"v":2038.3438343834382,"d":"2038"},{"v":5527.632763276328,"d":"5528"},{"v":8731.413141314131,"d":"8731"},304,634,{"v":24.1,"d":"24"},{"v":36.2,"d":"36"},{"v":14.5,"d":"15"},20.9,{"v":902.2,"d":"902"},{"v":1203.8,"d":"1204"},{"v":3871.4000000000005,"d":"3871"},{"v":5215.6,"d":"5216"},{"v":415.20000000000005,"d":"415"},{"v":656.8000000000001,"d":"657"},{"v":24.834512481107026,"d":"25"},{"v":37.284724090676335,"d":"37"},{"v":21.33,"d":"21.3"},{"v":35.190000000000005,"d":"35.2"},{"v":812.0612061206122,"d":"812"},{"v":1083.5283528352836,"d":"1084"},{"v":3484.608460846085,"d":"3485"},{"v":4694.509450945095,"d":"4695"},{"v":315.5521135987609,"d":"316"},{"v":490.881913303438,"d":"491"},{"v":24.834512481107026,"d":"25"},{"v":37.284724090676335,"d":"37"},{"v":21.33,"d":"21"},{"v":35.190000000000005,"d":"35"},{"v":7.309859154929577,"d":"7.309859"},{"v":7.330357142857143,"d":"7.330357"},{"v":5.333333333333333,"d":"5.333333"},{"v":5.333333333333333,"d":"5.333333"},{"v":8.989906103286385,"d":"8.989906"},{"v":9.027827380952381,"d":"9.027827"}]

{"sheet":"NL","index":2,"n_rows":33,"n_cols":13,"rows_kept":33,"hidden":true,"merged":[[1,1,1,8],[3,5,3,8],[3,9,3,10],[4,1,4,2],[4,5,4,8],[4,9,4,10],[5,5,5,8],[5,9,5,10],[6,5,6,8],[6,9,6,10],[9,9,9,10],[10,9,13,10],[16,1,16,10],[29,1,29,6],[30,1,30,10],[31,1,31,10],[32,1,32,10]]}
[]
[]
[]
[{"$nulls":5},"Taal/Language/Sprache/Langue/Språk/Lengua"]
[{"$nulls":5},"Uitvoering:",{"$nulls":6},"Inbouw"]
[{"$nulls":5},"Hoogte [cm]:",{"$nulls":6},"Met omkasting"]
[{"$nulls":5},"Ventilatorsnelheid"]
[]
[null,"Temperaturen",{"$nulls":10},"Kopieer alle data"]
[null,"Verwarmen:",{"$nulls":3},"Koelen:",{"$nulls":3},"Eenheidsstelsel",null,null,"SI-eenheden"]
[null,"Water aanvoer",null,null,{"$f":"IF(UnitsNo=1,\"°C\",IF(UnitsNo=2,\"°F\",))","v":"°C"},{"$f":"B11","v":"Water aanvoer"},null,null,{"$f":"E11","v":"°C"},{"$nulls":3},"Imperiale-eenheden"]
[null,"Water retour",null,null,{"$f":"E11","v":"°C"},{"$f":"B12","v":"Water retour"},null,null,{"$f":"E11","v":"°C"}]
[null,"Ruimte",null,null,{"$f":"E11","v":"°C"},{"$f":"B13","v":"Ruimte"},null,null,{"$f":"E11","v":"°C"}]
[]
[]
[null,{"$f":"CONCATENATE(\"Lengte \",IF(UnitsNo=1,\"[cm]\",IF(UnitsNo=2,\"[inch]\",)))","v":"Lengte [cm]"},{"$f":"CONCATENATE(\"Verwarmvermogen in\",IF(UnitsNo=1,\" [W]\",IF(UnitsNo=2,\" [Btu/h]\",)))","v":"Verwarmvermogen in [W]"},{"$f":"CONCATENATE(\"Waterdebiet, verwarming in\",IF(UnitsNo=1,\" [l/h]\",IF(UnitsNo=2,\" [GPM]\",)))","v":"Waterdebiet, verwarming in [l/h]"},{"$f":"\"Waterzijdig drukverlies [\"&IF(UnitsNo=1,\"kPa\",\"ftH2O\")&\"]\"","v":"Waterzijdig drukverlies [kPa]"},{"$f":"CONCATENATE(\"Koelvermogen in\",IF(UnitsNo=1,\" [W]\",IF(UnitsNo=2,\" [Btu/h]\",)))","v":"Koelvermogen in [W]"},{"$f":"CONCATENATE(\"Waterdebiet, koeling in\",IF(UnitsNo=1,\" [l/h]\",IF(UnitsNo=2,\" [GPM]\",)))","v":"Waterdebiet, koeling in [l/h]"},{"$f":"E16","v":"Waterzijdig drukverlies [kPa]"},{"$f":"\"Luchtdebiet\"&IF(UnitsNo=1,\" [m³/h]\",IF(UnitsNo=2,\" [CFM]\",))","v":"Luchtdebiet [m³/h]"},"Geluidsdruk* [dB(A)]","Elektr. vermogen [W]"]
[null,{"$f":"CONCATENATE(\"Clima Beam - \",\" H\",cal!H6,\" B\",cal!M15,\" Type \",cal!L16)","v":"Clima Beam -  H9,6 B33 Type 8"}]
{"$rows_empty":13}
[null,"*Geluidsdruk bij een aangenomen ruimtedemping van 8dB(A)"]
[null,"Opgelet:\nDe temperatuur waarbij waterdamp begint te condenseren in de omgevingslucht wordt de dauwpunttemperatuur genoemd. Condensaat kan zowel het apparaat als zijn omgeving beschadigen. Het apparaat schakelt niet uit wanneer het dauwpunt bereikt wordt. De klant moet daarom de dauwpunttemperatuur controleren en voorkomen dat de temperatuur onder het dauwpunt daalt. Jaga N.V.kan niet aansprakelijk worden gesteld voor schade veroorzaakt door condensaat."]
[null,"JAGA N.V. • Verbindingslaan 16 • 3590 Diepenbeek Belgium • T +32 (0)11 29 41 11 • F +32 (0)11 32 35 78 • info@jaga.be • www.jaga.com                                                         KBC IBAN: BE16 459 250 300 174 BIC:KREDBEBB • ING IBAN: BE97 335 009 564 549 BIC: BBRUBEBB • RPR Hasselt 45.752 • BE0413.382.425"]

{"sheet":"EN","index":3,"n_rows":33,"n_cols":13,"rows_kept":33,"hidden":true,"merged":[[1,1,1,8],[3,5,3,8],[3,9,3,10],[4,1,4,2],[4,5,4,8],[4,9,4,10],[5,5,5,8],[5,9,5,10],[6,5,6,8],[6,9,6,10],[9,9,9,10],[10,9,13,10],[16,1,16,10],[29,1,29,6],[30,1,30,10],[31,1,31,10],[32,1,32,10]]}
[]
[]
[]
[{"$nulls":5},"Taal/Language/Sprache/Langue/Språk/Lengua"]
[{"$nulls":5},"Model:",{"$nulls":6},"Built-in"]
[{"$nulls":5},"Height [cm]:",{"$nulls":6},"With casing"]
[{"$nulls":5},"Fan speed"]
[]
[null,"Temperatures",{"$nulls":10},"Copy all data"]
[null,"Heating:",{"$nulls":3},"Cooling:",{"$nulls":3},"Unit conversion",null,null,"SI-units"]
[null,"Supply water",null,null,{"$f":"IF(UnitsNo=1,\"°C\",IF(UnitsNo=2,\"°F\",))","v":"°C"},{"$f":"B11","v":"Supply water"},null,null,{"$f":"E11","v":"°C"},null,{"$f":"E11","v":"°C"},null,"Imperial-units"]
[null,"Return water",null,null,{"$f":"E11","v":"°C"},{"$f":"B12","v":"Return water"},null,null,{"$f":"E11","v":"°C"},null,{"$f":"E11","v":"°C"}]
[null,"Entering air",null,null,{"$f":"E11","v":"°C"},{"$f":"B13","v":"Entering air"},null,null,{"$f":"E11","v":"°C"},null,{"$f":"E11","v":"°C"}]
[]
[]
[null,{"$f":"CONCATENATE(\"Length \",IF(UnitsNo=1,\"[cm]\",IF(UnitsNo=2,\"[inch]\",)))","v":"Length [cm]"},{"$f":"CONCATENATE(\"Heating capacity in\",IF(UnitsNo=1,\" [W]\",IF(UnitsNo=2,\" [Btu/h]\",)))","v":"Heating capacity in [W]"},{"$f":"CONCATENATE(\"Water flowrate, heating in\",IF(UnitsNo=1,\" [l/h]\",IF(UnitsNo=2,\" [GPM]\",)))","v":"Water flowrate, heating in [l/h]"},{"$f":"\"Water side pressure loss [\"&IF(UnitsNo=1,\"kPa\",\"ftH2O\")&\"]\"","v":"Water side pressure loss [kPa]"},{"$f":"CONCATENATE(\"Sens. cooling capacity in\",IF(UnitsNo=1,\" [W]\",IF(UnitsNo=2,\" [Btu/h]\",)))","v":"Sens. cooling capacity in [W]"},{"$f":"CONCATENATE(\"Water flowrate, cooling in\",IF(UnitsNo=1,\" [l/h]\",IF(UnitsNo=2,\" [GPM]\",)))","v":"Water flowrate, cooling in [l/h]"},{"$f":"E16","v":"Water side pressure loss [kPa]"},{"$f":"\"Air flowrate\"&IF(UnitsNo=1,\" [m³/h]\",IF(UnitsNo=2,\" [CFM]\",))","v":"Air flowrate [m³/h]"},"Sound pressure* [dB(A)]","Electric power [W]"]
[null,{"$f":"CONCATENATE(\"Clima Beam - \",\" H\",cal!H6,\" B\",cal!M15,\" Type \",cal!L16)","v":"Clima Beam -  H9,6 B33 Type 8"}]
{"$rows_empty":13}
[null,"* Sound pressure at an assumed room damping of 8dB (A)"]
[null,"Attention:\nThe temperature at which water vapor starts to condense in the ambient air is called the dew point temperature. Condensate can damage both the device and its environment. The device does not switch off when the dew point is reached. The customer should therefore check the dew point temperature and prevent the temperature from dropping below the dew point. Jaga N.V. cannot be held liable for damage caused by condensate.\n"]
[null,"JAGA N.V. • Verbindingslaan 16 • 3590 Diepenbeek Belgium • T +32 (0)11 29 41 11 • F +32 (0)11 32 35 78 • info@jaga.be • www.jaga.com                                                         KBC IBAN: BE16 459 250 300 174 BIC:KREDBEBB • ING IBAN: BE97 335 009 564 549 BIC: BBRUBEBB • RPR Hasselt 45.752 • BE0413.382.425"]

{"sheet":"DE","index":4,"n_rows":33,"n_cols":13,"rows_kept":33,"hidden":true,"merged":[[1,1,1,8],[3,5,3,8],[3,9,3,10],[4,1,4,2],[4,5,4,8],[4,9,4,10],[5,5,5,8],[5,9,5,10],[6,5,6,8],[6,9,6,10],[9,9,9,10],[10,9,13,10],[16,1,16,10],[30,1,30,10],[31,1,31,10],[32,1,32,10]]}
[]
[]
[]
[{"$nulls":5},"Taal/Language/Sprache/Langue/Språk/Lengua"]
[{"$nulls":5},"Ausführung:",{"$nulls":6},"Einbau"]
[{"$nulls":5},"Höhe [cm]:",{"$nulls":6},"mit Verkleidung"]
[{"$nulls":5},"Drehzahlstufe"]
[]
[null,"Temperaturen",{"$nulls":10},"Daten kopieren"]
[null,"Heizen:",{"$nulls":3},"Kühlen:",{"$nulls":3},"Einheiten",null,null,"SI-einheiten"]
[null,"Vorlauftemp.",null,null,{"$f":"IF(UnitsNo=1,\"°C\",IF(UnitsNo=2,\"°F\",))","v":"°C"},{"$f":"B11","v":"Vorlauftemp."},null,null,{"$f":"E11","v":"°C"},null,{"$f":"E11","v":"°C"},null,"Imperiale-einheiten"]
[null,"Rücklauftemp.",null,null,{"$f":"E11","v":"°C"},{"$f":"B12","v":"Rücklauftemp."},null,null,{"$f":"E11","v":"°C"},null,{"$f":"E11","v":"°C"}]
[null,"Raumtemp.",null,null,{"$f":"E11","v":"°C"},{"$f":"B13","v":"Raumtemp."},null,null,{"$f":"E11","v":"°C"},null,{"$f":"E11","v":"°C"}]
[]
[]
[null,{"$f":"CONCATENATE(\"Länge \",IF(UnitsNo=1,\"[cm]\",IF(UnitsNo=2,\"[inch]\",)))","v":"Länge [cm]"},{"$f":"CONCATENATE(\"Wärmeleistung in\",IF(UnitsNo=1,\" [W]\",IF(UnitsNo=2,\" [Btu/h]\",)))","v":"Wärmeleistung in [W]"},{"$f":"CONCATENATE(\"Heizmittelstrom in\",IF(UnitsNo=1,\" [l/h]\",IF(UnitsNo=2,\" [GPM]\",)))","v":"Heizmittelstrom in [l/h]"},{"$f":"\"zug. wassers. Druckverlust [\"&IF(UnitsNo=1,\"kPa\",\"ftH2O\")&\"]\"","v":"zug. wassers. Druckverlust [kPa]"},{"$f":"CONCATENATE(\"Sens. kälteleistung in\",IF(UnitsNo=1,\" [W]\",IF(UnitsNo=2,\" [Btu/h]\",)))","v":"Sens. kälteleistung in [W]"},{"$f":"CONCATENATE(\"Kühlmittelstrom in\",IF(UnitsNo=1,\" [l/h]\",IF(UnitsNo=2,\" [GPM]\",)))","v":"Kühlmittelstrom in [l/h]"},{"$f":"E16","v":"zug. wassers. Druckverlust [kPa]"},{"$f":"\"Luftvolumenstrom\"&IF(UnitsNo=1,\" [m³/h]\",IF(UnitsNo=2,\" [CFM]\",))","v":"Luftvolumenstrom [m³/h]"},"Schalldruckpegel* [dB(A)]","Elektr. leistung [W]"]
[null,{"$f":"CONCATENATE(\"Clima Beam - \",\" H\",cal!H6,\" B\",cal!M15,\" Typ \",cal!L16)","v":"Clima Beam -  H9,6 B33 Typ 8"}]
{"$rows_empty":13}
[null,"* Schalldruck bei einer angenommenen Raumdämpfung von 8dB (A)"]
[null,"Beachtung:\nDie Temperatur, bei der Wasserdampf in der Umgebungsluft zu kondensieren beginnt, wird als Taupunkttemperatur bezeichnet. Kondensat kann sowohl das Gerät als auch seine Umgebung beschädigen. Das Gerät schaltet sich nicht aus, wenn der Taupunkt erreicht ist. Der Kunde sollte daher die Taupunkttemperatur überprüfen und verhindern, dass die Temperatur unter den Taupunkt fällt. Jaga N.V. kann nicht für Schäden haftbar gemacht werden, die durch Kondensat verursacht werden."]
[null,"JAGA N.V. • Verbindingslaan 16 • 3590 Diepenbeek Belgium • T +32 (0)11 29 41 11 • F +32 (0)11 32 35 78 • info@jaga.be • www.jaga.com                                                         KBC IBAN: BE16 459 250 300 174 BIC:KREDBEBB • ING IBAN: BE97 335 009 564 549 BIC: BBRUBEBB • RPR Hasselt 45.752 • BE0413.382.425"]

{"sheet":"FR","index":5,"n_rows":33,"n_cols":13,"rows_kept":33,"hidden":true,"merged":[[1,1,1,8],[3,5,3,8],[3,9,3,10],[4,1,4,2],[4,5,4,8],[4,9,4,10],[5,5,5,8],[5,9,5,10],[6,5,6,8],[6,9,6,10],[9,9,9,10],[10,9,13,10],[16,1,16,10],[30,1,30,10],[31,1,31,10],[32,1,32,10]]}
[]
[]
[]
[{"$nulls":5},"Taal/Language/Sprache/Langue/Språk/Lengua"]
[{"$nulls":5},"Version:",{"$nulls":6},"Intégré"]
[{"$nulls":5},"Hauteur [cm]:",{"$nulls":6},"Avec caisson"]
[{"$nulls":5},"Niveau de vitesse"]
[]
[null,"Températures",{"$nulls":10},"Copier toutes des données"]
[null,"Chauffer:",{"$nulls":3},"Refroidir:",{"$nulls":3},"Einheiten",null,null,"Unités-SI"]
[null,"Temp. entrée",null,null,{"$f":"IF(UnitsNo=1,\"°C\",IF(UnitsNo=2,\"°F\",))","v":"°C"},{"$f":"B11","v":"Temp. entrée"},null,null,{"$f":"E11","v":"°C"},null,{"$f":"E11","v":"°C"},null,"Unités-Impériales"]
[null,"Temp. retour",null,null,{"$f":"E11","v":"°C"},{"$f":"B12","v":"Temp. retour"},null,null,{"$f":"E11","v":"°C"},null,{"$f":"E11","v":"°C"}]
[null,"Temp. ambiante",null,null,{"$f":"E11","v":"°C"},{"$f":"B13","v":"Temp. ambiante"},null,null,{"$f":"E11","v":"°C"},null,{"$f":"E11","v":"°C"}]
[]
[]
[null,{"$f":"CONCATENATE(\"Länge \",IF(UnitsNo=1,\"[cm]\",IF(UnitsNo=2,\"[inch]\",)))","v":"Länge [cm]"},{"$f":"CONCATENATE(\"Capacité de chauffer en\",IF(UnitsNo=1,\" [W]\",IF(UnitsNo=2,\" [Btu/h]\",)))","v":"Capacité de chauffer en [W]"},{"$f":"CONCATENATE(\"Débit d'eau, chauffer en\",IF(UnitsNo=1,\" [l/h]\",IF(UnitsNo=2,\" [GPM]\",)))","v":"Débit d'eau, chauffer en [l/h]"},{"$f":"\"Perte de charge [\"&IF(UnitsNo=1,\"kPa\",\"ftH2O\")&\"]\"","v":"Perte de charge [kPa]"},{"$f":"CONCATENATE(\"Capacité de refroidissement en\",IF(UnitsNo=1,\" [W]\",IF(UnitsNo=2,\" [Btu/h]\",)))","v":"Capacité de refroidissement en [W]"},{"$f":"CONCATENATE(\"Débit d'eau, refroidissement en\",IF(UnitsNo=1,\" [l/h]\",IF(UnitsNo=2,\" [GPM]\",)))","v":"Débit d'eau, refroidissement en [l/h]"},{"$f":"E16","v":"Perte de charge [kPa]"},{"$f":"\"Débit d'air\"&IF(UnitsNo=1,\" [m³/h]\",IF(UnitsNo=2,\" [CFM]\",))","v":"Débit d'air [m³/h]"},"Pression sonore * [dB(A)]","Puissance électrique [W]"]
[null,{"$f":"CONCATENATE(\"Clima Beam - \",\" H\",cal!H6,\" B\",cal!M15,\" Type \",cal!L16)","v":"Clima Beam -  H9,6 B33 Type 8"}]
{"$rows_empty":13}
[null,"* Pression acoustique à un amortissement supposé de la pièce de 8 dB (A)"]
[null,"Attention:\nLa température à laquelle la vapeur d'eau commence à se condenser dans l'air ambiant est appelée température du point de rosée. Le condensat peut endommager à la fois l'appareil et son environnement. L'appareil ne s'éteint pas lorsque le point de rosée est atteint. Le client doit donc vérifier la température du point de rosée et éviter que la température ne descende en dessous du point de rosée. Jaga N.V.ne peut être tenu responsable des dommages causés par le condensat."]
[null,"JAGA N.V. • Verbindingslaan 16 • 3590 Diepenbeek Belgium • T +32 (0)11 29 41 11 • F +32 (0)11 32 35 78 • info@jaga.be • www.jaga.com                                                         KBC IBAN: BE16 459 250 300 174 BIC:KREDBEBB • ING IBAN: BE97 335 009 564 549 BIC: BBRUBEBB • RPR Hasselt 45.752 • BE0413.382.425"]

{"sheet":"NR","index":6,"n_rows":33,"n_cols":13,"rows_kept":33,"hidden":true,"merged":[[1,1,1,8],[3,5,3,8],[3,9,3,10],[4,1,4,2],[4,5,4,8],[4,9,4,10],[5,5,5,8],[5,9,5,10],[6,5,6,8],[6,9,6,10],[9,9,9,10],[10,9,13,10],[16,1,16,10],[30,1,30,10],[31,1,31,10],[32,1,32,10]]}
[]
[]
[]
[{"$nulls":5},"Taal/Language/Sprache/Langue/Språk/Lengua"]
[{"$nulls":5},"Modell:",{"$nulls":6},"Innebygd"]
[{"$nulls":5},"Høyde [cm]:",{"$nulls":6},"Med hus"]
[{"$nulls":5},"Hastighet"]
[]
[null,"Temperaturer",{"$nulls":10},"Kopier alle data"]
[null,"Varme:",{"$nulls":3},"Kjøling:",{"$nulls":3},"Enhetssystem",null,null,"SI-enheter"]
[null,"Tur vann",null,null,{"$f":"IF(UnitsNo=1,\"°C\",IF(UnitsNo=2,\"°F\",))","v":"°C"},{"$f":"B11","v":"Tur vann"},null,null,{"$f":"E11","v":"°C"},null,{"$f":"E11","v":"°C"},null,"Imperiale-enheter"]
[null,"Retur vann",null,null,{"$f":"E11","v":"°C"},{"$f":"B12","v":"Retur vann"},null,null,{"$f":"E11","v":"°C"},null,{"$f":"E11","v":"°C"}]
[null,"Rom",null,null,{"$f":"E11","v":"°C"},{"$f":"B13","v":"Rom"},null,null,{"$f":"E11","v":"°C"},null,{"$f":"E11","v":"°C"}]
[]
[]
[null,{"$f":"CONCATENATE(\"Lengde \",IF(UnitsNo=1,\"[cm]\",IF(UnitsNo=2,\"[inch]\",)))","v":"Lengde [cm]"},{"$f":"CONCATENATE(\"Varme effekt\",IF(UnitsNo=1,\" [W]\",IF(UnitsNo=2,\" [Btu/h]\",)))","v":"Varme effekt [W]"},{"$f":"CONCATENATE(\"Vannmengde, varme\",IF(UnitsNo=1,\" [l/h]\",IF(UnitsNo=2,\" [GPM]\",)))","v":"Vannmengde, varme [l/h]"},{"$f":"\"Trykktap [\"&IF(UnitsNo=1,\"kPa\",\"ftH2O\")&\"]\"","v":"Trykktap [kPa]"},{"$f":"CONCATENATE(\"Kjøling effekt\",IF(UnitsNo=1,\" [W]\",IF(UnitsNo=2,\" [Btu/h]\",)))","v":"Kjøling effekt [W]"},{"$f":"CONCATENATE(\"Vannmengde, kjøling\",IF(UnitsNo=1,\" [l/h]\",IF(UnitsNo=2,\" [GPM]\",)))","v":"Vannmengde, kjøling [l/h]"},{"$f":"E16","v":"Trykktap [kPa]"},{"$f":"\"Luftmengde\"&IF(UnitsNo=1,\" [m³/h]\",IF(UnitsNo=2,\" [CFM]\",))","v":"Luftmengde [m³/h]"},"Lydtrykk * [dB(A)]","Elektrisk effekt [W]"]
[null,{"$f":"CONCATENATE(\"Clima Beam - \",\" H\",cal!H6,\" B\",cal!M15,\" Type \",cal!L16)","v":"Clima Beam -  H9,6 B33 Type 8"}]
{"$rows_empty":13}
[null,"* Lydtrykk ved antatt romdemping av 8dB (A)"]
[null,"Merk følgende:\nTemperaturen som vanndamp begynner å kondensere i den omgivende luften kalles duggpunktstemperaturen. Kondensat kan skade både enheten og omgivelsene. Enheten slås ikke av når duggpunktet er nådd. Kunden bør derfor sjekke duggpunktstemperaturen og forhindre at temperaturen faller under duggpunktet. Jaga N.V. kan ikke holdes ansvarlig for skader forårsaket av kondensat."]
[null,"JAGA N.V. • Verbindingslaan 16 • 3590 Diepenbeek Belgium • T +32 (0)11 29 41 11 • F +32 (0)11 32 35 78 • info@jaga.be • www.jaga.com                                                         KBC IBAN: BE16 459 250 300 174 BIC:KREDBEBB • ING IBAN: BE97 335 009 564 549 BIC: BBRUBEBB • RPR Hasselt 45.752 • BE0413.382.425"]

{"sheet":"SP","index":7,"n_rows":33,"n_cols":13,"rows_kept":33,"hidden":true,"merged":[[1,1,1,8],[3,5,3,8],[3,9,3,10],[4,1,4,2],[4,5,4,8],[4,9,4,10],[5,5,5,8],[5,9,5,10],[6,5,6,8],[6,9,6,10],[9,9,9,10],[10,9,13,10],[16,1,16,10],[30,1,30,10],[31,1,31,10],[32,1,32,10]]}
[]
[]
[]
[{"$nulls":5},"Taal/Language/Sprache/Langue/Språk/Lengua"]
[{"$nulls":5},"Montaje:",{"$nulls":6},"Empotrado"]
[{"$nulls":5},"Ancho [cm]:",{"$nulls":6},"Con Carcasa"]
[{"$nulls":5},"Nivel de velocidad"]
[]
[null,"Temperaturas",{"$nulls":10},"Copiar todos los datos"]
[null,"Calefacción:",{"$nulls":3},"Enfriamiento:",{"$nulls":3},"Convers. de unidades",null,null,"Unidades-SI"]
[null,"Agua impulsión",null,null,{"$f":"IF(UnitsNo=1,\"°C\",IF(UnitsNo=2,\"°F\",))","v":"°C"},{"$f":"B11","v":"Agua impulsión"},null,null,{"$f":"E11","v":"°C"},null,{"$f":"E11","v":"°C"},null,"Unidades-Imperial"]
[null,"Agua retorno",null,null,{"$f":"E11","v":"°C"},{"$f":"B12","v":"Agua retorno"},null,null,{"$f":"E11","v":"°C"},null,{"$f":"E11","v":"°C"}]
[null,"Ambiente",null,null,{"$f":"E11","v":"°C"},{"$f":"B13","v":"Ambiente"},null,null,{"$f":"E11","v":"°C"},null,{"$f":"E11","v":"°C"}]
[]
[]
[null,{"$f":"CONCATENATE(\"Longitud \",IF(UnitsNo=1,\"[cm]\",IF(UnitsNo=2,\"[inch]\",)))","v":"Longitud [cm]"},{"$f":"CONCATENATE(\"Emisión calefacción\",IF(UnitsNo=1,\" [W]\",IF(UnitsNo=2,\" [Btu/h]\",)))","v":"Emisión calefacción [W]"},{"$f":"CONCATENATE(\"Caudal de agua, calefacción\",IF(UnitsNo=1,\" [l/h]\",IF(UnitsNo=2,\" [GPM]\",)))","v":"Caudal de agua, calefacción [l/h]"},{"$f":"\"Pérdida de carga del agua [\"&IF(UnitsNo=1,\"kPa\",\"ftH2O\")&\"]\"","v":"Pérdida de carga del agua [kPa]"},{"$f":"CONCATENATE(\"Emisión Frío\",IF(UnitsNo=1,\" [W]\",IF(UnitsNo=2,\" [Btu/h]\",)))","v":"Emisión Frío [W]"},{"$f":"CONCATENATE(\"Caudal de agua, Frío\",IF(UnitsNo=1,\" [l/h]\",IF(UnitsNo=2,\" [GPM]\",)))","v":"Caudal de agua, Frío [l/h]"},{"$f":"E16","v":"Pérdida de carga del agua [kPa]"},{"$f":"\"Caudal de aire\"&IF(UnitsNo=1,\" [m³/h]\",IF(UnitsNo=2,\" [CFM]\",))","v":"Caudal de aire [m³/h]"},"Presión sonora * [dB(A)]","Potencia eléctrica absorbida [W]"]
[null,{"$f":"CONCATENATE(\"Clima Beam - \",\" H\",cal!H6,\" B\",cal!M15,\" Type \",cal!L16)","v":"Clima Beam -  H9,6 B33 Type 8"}]
{"$rows_empty":13}
[null,"* Presión sonora en una sala de amortiguación supuesta de 8dB (A)"]
[null,"Atención:\nLa temperatura a la que el vapor de agua comienza a condensarse en el aire ambiente se denomina temperatura del punto de rocío. El condensado puede dañar tanto el dispositivo como su entorno. El dispositivo no se apaga cuando se alcanza el punto de rocío. Por lo tanto, el cliente debe verificar la temperatura del punto de rocío y evitar que la temperatura caiga por debajo del punto de rocío. Jaga N.V. no se hace responsable de los daños causados ​​por el condensado."]
[null,"JAGA N.V. • Verbindingslaan 16 • 3590 Diepenbeek Belgium • T +32 (0)11 29 41 11 • F +32 (0)11 32 35 78 • info@jaga.be • www.jaga.com                                                         KBC IBAN: BE16 459 250 300 174 BIC:KREDBEBB • ING IBAN: BE97 335 009 564 549 BIC: BBRUBEBB • RPR Hasselt 45.752 • BE0413.382.425"]

{"sheet":"SW","index":8,"n_rows":33,"n_cols":13,"rows_kept":33,"hidden":true,"merged":[[1,1,1,8],[3,5,3,8],[3,9,3,10],[4,1,4,2],[4,5,4,8],[4,9,4,10],[5,5,5,8],[5,9,5,10],[6,5,6,8],[6,9,6,10],[9,9,9,10],[10,9,13,10],[16,1,16,10],[29,1,29,6],[30,1,30,10],[31,1,31,10],[32,1,32,10]]}
[]
[]
[]
[{"$nulls":5},"Taal/Language/Sprache/Språk/Jazyk"]
[{"$nulls":5},"Modell:",{"$nulls":6},"Innebygd"]
[{"$nulls":5},"Höjd [cm]:",{"$nulls":6},"Med hus"]
[{"$nulls":5},"Fläkthastighet"]
[]
[null,"Temperaturer",{"$nulls":10},"Kopiera all data"]
[null,"Värme:",{"$nulls":3},"Kyla:",{"$nulls":3},"Enhetssystem",null,null,"SI-enheter"]
[null,"Tillop",null,null,{"$f":"IF(UnitsNo=1,\"°C\",IF(UnitsNo=2,\"°F\",))","v":"°C"},{"$f":"B11","v":"Tillop"},null,null,{"$f":"E11","v":"°C"},null,{"$f":"E11","v":"°C"},null,"Imperiella-enheter"]
[null,"Retur",null,null,{"$f":"E11","v":"°C"},{"$f":"B12","v":"Retur"},null,null,{"$f":"E11","v":"°C"},null,{"$f":"E11","v":"°C"}]
[null,"Rum (torr)",null,null,{"$f":"E11","v":"°C"},{"$f":"B13","v":"Rum (torr)"},null,null,{"$f":"E11","v":"°C"},null,{"$f":"E11","v":"°C"}]
[]
[]
[null,{"$f":"CONCATENATE(\"Längd \",IF(UnitsNo=1,\"[cm]\",IF(UnitsNo=2,\"[inch]\",)))","v":"Längd [cm]"},{"$f":"CONCATENATE(\"Värme effekt\",IF(UnitsNo=1,\" [W]\",IF(UnitsNo=2,\" [Btu/h]\",)))","v":"Värme effekt [W]"},{"$f":"CONCATENATE(\"Vattenflöde, värme\",IF(UnitsNo=1,\" [l/h]\",IF(UnitsNo=2,\" [GPM]\",)))","v":"Vattenflöde, värme [l/h]"},{"$f":"\"Tryckfall, vatten [\"&IF(UnitsNo=1,\"kPa\",\"ftH2O\")&\"]\"","v":"Tryckfall, vatten [kPa]"},{"$f":"CONCATENATE(\"Märkbar kylkapacitet \",IF(UnitsNo=1,\" [W]\",IF(UnitsNo=2,\" [Btu/h]\",)))","v":"Märkbar kylkapacitet  [W]"},{"$f":"CONCATENATE(\"Vattenflöde, kyla \",IF(UnitsNo=1,\" [l/h]\",IF(UnitsNo=2,\" [GPM]\",)))","v":"Vattenflöde, kyla  [l/h]"},{"$f":"E16","v":"Tryckfall, vatten [kPa]"},{"$f":"\"Luftflöde\"&IF(UnitsNo=1,\" [m³/h]\",IF(UnitsNo=2,\" [CFM]\",))","v":"Luftflöde [m³/h]"},"Ljudtryck* [dB(A)]","Effektförbrukning [W]"]
[null,{"$f":"CONCATENATE(\"Clima Beam - \",\" Höjd \",cal!H6,\" djup \",cal!M15,\", typ \",cal!L16)","v":"Clima Beam -  Höjd 9,6 djup 33, typ 8"}]
{"$rows_empty":13}
[null,"* Ljudtryck med en antagen rumsdämpning på 8dB (A)."]
[null,"Uppmärksamhet:\nTemperaturen vid vilken vattenånga börjar kondensera i den omgivande luften kallas daggpunktstemperatur. Kondens kan skada både enheten och dess omgivning. Enheten stängs inte av när daggpunkten uppnås. Kunden bör därför kontrollera daggpunktstemperaturen och förhindra att temperaturen sjunker under daggpunkten. Jaga N.V. kan inte hållas ansvarigt för skador orsakade av kondensat."]
[null,"JAGA N.V. • Verbindingslaan 16 • 3590 Diepenbeek Belgium • T +32 (0)11 29 41 11 • F +32 (0)11 32 35 78 • info@jaga.be • www.jaga.com                                                         KBC IBAN: BE16 459 250 300 174 BIC:KREDBEBB • ING IBAN: BE97 335 009 564 549 BIC: BBRUBEBB • RPR Hasselt 45.752 • BE0413.382.425"]

{"sheet":"TS","index":9,"n_rows":33,"n_cols":13,"rows_kept":33,"hidden":true,"merged":[[1,1,1,8],[3,5,3,8],[3,9,3,10],[4,1,4,2],[4,5,4,8],[4,9,4,10],[5,5,5,8],[5,9,5,10],[6,5,6,8],[6,9,6,10],[9,9,9,10],[10,9,13,10],[16,1,16,10],[29,1,29,6],[30,1,30,10],[31,1,31,10],[32,1,32,10]]}
[]
[]
[]
[{"$nulls":5},"Taal/Language/Sprache/Langue/Språk/Lengua"]
[{"$nulls":5},"Jednotka:",{"$nulls":6},"Vestavba"]
[{"$nulls":5},"Výška [cm]:",{"$nulls":6},"s pouzdrem"]
[{"$nulls":5},"Rychlost"]
[]
[null,"Teploty",{"$nulls":10},"Kopírovat všechna data"]
[null,"Topení:",{"$nulls":3},"Chlazení:",{"$nulls":3},"Převod jednotek",null,null,"Mezinárodní (Sl)"]
[null,"Voda na přívodu",null,null,{"$f":"IF(UnitsNo=1,\"°C\",IF(UnitsNo=2,\"°F\",))","v":"°C"},{"$f":"B11","v":"Voda na přívodu"},null,null,{"$f":"E11","v":"°C"},null,{"$f":"E11","v":"°C"},null,"Imperiální"]
[null,"Voda na zpátečce",null,null,{"$f":"E11","v":"°C"},{"$f":"B12","v":"Voda na zpátečce"},null,null,{"$f":"E11","v":"°C"},null,{"$f":"E11","v":"°C"}]
[null,"Teplota vzduchu",null,null,{"$f":"E11","v":"°C"},{"$f":"B13","v":"Teplota vzduchu"},null,null,{"$f":"E11","v":"°C"},null,{"$f":"E11","v":"°C"}]
[]
[]
[null,{"$f":"CONCATENATE(\"Délka \",IF(UnitsNo=1,\"[cm]\",IF(UnitsNo=2,\"[inch]\",)))","v":"Délka [cm]"},{"$f":"CONCATENATE(\"Výkon Topení\",IF(UnitsNo=1,\" [W]\",IF(UnitsNo=2,\" [Btu/h]\",)))","v":"Výkon Topení [W]"},{"$f":"CONCATENATE(\"Průtok vody, topení\",IF(UnitsNo=1,\" [l/h]\",IF(UnitsNo=2,\" [GPM]\",)))","v":"Průtok vody, topení [l/h]"},{"$f":"\"Tlaková ztráta [\"&IF(UnitsNo=1,\"kPa\",\"ftH2O\")&\"]\"","v":"Tlaková ztráta [kPa]"},{"$f":"CONCATENATE(\"Výkon chlazení Znatelný\",IF(UnitsNo=1,\" [W]\",IF(UnitsNo=2,\" [Btu/h]\",)))","v":"Výkon chlazení Znatelný [W]"},{"$f":"CONCATENATE(\"Průtok vody,chlazen\",IF(UnitsNo=1,\" [l/h]\",IF(UnitsNo=2,\" [GPM]\",)))","v":"Průtok vody,chlazen [l/h]"},{"$f":"E16","v":"Tlaková ztráta [kPa]"},{"$f":"\"Průtok vzduchu\"&IF(UnitsNo=1,\" [m³/h]\",IF(UnitsNo=2,\" [CFM]\",))","v":"Průtok vzduchu [m³/h]"},"Akustický tlak* [dB(A)]","Elektrický výkon [W]"]
[null,{"$f":"CONCATENATE(\"Clima Beam - \",\" Výška \",cal!H6,\" šířka \",cal!M15,\", typ \",cal!L16)","v":"Clima Beam -  Výška 9,6 šířka 33, typ 8"}]
{"$rows_empty":13}
[null,"* Akustický výkon s předpokládaným útlumem místnosti 8 dB (A)."]
[null,"Pozornost:\nTeplota, při které začne vodní pára kondenzovat v okolním vzduchu, se nazývá teplota rosného bodu. Kondenzát může poškodit zařízení i jeho okolí. Po dosažení rosného bodu se zařízení nevypne. Zákazník by proto měl zkontrolovat teplotu rosného bodu a zabránit poklesu teploty pod rosný bod. Společnost Jaga N.V. nenese odpovědnost za škody způsobené kondenzátem."]
[null,"JAGA N.V. • Verbindingslaan 16 • 3590 Diepenbeek Belgium • T +32 (0)11 29 41 11 • F +32 (0)11 32 35 78 • info@jaga.be • www.jaga.com                                                         KBC IBAN: BE16 459 250 300 174 BIC:KREDBEBB • ING IBAN: BE97 335 009 564 549 BIC: BBRUBEBB • RPR Hasselt 45.752 • BE0413.382.425"]

{"sheet":"ExtraTaal1","index":10,"n_rows":33,"n_cols":13,"rows_kept":33,"hidden":true,"merged":[[1,1,1,8],[3,5,3,8],[3,9,3,10],[4,1,4,2],[4,5,4,8],[4,9,4,10],[5,5,5,8],[5,9,5,10],[6,5,6,8],[6,9,6,10],[9,9,9,10],[10,9,13,10],[16,1,16,10],[29,1,29,6],[30,1,30,10],[31,1,31,10],[32,1,32,10]]}
[]
[]
[]
[{"$nulls":5},"Taal/Language/Sprache/Langue/Språk/Lengua"]
[{"$nulls":5},"Model:",{"$nulls":6},"Built-in"]
[{"$nulls":5},"Height [cm]:",{"$nulls":6},"With casing"]
[{"$nulls":5},"Fan speed"]
[]
[null,"Temperatures"]
[null,"Heating:",{"$nulls":3},"Cooling:",{"$nulls":3},"Unit conversion"]
[null,"Supply water",null,null,{"$f":"IF(UnitsNo=1,\"°C\",IF(UnitsNo=2,\"°F\",))","v":"°C"},{"$f":"B11","v":"Supply water"},null,null,{"$f":"E11","v":"°C"},null,{"$f":"E11","v":"°C"}]
[null,"Return water",null,null,{"$f":"E11","v":"°C"},{"$f":"B12","v":"Return water"},null,null,{"$f":"E11","v":"°C"},null,{"$f":"E11","v":"°C"}]
[null,"Entering air",null,null,{"$f":"E11","v":"°C"},{"$f":"B13","v":"Entering air"},null,null,{"$f":"E11","v":"°C"},null,{"$f":"E11","v":"°C"}]
[]
[]
[null,{"$f":"CONCATENATE(\"Length \",IF(UnitsNo=1,\"[cm]\",IF(UnitsNo=2,\"[inch]\",)))","v":"Length [cm]"},{"$f":"CONCATENATE(\"Heating capacity in\",IF(UnitsNo=1,\" [W]\",IF(UnitsNo=2,\" [Btu/h]\",)))","v":"Heating capacity in [W]"},{"$f":"CONCATENATE(\"Water flowrate, heating in\",IF(UnitsNo=1,\" [l/h]\",IF(UnitsNo=2,\" [GPM]\",)))","v":"Water flowrate, heating in [l/h]"},{"$f":"\"Water side pressure loss [\"&IF(UnitsNo=1,\"kPa\",\"ftH2O\")&\"]\"","v":"Water side pressure loss [kPa]"},{"$f":"CONCATENATE(\"Sens. cooling capacity in\",IF(UnitsNo=1,\" [W]\",IF(UnitsNo=2,\" [Btu/h]\",)))","v":"Sens. cooling capacity in [W]"},{"$f":"CONCATENATE(\"Water flowrate, cooling in\",IF(UnitsNo=1,\" [l/h]\",IF(UnitsNo=2,\" [GPM]\",)))","v":"Water flowrate, cooling in [l/h]"},{"$f":"E16","v":"Water side pressure loss [kPa]"},{"$f":"\"Air flowrate\"&IF(UnitsNo=1,\" [m³/h]\",IF(UnitsNo=2,\" [CFM]\",))","v":"Air flowrate [m³/h]"},"Sound pressure* [dB(A)]","Electric power [W]"]
[null,{"$f":"CONCATENATE(\"Clima Beam - \",\" H\",cal!H6,\" B\",cal!M15,\" Type \",cal!L16)","v":"Clima Beam -  H9,6 B33 Type 8"}]
{"$rows_empty":13}
[null,"* Sound pressure at an assumed room damping of 8dB (A)"]
[null,"Attention:\nThe temperature at which water vapor starts to condense in the ambient air is called the dew point temperature. Condensate can damage both the device and its environment. The device does not switch off when the dew point is reached. The customer should therefore check the dew point temperature and prevent the temperature from dropping below the dew point. Jaga N.V. cannot be held liable for damage caused by condensate.\n"]
[null,"JAGA N.V. • Verbindingslaan 16 • 3590 Diepenbeek Belgium • T +32 (0)11 29 41 11 • F +32 (0)11 32 35 78 • info@jaga.be • www.jaga.com                                                         KBC IBAN: BE16 459 250 300 174 BIC:KREDBEBB • ING IBAN: BE97 335 009 564 549 BIC: BBRUBEBB • RPR Hasselt 45.752 • BE0413.382.425"]

{"sheet":"ExtraTaal2","index":11,"n_rows":33,"n_cols":13,"rows_kept":33,"hidden":true,"merged":[[1,1,1,8],[3,5,3,8],[3,9,3,10],[4,1,4,2],[4,5,4,8],[4,9,4,10],[5,5,5,8],[5,9,5,10],[6,5,6,8],[6,9,6,10],[9,9,9,10],[10,9,13,10],[16,1,16,10],[29,1,29,6],[30,1,30,10],[31,1,31,10],[32,1,32,10]]}
[]
[]
[]
[{"$nulls":5},"Taal/Language/Sprache/Langue/Språk/Lengua"]
[{"$nulls":5},"Model:",{"$nulls":6},"Built-in"]
[{"$nulls":5},"Height [cm]:",{"$nulls":6},"With casing"]
[{"$nulls":5},"Fan speed"]
[]
[null,"Temperatures"]
[null,"Heating:",{"$nulls":3},"Cooling:",{"$nulls":3},"Unit conversion"]
[null,"Supply water",null,null,{"$f":"IF(UnitsNo=1,\"°C\",IF(UnitsNo=2,\"°F\",))","v":"°C"},{"$f":"B11","v":"Supply water"},null,null,{"$f":"E11","v":"°C"},null,{"$f":"E11","v":"°C"}]
[null,"Return water",null,null,{"$f":"E11","v":"°C"},{"$f":"B12","v":"Return water"},null,null,{"$f":"E11","v":"°C"},null,{"$f":"E11","v":"°C"}]
[null,"Entering air",null,null,{"$f":"E11","v":"°C"},{"$f":"B13","v":"Entering air"},null,null,{"$f":"E11","v":"°C"},null,{"$f":"E11","v":"°C"}]
[]
[]
[null,{"$f":"CONCATENATE(\"Length \",IF(UnitsNo=1,\"[cm]\",IF(UnitsNo=2,\"[inch]\",)))","v":"Length [cm]"},{"$f":"CONCATENATE(\"Heating capacity in\",IF(UnitsNo=1,\" [W]\",IF(UnitsNo=2,\" [Btu/h]\",)))","v":"Heating capacity in [W]"},{"$f":"CONCATENATE(\"Water flowrate, heating in\",IF(UnitsNo=1,\" [l/h]\",IF(UnitsNo=2,\" [GPM]\",)))","v":"Water flowrate, heating in [l/h]"},{"$f":"\"Water side pressure loss [\"&IF(UnitsNo=1,\"kPa\",\"ftH2O\")&\"]\"","v":"Water side pressure loss [kPa]"},{"$f":"CONCATENATE(\"Sens. cooling capacity in\",IF(UnitsNo=1,\" [W]\",IF(UnitsNo=2,\" [Btu/h]\",)))","v":"Sens. cooling capacity in [W]"},{"$f":"CONCATENATE(\"Water flowrate, cooling in\",IF(UnitsNo=1,\" [l/h]\",IF(UnitsNo=2,\" [GPM]\",)))","v":"Water flowrate, cooling in [l/h]"},{"$f":"E16","v":"Water side pressure loss [kPa]"},{"$f":"\"Air flowrate\"&IF(UnitsNo=1,\" [m³/h]\",IF(UnitsNo=2,\" [CFM]\",))","v":"Air flowrate [m³/h]"},"Sound pressure* [dB(A)]","Electric power [W]"]
[null,{"$f":"CONCATENATE(\"Clima Beam - \",\" H\",cal!H6,\" B\",cal!M15,\" Type \",cal!L16)","v":"Clima Beam -  H9,6 B33 Type 8"}]
{"$rows_empty":13}
[null,"* Sound pressure at an assumed room damping of 8dB (A)"]
[null,"Attention:\nThe temperature at which water vapor starts to condense in the ambient air is called the dew point temperature. Condensate can damage both the device and its environment. The device does not switch off when the dew point is reached. The customer should therefore check the dew point temperature and prevent the temperature from dropping below the dew point. Jaga N.V. cannot be held liable for damage caused by condensate.\n"]
[null,"JAGA N.V. • Verbindingslaan 16 • 3590 Diepenbeek Belgium • T +32 (0)11 29 41 11 • F +32 (0)11 32 35 78 • info@jaga.be • www.jaga.com                                                         KBC IBAN: BE16 459 250 300 174 BIC:KREDBEBB • ING IBAN: BE97 335 009 564 549 BIC: BBRUBEBB • RPR Hasselt 45.752 • BE0413.382.425"]

{"sheet":"ExtraTaal3","index":12,"n_rows":33,"n_cols":13,"rows_kept":33,"hidden":true,"merged":[[1,1,1,8],[3,5,3,8],[3,9,3,10],[4,1,4,2],[4,5,4,8],[4,9,4,10],[5,5,5,8],[5,9,5,10],[6,5,6,8],[6,9,6,10],[9,9,9,10],[10,9,13,10],[16,1,16,10],[29,1,29,6],[30,1,30,10],[31,1,31,10],[32,1,32,10]]}
[]
[]
[]
[{"$nulls":5},"Taal/Language/Sprache/Langue/Språk/Lengua"]
[{"$nulls":5},"Model:",{"$nulls":6},"Built-in"]
[{"$nulls":5},"Height [cm]:",{"$nulls":6},"With casing"]
[{"$nulls":5},"Fan speed"]
[]
[null,"Temperatures"]
[null,"Heating:",{"$nulls":3},"Cooling:",{"$nulls":3},"Unit conversion"]
[null,"Supply water",null,null,{"$f":"IF(UnitsNo=1,\"°C\",IF(UnitsNo=2,\"°F\",))","v":"°C"},{"$f":"B11","v":"Supply water"},null,null,{"$f":"E11","v":"°C"},null,{"$f":"E11","v":"°C"}]
[null,"Return water",null,null,{"$f":"E11","v":"°C"},{"$f":"B12","v":"Return water"},null,null,{"$f":"E11","v":"°C"},null,{"$f":"E11","v":"°C"}]
[null,"Entering air",null,null,{"$f":"E11","v":"°C"},{"$f":"B13","v":"Entering air"},null,null,{"$f":"E11","v":"°C"},null,{"$f":"E11","v":"°C"}]
[]
[]
[null,{"$f":"CONCATENATE(\"Length \",IF(UnitsNo=1,\"[cm]\",IF(UnitsNo=2,\"[inch]\",)))","v":"Length [cm]"},{"$f":"CONCATENATE(\"Heating capacity in\",IF(UnitsNo=1,\" [W]\",IF(UnitsNo=2,\" [Btu/h]\",)))","v":"Heating capacity in [W]"},{"$f":"CONCATENATE(\"Water flowrate, heating in\",IF(UnitsNo=1,\" [l/h]\",IF(UnitsNo=2,\" [GPM]\",)))","v":"Water flowrate, heating in [l/h]"},{"$f":"\"Water side pressure loss [\"&IF(UnitsNo=1,\"kPa\",\"ftH2O\")&\"]\"","v":"Water side pressure loss [kPa]"},{"$f":"CONCATENATE(\"Sens. cooling capacity in\",IF(UnitsNo=1,\" [W]\",IF(UnitsNo=2,\" [Btu/h]\",)))","v":"Sens. cooling capacity in [W]"},{"$f":"CONCATENATE(\"Water flowrate, cooling in\",IF(UnitsNo=1,\" [l/h]\",IF(UnitsNo=2,\" [GPM]\",)))","v":"Water flowrate, cooling in [l/h]"},{"$f":"E16","v":"Water side pressure loss [kPa]"},{"$f":"\"Air flowrate\"&IF(UnitsNo=1,\" [m³/h]\",IF(UnitsNo=2,\" [CFM]\",))","v":"Air flowrate [m³/h]"},"Sound pressure* [dB(A)]","Electric power [W]"]
[null,{"$f":"CONCATENATE(\"Clima Beam - \",\" H\",cal!H6,\" B\",cal!M15,\" Type \",cal!L16)","v":"Clima Beam -  H9,6 B33 Type 8"}]
{"$rows_empty":13}
[null,"* Sound pressure at an assumed room damping of 8dB (A)"]
[null,"Attention:\nThe temperature at which water vapor starts to condense in the ambient air is called the dew point temperature. Condensate can damage both the device and its environment. The device does not switch off when the dew point is reached. The customer should therefore check the dew point temperature and prevent the temperature from dropping below the dew point. Jaga N.V. cannot be held liable for damage caused by condensate.\n"]
[null,"JAGA N.V. • Verbindingslaan 16 • 3590 Diepenbeek Belgium • T +32 (0)11 29 41 11 • F +32 (0)11 32 35 78 • info@jaga.be • www.jaga.com                                                         KBC IBAN: BE16 459 250 300 174 BIC:KREDBEBB • ING IBAN: BE97 335 009 564 549 BIC: BBRUBEBB • RPR Hasselt 45.752 • BE0413.382.425"]