{"text_format":"3","workbook":"xlsx","n_sheets":13,"sheets":["Clima Canal","cal","NL","EN","DE","FR","NR","SP","SW","TS","ExtraTaal1","ExtraTaal2","ExtraTaal3"],"not_rendered":{"images":5,"macros":1,"defined_names":16,"comments":1},"read":"whole","date_system":"1900"}

{"sheet":"Clima Canal","index":0,"n_rows":73,"n_cols":16,"rows_kept":73,"merged":[[0,12,0,16],[1,1,1,11],[1,12,1,16],[2,12,2,16],[3,6,3,9],[3,10,4,11],[3,12,3,13],[4,1,4,3],[4,6,4,9],[4,12,4,13],[5,6,5,9],[5,10,5,13],[7,12,7,13],[8,12,8,13],[9,1,9,3],[9,6,9,9],[9,12,9,13],[10,1,10,3],[10,6,10,9],[10,12,13,13],[11,1,11,3],[11,6,11,9],[12,6,12,9],[16,1,16,15],[22,1,22,15],[28,1,28,15],[34,1,34,15],[40,1,40,15],[46,1,46,15],[52,1,52,15],[58,1,58,15],[64,1,64,15]]}
[]
[null,"Selectiontool Clima Canal"]
[]
[{"$nulls":6},"Taal/Language/Sprache",0,0,0,"English"]
[{"$nulls":6},"Langue/Språk/Lengua/Jazyk"]
[{"$nulls":6},{"$f":"IF(cal!$S$7=1,\"Uitvoering\",IF(cal!$S$7=2,\"Version\",IF(cal!$S$7=3,\"Ausfürhung\",IF(cal!$S$7=4,\"Version\",IF(cal!$S$7=5,\"Modell\",IF(cal!$S$7=6,\"Version\",IF(cal!$S$7=7,\"Modell\",IF(cal!$S$7=8,\"Verze\",IF(cal!$S$7=9,\"Version\",IF(cal!$S$7=10,\"Version\",IF(cal!$S$7=11,\"Version\",)))))))))))","v":"Version"},{"$nulls":3},"Clima H13 B32 2P"]
[]
[null,{"$f":"cal!B7","v":"Temperatures"},{"$nulls":10},{"$f":"cal!M7","v":"Altitude"}]
[null,{"$f":"cal!B8","v":"Heating:"},{"$nulls":4},{"$f":"cal!G8","v":"Cooling:"},{"$nulls":5},0,0,{"$f":"cal!O8","v":"m"}]
[null,{"$f":"cal!B9","v":"Inlet temp."},{"$f":"cal!C9","v":0},{"$f":"cal!D9","v":0},75,null,{"$f":"cal!G9","v":"Inlet temp."},{"$f":"cal!H9","v":0},{"$f":"cal!I9","v":0},{"$f":"cal!J9","v":0},16,null,{"$f":"cal!M9","v":"Unit conversion"}]
[null,{"$f":"cal!B10","v":"Return temp."},{"$f":"cal!C10","v":0},{"$f":"cal!D10","v":0},65,null,{"$f":"cal!G10","v":"Return temp."},{"$f":"cal!H10","v":0},{"$f":"cal!I10","v":0},{"$f":"cal!J10","v":0},18]
[null,{"$f":"cal!B11","v":"Room temp."},{"$f":"cal!C11","v":0},{"$f":"cal!D11","v":0},20,null,{"$f":"cal!G11","v":"Room temp."},{"$f":"cal!H11","v":0},{"$f":"cal!I11","v":0},{"$f":"cal!J11","v":0},27]
[{"$nulls":6},{"$f":"cal!G12","v":"Relative humidity"},{"$nulls":3},{"v":0.5,"d":"50%"}]
[]
[{"$nulls":3},{"$f":"cal!D14","v":{"v":0,"d":"0.0000"}},{"$f":"cal!E14","v":{"v":1,"d":"1.0000"}},{"$f":"cal!F14","v":{"v":1,"d":"1.0000"}},{"v":3.4121416331,"d":"3.4121"},{"$f":"cal!H14","v":{"v":1,"d":"1.0000"}},{"$f":"cal!I14","v":{"v":1,"d":"1.0000"}},{"$f":"cal!J14","v":{"v":1,"d":"1.0000"}},{"$f":"cal!K14","v":0},{"$f":"cal!L14","v":0},{"$f":"cal!M14","v":0},{"$f":"cal!N14","v":{"v":1,"d":"1.0000"}}]
[null,{"$f":"cal!B15","v":"Speed level:"},{"$f":"cal!C15","v":"Control voltage [V]"},{"$f":"cal!D15","v":"Heat output * 75/65/20 [W]"},{"$f":"cal!E15","v":"Water flowrate, heating [l/h]"},{"$f":"cal!F15","v":"Watersided pressure loss [kPa]"},{"$f":"cal!G15","v":"Sens. cooling capacity * 16/18/27 [W]"},{"$f":"cal!H15","v":"Tot. cooling capacity 16/18/27 [W]"},{"$f":"cal!I15","v":"Water flowrate, cooling [l/h]"},{"$f":"cal!J15","v":"Watersided pressure loss [kPa]"},{"$f":"cal!K15","v":"Sound pressure *** [dB(A)]"},{"$f":"cal!L15","v":"Sound power ** [dB(A)]"},{"$f":"cal!M15","v":"Electrical power [W]"},{"$f":"cal!N15","v":"Air flowrate [m³/h]"},{"$f":"cal!O15","v":"Air exhaust temp. heating [°C]"},{"$f":"cal!P15","v":"Air exhaust temp. cooling [°C]"}]
[null,{"$f":"cal!B16","v":"Clima Canal height 13 cm width 32 cm length 70 cm (Type 1)"}]
[null,{"$f":"cal!B17","v":{"v":0.2,"d":"20%"}},{"$f":"cal!C17","v":2},{"$f":"IF($E$10<=$E$11,cal!$AC$3,cal!D17)","v":{"v":312.780863986964,"d":"313"}},{"$f":"IF($E$10<=$E$11,\"\",cal!E17)","v":27},{"$f":"IF($E$10<=$E$11,\"\",cal!F17)","v":{"v":0.011330472972336471,"d":"0.01"}},{"$f":"IF($K$10>=$K$11,cal!$AC$3,cal!G17)","v":{"v":67.30637191738002,"d":"67"}},{"$f":"IF($K$10>=$K$11,\"\",cal!H17)","v":{"v":67.30637191738002,"d":"67"}},{"$f":"IF($K$10>=$K$11,\"\",cal!I17)","v":29},{"$f":"IF($K$10>=$K$11,\"\",cal!J17)","v":{"v":0.012997932122495996,"d":"0.01"}},{"$f":"cal!K17","v":{"v":16,"d":"16.0"}},{"$f":"cal!L17","v":{"v":24,"d":"24.0"}},{"$f":"cal!M17","v":{"v":0.984,"d":"1.0"}},{"$f":"cal!N17","v":35}]
[null,{"$f":"cal!B18","v":{"v":0.4,"d":"40%"}},{"$f":"cal!C18","v":4},{"$f":"IF($E$10<=$E$11,cal!$AC$4,cal!D18)","v":{"v":691.7684114772115,"d":"692"}},{"$f":"IF($E$10<=$E$11,\"\",cal!E18)","v":59},{"$f":"IF($E$10<=$E$11,\"\",cal!F18)","v":{"v":0.050875474673144246,"d":"0.05"}},{"$f":"IF($K$10>=$K$11,cal!$AC$5,cal!G18)","v":{"v":122.2114852533066,"d":"122"}},{"$f":"IF($K$10>=$K$11,\"\",cal!H18)","v":{"v":122.2114852533066,"d":"122"}},{"$f":"IF($K$10>=$K$11,\"\",cal!I18)","v":53},{"$f":"IF($K$10>=$K$11,\"\",cal!J18)","v":{"v":0.04140201745291053,"d":"0.04"}},{"$f":"cal!K18","v":{"v":19,"d":"19.0"}},{"$f":"cal!L18","v":{"v":27,"d":"27.0"}},{"$f":"cal!M18","v":{"v":1.6320000000000001,"d":"1.6"}},{"$f":"cal!N18","v":44}]
[null,{"$f":"cal!B19","v":{"v":0.6,"d":"60%"}},{"$f":"cal!C19","v":6},{"$f":"IF($E$10<=$E$11,\"\",cal!D19)","v":{"v":1031.2359042995408,"d":"1031"}},{"$f":"IF($E$10<=$E$11,\"\",cal!E19)","v":89},{"$f":"IF($E$10<=$E$11,\"\",cal!F19)","v":{"v":0.11208162007510875,"d":"0.11"}},{"$f":"IF($K$10>=$K$11,\"\",cal!G19)","v":{"v":174.53607497828463,"d":"175"}},{"$f":"IF($K$10>=$K$11,\"\",cal!H19)","v":{"v":174.53607497828463,"d":"175"}},{"$f":"IF($K$10>=$K$11,\"\",cal!I19)","v":75},{"$f":"IF($K$10>=$K$11,\"\",cal!J19)","v":{"v":0.08067263097288387,"d":"0.08"}},{"$f":"cal!K19","v":{"v":27,"d":"27.0"}},{"$f":"cal!L19","v":{"v":35,"d":"35.0"}},{"$f":"cal!M19","v":3.2},{"$f":"cal!N19","v":85}]
[null,{"$f":"cal!B20","v":{"v":0.8,"d":"80%"}},{"$f":"cal!C20","v":8},{"$f":"IF($E$10<=$E$11,\"\",cal!D20)","v":{"v":1331.183342453952,"d":"1331"}},{"$f":"IF($E$10<=$E$11,\"\",cal!E20)","v":114},{"$f":"IF($E$10<=$E$11,\"\",cal!F20)","v":{"v":0.1803446229891348,"d":"0.18"}},{"$f":"IF($K$10>=$K$11,\"\",cal!G20)","v":{"v":224.28014109231404,"d":"224"}},{"$f":"IF($K$10>=$K$11,\"\",cal!H20)","v":{"v":224.28014109231404,"d":"224"}},{"$f":"IF($K$10>=$K$11,\"\",cal!I20)","v":96},{"$f":"IF($K$10>=$K$11,\"\",cal!J20)","v":{"v":0.12963111643218425,"d":"0.13"}},{"$f":"cal!K20","v":{"v":35,"d":"35.0"}},{"$f":"cal!L20","v":{"v":43,"d":"43.0"}},{"$f":"cal!M20","v":5.9},{"$f":"cal!N20","v":117}]
[null,{"$f":"cal!B21","v":{"v":1,"d":"100%"}},{"$f":"cal!C21","v":10},{"$f":"IF($E$10<=$E$11,\"\",cal!D21)","v":{"v":1591.6107259404453,"d":"1592"}},{"$f":"IF($E$10<=$E$11,\"\",cal!E21)","v":137},{"$f":"IF($E$10<=$E$11,\"\",cal!F21)","v":{"v":0.25671634719537284,"d":"0.26"}},{"$f":"IF($K$10>=$K$11,\"\",cal!G21)","v":{"v":271.4436835953948,"d":"271"}},{"$f":"IF($K$10>=$K$11,\"\",cal!H21)","v":{"v":271.4436835953948,"d":"271"}},{"$f":"IF($K$10>=$K$11,\"\",cal!I21)","v":117},{"$f":"IF($K$10>=$K$11,\"\",cal!J21)","v":{"v":0.18957342604976077,"d":"0.19"}},{"$f":"cal!K21","v":{"v":38,"d":"38.0"}},{"$f":"cal!L21","v":{"v":46,"d":"46.0"}},{"$f":"cal!M21","v":8.8},{"$f":"cal!N21","v":137}]
[null,{"$f":"cal!B22","v":"Clima Canal height 13 cm width 32 cm length 100 cm (Type 2)"}]
[null,{"$f":"cal!B23","v":{"v":0.2,"d":"20%"}},{"$f":"cal!C23","v":2},{"$f":"IF($E$10<=$E$11,cal!$AC$3,cal!D23)","v":{"v":592.8831302439467,"d":"593"}},{"$f":"IF($E$10<=$E$11,\"\",cal!E23)","v":51},{"$f":"IF($E$10<=$E$11,\"\",cal!F23)","v":{"v":0.04974904941793316,"d":"0.05"}},{"$f":"IF($K$10>=$K$11,cal!$AC$3,cal!G23)","v":{"v":127.58073482846659,"d":"128"}},{"$f":"IF($K$10>=$K$11,\"\",cal!H23)","v":{"v":127.58073482846659,"d":"128"}},{"$f":"IF($K$10>=$K$11,\"\",cal!I23)","v":55},{"$f":"IF($K$10>=$K$11,\"\",cal!J23)","v":{"v":0.05738165864004263,"d":"0.06"}},{"$f":"cal!K23","v":{"v":20,"d":"20.0"}},{"$f":"cal!L23","v":{"v":28,"d":"28.0"}},{"$f":"cal!M23","v":{"v":1.008,"d":"1.0"}},{"$f":"cal!N23","v":44}]
[null,{"$f":"cal!B24","v":{"v":0.4,"d":"40%"}},{"$f":"cal!C24","v":4},{"$f":"IF($E$10<=$E$11,cal!$AC$4,cal!D24)","v":{"v":1311.26251130755,"d":"1311"}},{"$f":"IF($E$10<=$E$11,\"\",cal!E24)","v":113},{"$f":"IF($E$10<=$E$11,\"\",cal!F24)","v":{"v":0.2238234701257517,"d":"0.22"}},{"$f":"IF($K$10>=$K$11,cal!$AC$5,cal!G24)","v":{"v":231.65460637567074,"d":"232"}},{"$f":"IF($K$10>=$K$11,\"\",cal!H24)","v":{"v":231.65460637567074,"d":"232"}},{"$f":"IF($K$10>=$K$11,\"\",cal!I24)","v":100},{"$f":"IF($K$10>=$K$11,\"\",cal!J24)","v":{"v":0.1776521366573867,"d":"0.18"}},{"$f":"cal!K24","v":{"v":25,"d":"25.0"}},{"$f":"cal!L24","v":{"v":33,"d":"33.0"}},{"$f":"cal!M24","v":1.8},{"$f":"cal!N24","v":85}]
[null,{"$f":"cal!B25","v":{"v":0.6,"d":"60%"}},{"$f":"cal!C25","v":6},{"$f":"IF($E$10<=$E$11,\"\",cal!D25)","v":{"v":1954.7307439707715,"d":"1955"}},{"$f":"IF($E$10<=$E$11,\"\",cal!E25)","v":168},{"$f":"IF($E$10<=$E$11,\"\",cal!F25)","v":{"v":0.47367105666773596,"d":"0.47"}},{"$f":"IF($K$10>=$K$11,\"\",cal!G25)","v":{"v":330.8370376454052,"d":"331"}},{"$f":"IF($K$10>=$K$11,\"\",cal!H25)","v":{"v":330.8370376454052,"d":"331"}},{"$f":"IF($K$10>=$K$11,\"\",cal!I25)","v":142},{"$f":"IF($K$10>=$K$11,\"\",cal!J25)","v":{"v":0.3447021434795522,"d":"0.34"}},{"$f":"cal!K25","v":{"v":29,"d":"29.0"}},{"$f":"cal!L25","v":{"v":37,"d":"37.0"}},{"$f":"cal!M25","v":3.2},{"$f":"cal!N25","v":133}]
[null,{"$f":"cal!B26","v":{"v":0.8,"d":"80%"}},{"$f":"cal!C26","v":8},{"$f":"IF($E$10<=$E$11,\"\",cal!D26)","v":{"v":2523.2878282336105,"d":"2523"}},{"$f":"IF($E$10<=$E$11,\"\",cal!E26)","v":217},{"$f":"IF($E$10<=$E$11,\"\",cal!F26)","v":{"v":0.7683987652022146,"d":"0.77"}},{"$f":"IF($K$10>=$K$11,\"\",cal!G26)","v":{"v":425.1280286376699,"d":"425"}},{"$f":"IF($K$10>=$K$11,\"\",cal!H26)","v":{"v":425.1280286376699,"d":"425"}},{"$f":"IF($K$10>=$K$11,\"\",cal!I26)","v":183},{"$f":"IF($K$10>=$K$11,\"\",cal!J26)","v":{"v":0.5567839569891521,"d":"0.56"}},{"$f":"cal!K26","v":{"v":36,"d":"36.0"}},{"$f":"cal!L26","v":{"v":44,"d":"44.0"}},{"$f":"cal!M26","v":6.4},{"$f":"cal!N26","v":168}]
[null,{"$f":"cal!B27","v":{"v":1,"d":"100%"}},{"$f":"cal!C27","v":10},{"$f":"IF($E$10<=$E$11,\"\",cal!D27)","v":{"v":3016.9337640960675,"d":"3017"}},{"$f":"IF($E$10<=$E$11,\"\",cal!E27)","v":259},{"$f":"IF($E$10<=$E$11,\"\",cal!F27)","v":{"v":1.073590911618762,"d":"1.07"}},{"$f":"IF($K$10>=$K$11,\"\",cal!G27)","v":{"v":514.5275793524648,"d":"515"}},{"$f":"IF($K$10>=$K$11,\"\",cal!H27)","v":{"v":514.5275793524648,"d":"515"}},{"$f":"IF($K$10>=$K$11,\"\",cal!I27)","v":221},{"$f":"IF($K$10>=$K$11,\"\",cal!J27)","v":{"v":0.7953928614947363,"d":"0.80"}},{"$f":"cal!K27","v":{"v":39,"d":"39.0"}},{"$f":"cal!L27","v":{"v":47,"d":"47.0"}},{"$f":"cal!M27","v":10.3},{"$f":"cal!N27","v":202}]
[null,{"$f":"cal!B28","v":"Clima Canal height 13 cm width 32 cm length 120 cm (Type 3)"}]
[null,{"$f":"cal!B29","v":{"v":0.2,"d":"20%"}},{"$f":"cal!C29","v":2},{"$f":"IF($E$10<=$E$11,cal!$AC$3,cal!D29)","v":{"v":779.6179744152683,"d":"780"}},{"$f":"IF($E$10<=$E$11,\"\",cal!E29)","v":67},{"$f":"IF($E$10<=$E$11,\"\",cal!F29)","v":{"v":0.09568037019898874,"d":"0.10"}},{"$f":"IF($K$10>=$K$11,cal!$AC$3,cal!G29)","v":{"v":167.76364343585763,"d":"168"}},{"$f":"IF($K$10>=$K$11,\"\",cal!H29)","v":{"v":167.76364343585763,"d":"168"}},{"$f":"IF($K$10>=$K$11,\"\",cal!I29)","v":72},{"$f":"IF($K$10>=$K$11,\"\",cal!J29)","v":{"v":0.10950426958037363,"d":"0.11"}},{"$f":"cal!K29","v":{"v":20,"d":"20.0"}},{"$f":"cal!L29","v":{"v":28,"d":"28.0"}},{"$f":"cal!M29","v":1.4},{"$f":"cal!N29","v":49}]
[null,{"$f":"cal!B30","v":{"v":0.4,"d":"40%"}},{"$f":"cal!C30","v":4},{"$f":"IF($E$10<=$E$11,cal!$AC$4,cal!D30)","v":{"v":1724.2585778611092,"d":"1724"}},{"$f":"IF($E$10<=$E$11,\"\",cal!E30)","v":148},{"$f":"IF($E$10<=$E$11,\"\",cal!F30)","v":{"v":0.42283763794736967,"d":"0.42"}},{"$f":"IF($K$10>=$K$11,cal!$AC$5,cal!G30)","v":{"v":304.6166871239135,"d":"305"}},{"$f":"IF($K$10>=$K$11,\"\",cal!H30)","v":{"v":304.6166871239135,"d":"305"}},{"$f":"IF($K$10>=$K$11,\"\",cal!I30)","v":131},{"$f":"IF($K$10>=$K$11,\"\",cal!J30)","v":{"v":0.3363694540454542,"d":"0.34"}},{"$f":"cal!K30","v":{"v":26,"d":"26.0"}},{"$f":"cal!L30","v":{"v":34,"d":"34.0"}},{"$f":"cal!M30","v":2.4},{"$f":"cal!N30","v":114}]
[null,{"$f":"cal!B31","v":{"v":0.6,"d":"60%"}},{"$f":"cal!C31","v":6},{"$f":"IF($E$10<=$E$11,\"\",cal!D31)","v":{"v":2570.3939704182585,"d":"2570"}},{"$f":"IF($E$10<=$E$11,\"\",cal!E31)","v":221},{"$f":"IF($E$10<=$E$11,\"\",cal!F31)","v":{"v":0.8967442523572674,"d":"0.90"}},{"$f":"IF($K$10>=$K$11,\"\",cal!G31)","v":{"v":435.03767942348554,"d":"435"}},{"$f":"IF($K$10>=$K$11,\"\",cal!H31)","v":{"v":435.03767942348554,"d":"435"}},{"$f":"IF($K$10>=$K$11,\"\",cal!I31)","v":187},{"$f":"IF($K$10>=$K$11,\"\",cal!J31)","v":{"v":0.6555956017793811,"d":"0.66"}},{"$f":"cal!K31","v":{"v":30,"d":"30.0"}},{"$f":"cal!L31","v":{"v":38,"d":"38.0"}},{"$f":"cal!M31","v":4.2},{"$f":"cal!N31","v":174}]
[null,{"$f":"cal!B32","v":{"v":0.8,"d":"80%"}},{"$f":"cal!C32","v":8},{"$f":"IF($E$10<=$E$11,\"\",cal!D32)","v":{"v":3318.024152086716,"d":"3318"}},{"$f":"IF($E$10<=$E$11,\"\",cal!E32)","v":285},{"$f":"IF($E$10<=$E$11,\"\",cal!F32)","v":{"v":1.4446655180391863,"d":"1.44"}},{"$f":"IF($K$10>=$K$11,\"\",cal!G32)","v":{"v":559.0266203345737,"d":"559"}},{"$f":"IF($K$10>=$K$11,\"\",cal!H32)","v":{"v":559.0266203345737,"d":"559"}},{"$f":"IF($K$10>=$K$11,\"\",cal!I32)","v":240},{"$f":"IF($K$10>=$K$11,\"\",cal!J32)","v":{"v":1.0467168154444026,"d":"1.05"}},{"$f":"cal!K32","v":{"v":37,"d":"37.0"}},{"$f":"cal!L32","v":{"v":45,"d":"45.0"}},{"$f":"cal!M32","v":7.2},{"$f":"cal!N32","v":235}]
[null,{"$f":"cal!B33","v":{"v":1,"d":"100%"}},{"$f":"cal!C33","v":10},{"$f":"IF($E$10<=$E$11,\"\",cal!D33)","v":{"v":3967.1491228664822,"d":"3967"}},{"$f":"IF($E$10<=$E$11,\"\",cal!E33)","v":341},{"$f":"IF($E$10<=$E$11,\"\",cal!F33)","v":{"v":2.0223100015679076,"d":"2.02"}},{"$f":"IF($K$10>=$K$11,\"\",cal!G33)","v":{"v":676.5835098571781,"d":"677"}},{"$f":"IF($K$10>=$K$11,\"\",cal!H33)","v":{"v":676.5835098571781,"d":"677"}},{"$f":"IF($K$10>=$K$11,\"\",cal!I33)","v":291},{"$f":"IF($K$10>=$K$11,\"\",cal!J33)","v":{"v":1.5022166024091557,"d":"1.50"}},{"$f":"cal!K33","v":{"v":40,"d":"40.0"}},{"$f":"cal!L33","v":{"v":48,"d":"48.0"}},{"$f":"cal!M33","v":10.6},{"$f":"cal!N33","v":273}]
[null,{"$f":"cal!B34","v":"Clima Canal height 13 cm width 32 cm length 140 cm (Type 4)"}]
[null,{"$f":"cal!B35","v":{"v":0.2,"d":"20%"}},{"$f":"cal!C35","v":2},{"$f":"IF($E$10<=$E$11,cal!$AC$3,cal!D35)","v":{"v":966.35281858659,"d":"966"}},{"$f":"IF($E$10<=$E$11,\"\",cal!E35)","v":83},{"$f":"IF($E$10<=$E$11,\"\",cal!F35)","v":{"v":0.16127172062869963,"d":"0.16"}},{"$f":"IF($K$10>=$K$11,cal!$AC$3,cal!G35)","v":{"v":207.94655204324866,"d":"208"}},{"$f":"IF($K$10>=$K$11,\"\",cal!H35)","v":{"v":207.94655204324866,"d":"208"}},{"$f":"IF($K$10>=$K$11,\"\",cal!I35)","v":89},{"$f":"IF($K$10>=$K$11,\"\",cal!J35)","v":{"v":0.18365358149059038,"d":"0.18"}},{"$f":"cal!K35","v":21.5},{"$f":"cal!L35","v":29.5},{"$f":"cal!M35","v":{"v":1.992,"d":"2.0"}},{"$f":"cal!N35","v":79}]
[null,{"$f":"cal!B36","v":{"v":0.4,"d":"40%"}},{"$f":"cal!C36","v":4},{"$f":"IF($E$10<=$E$11,cal!$AC$4,cal!D36)","v":{"v":2137.2546444146683,"d":"2137"}},{"$f":"IF($E$10<=$E$11,\"\",cal!E36)","v":184},{"$f":"IF($E$10<=$E$11,\"\",cal!F36)","v":{"v":0.7101173764124832,"d":"0.71"}},{"$f":"IF($K$10>=$K$11,cal!$AC$5,cal!G36)","v":{"v":377.5787678721562,"d":"378"}},{"$f":"IF($K$10>=$K$11,\"\",cal!H36)","v":{"v":377.5787678721562,"d":"378"}},{"$f":"IF($K$10>=$K$11,\"\",cal!I36)","v":162},{"$f":"IF($K$10>=$K$11,\"\",cal!J36)","v":{"v":0.5602160976567919,"d":"0.56"}},{"$f":"cal!K36","v":{"v":26,"d":"26.0"}},{"$f":"cal!L36","v":{"v":34,"d":"34.0"}},{"$f":"cal!M36","v":{"v":3.4320000000000004,"d":"3.4"}},{"$f":"cal!N36","v":129}]
[null,{"$f":"cal!B37","v":{"v":0.6,"d":"60%"}},{"$f":"cal!C37","v":6},{"$f":"IF($E$10<=$E$11,\"\",cal!D37)","v":{"v":3186.0571968657455,"d":"3186"}},{"$f":"IF($E$10<=$E$11,\"\",cal!E37)","v":274},{"$f":"IF($E$10<=$E$11,\"\",cal!F37)","v":{"v":1.4905040937234273,"d":"1.49"}},{"$f":"IF($K$10>=$K$11,\"\",cal!G37)","v":{"v":539.2383212015659,"d":"539"}},{"$f":"IF($K$10>=$K$11,\"\",cal!H37)","v":{"v":539.2383212015659,"d":"539"}},{"$f":"IF($K$10>=$K$11,\"\",cal!I37)","v":232},{"$f":"IF($K$10>=$K$11,\"\",cal!J37)","v":{"v":1.093400589676547,"d":"1.09"}},{"$f":"cal!K37","v":{"v":31,"d":"31.0"}},{"$f":"cal!L37","v":{"v":39,"d":"39.0"}},{"$f":"cal!M37","v":6.4},{"$f":"cal!N37","v":218}]
[null,{"$f":"cal!B38","v":{"v":0.8,"d":"80%"}},{"$f":"cal!C38","v":8},{"$f":"IF($E$10<=$E$11,\"\",cal!D38)","v":{"v":4112.760475939822,"d":"4113"}},{"$f":"IF($E$10<=$E$11,\"\",cal!E38)","v":354},{"$f":"IF($E$10<=$E$11,\"\",cal!F38)","v":{"v":2.401525268594161,"d":"2.40"}},{"$f":"IF($K$10>=$K$11,\"\",cal!G38)","v":{"v":692.9252120314776,"d":"693"}},{"$f":"IF($K$10>=$K$11,\"\",cal!H38)","v":{"v":692.9252120314776,"d":"693"}},{"$f":"IF($K$10>=$K$11,\"\",cal!I38)","v":298},{"$f":"IF($K$10>=$K$11,\"\",cal!J38)","v":{"v":1.7427407566624442,"d":"1.74"}},{"$f":"cal!K38","v":38.5},{"$f":"cal!L38","v":46.5},{"$f":"cal!M38","v":12.3},{"$f":"cal!N38","v":285}]
[null,{"$f":"cal!B39","v":{"v":1,"d":"100%"}},{"$f":"cal!C39","v":10},{"$f":"IF($E$10<=$E$11,\"\",cal!D39)","v":{"v":4917.364481636897,"d":"4917"}},{"$f":"IF($E$10<=$E$11,\"\",cal!E39)","v":423},{"$f":"IF($E$10<=$E$11,\"\",cal!F39)","v":{"v":3.345722112767969,"d":"3.35"}},{"$f":"IF($K$10>=$K$11,\"\",cal!G39)","v":{"v":838.6394403618914,"d":"839"}},{"$f":"IF($K$10>=$K$11,\"\",cal!H39)","v":{"v":838.6394403618914,"d":"839"}},{"$f":"IF($K$10>=$K$11,\"\",cal!I39)","v":361},{"$f":"IF($K$10>=$K$11,\"\",cal!J39)","v":{"v":2.490701075978425,"d":"2.49"}},{"$f":"cal!K39","v":41.5},{"$f":"cal!L39","v":49.5},{"$f":"cal!M39","v":19.1},{"$f":"cal!N39","v":339}]
[null,{"$f":"IF(cal!$X$16=1,\"\",IF(cal!$X$16=2,\"\",cal!B40))","v":"Clima Canal height 13 cm width 32 cm length 170 cm (Type 5)"}]
[null,{"$f":"cal!B41","v":{"v":0.2,"d":"20%"}},{"$f":"cal!C41","v":2},{"$f":"IF($E$10<=$E$11,cal!$AC$3,cal!D41)","v":{"v":1246.4550848435726,"d":"1246"}},{"$f":"IF($E$10<=$E$11,\"\",cal!E41)","v":107},{"$f":"IF($E$10<=$E$11,\"\",cal!F41)","v":{"v":0.30178323793610806,"d":"0.30"}},{"$f":"IF($K$10>=$K$11,cal!$AC$3,cal!G41)","v":{"v":268.2209149543352,"d":"268"}},{"$f":"IF($K$10>=$K$11,\"\",cal!H41)","v":{"v":268.2209149543352,"d":"268"}},{"$f":"IF($K$10>=$K$11,\"\",cal!I41)","v":115},{"$f":"IF($K$10>=$K$11,\"\",cal!J41)","v":{"v":0.34476285752532837,"d":"0.34"}},{"$f":"IF(cal!K41=-8,\"\",cal!K41)","v":{"v":22,"d":"22.0"}},{"$f":"IF(cal!L41=0,\"\",cal!L41)","v":{"v":30,"d":"30.0"}},{"$f":"IF(cal!M41=0,\"\",cal!M41)","v":{"v":2.384,"d":"2.4"}},{"$f":"IF(cal!N41=0,\"\",cal!N41)","v":84}]
[null,{"$f":"cal!B42","v":{"v":0.4,"d":"40%"}},{"$f":"cal!C42","v":4},{"$f":"IF($E$10<=$E$11,cal!$AC$4,cal!D42)","v":{"v":2756.748744245007,"d":"2757"}},{"$f":"IF($E$10<=$E$11,\"\",cal!E42)","v":237},{"$f":"IF($E$10<=$E$11,\"\",cal!F42)","v":{"v":1.3105519923123687,"d":"1.31"}},{"$f":"IF($K$10>=$K$11,cal!$AC$5,cal!G42)","v":{"v":487.02188899452034,"d":"487"}},{"$f":"IF($K$10>=$K$11,\"\",cal!H42)","v":{"v":487.02188899452034,"d":"487"}},{"$f":"IF($K$10>=$K$11,\"\",cal!I42)","v":209},{"$f":"IF($K$10>=$K$11,\"\",cal!J42)","v":{"v":1.0390218472959192,"d":"1.04"}},{"$f":"IF(cal!K42=-8,\"\",cal!K42)","v":{"v":27,"d":"27.0"}},{"$f":"IF(cal!L42=0,\"\",cal!L42)","v":{"v":35,"d":"35.0"}},{"$f":"IF(cal!M42=0,\"\",cal!M42)","v":{"v":4.032,"d":"4.0"}},{"$f":"IF(cal!N42=0,\"\",cal!N42)","v":158}]
[null,{"$f":"cal!B43","v":{"v":0.6,"d":"60%"}},{"$f":"cal!C43","v":6},{"$f":"IF($E$10<=$E$11,\"\",cal!D43)","v":{"v":4109.552036536976,"d":"4110"}},{"$f":"IF($E$10<=$E$11,\"\",cal!E43)","v":353},{"$f":"IF($E$10<=$E$11,\"\",cal!F43)","v":{"v":2.7350747723074424,"d":"2.74"}},{"$f":"IF($K$10>=$K$11,\"\",cal!G43)","v":{"v":695.5392838686865,"d":"696"}},{"$f":"IF($K$10>=$K$11,\"\",cal!H43)","v":{"v":695.5392838686865,"d":"696"}},{"$f":"IF($K$10>=$K$11,\"\",cal!I43)","v":299},{"$f":"IF($K$10>=$K$11,\"\",cal!J43)","v":{"v":2.0128943688264105,"d":"2.01"}},{"$f":"IF(cal!K43=-8,\"\",cal!K43)","v":{"v":32,"d":"32.0"}},{"$f":"IF(cal!L43=0,\"\",cal!L43)","v":{"v":40,"d":"40.0"}},{"$f":"IF(cal!M43=0,\"\",cal!M43)","v":7.4},{"$f":"IF(cal!N43=0,\"\",cal!N43)","v":259}]
[null,{"$f":"cal!B44","v":{"v":0.8,"d":"80%"}},{"$f":"cal!C44","v":8},{"$f":"IF($E$10<=$E$11,\"\",cal!D44)","v":{"v":5304.864961719481,"d":"5305"}},{"$f":"IF($E$10<=$E$11,\"\",cal!E44)","v":456},{"$f":"IF($E$10<=$E$11,\"\",cal!F44)","v":{"v":4.3882947063228155,"d":"4.39"}},{"$f":"IF($K$10>=$K$11,\"\",cal!G44)","v":{"v":893.7730995768335,"d":"894"}},{"$f":"IF($K$10>=$K$11,\"\",cal!H44)","v":{"v":893.7730995768335,"d":"894"}},{"$f":"IF($K$10>=$K$11,\"\",cal!I44)","v":384},{"$f":"IF($K$10>=$K$11,\"\",cal!J44)","v":{"v":3.1950335051176335,"d":"3.20"}},{"$f":"IF(cal!K44=-8,\"\",cal!K44)","v":{"v":39,"d":"39.0"}},{"$f":"IF(cal!L44=0,\"\",cal!L44)","v":{"v":47,"d":"47.0"}},{"$f":"IF(cal!M44=0,\"\",cal!M44)","v":{"v":13.100000000000001,"d":"13.1"}},{"$f":"IF(cal!N44=0,\"\",cal!N44)","v":352}]
[null,{"$f":"cal!B45","v":{"v":1,"d":"100%"}},{"$f":"cal!C45","v":10},{"$f":"IF($E$10<=$E$11,\"\",cal!D45)","v":{"v":6342.68751979252,"d":"6343"}},{"$f":"IF($E$10<=$E$11,\"\",cal!E45)","v":545},{"$f":"IF($E$10<=$E$11,\"\",cal!F45)","v":{"v":6.0993434733731355,"d":"6.10"}},{"$f":"IF($K$10>=$K$11,\"\",cal!G45)","v":{"v":1081.7233361189615,"d":"1082"}},{"$f":"IF($K$10>=$K$11,\"\",cal!H45)","v":{"v":1081.7233361189615,"d":"1082"}},{"$f":"IF($K$10>=$K$11,\"\",cal!I45)","v":465},{"$f":"IF($K$10>=$K$11,\"\",cal!J45)","v":{"v":4.549567886525208,"d":"4.55"}},{"$f":"IF(cal!K45=-8,\"\",cal!K45)","v":{"v":42,"d":"42.0"}},{"$f":"IF(cal!L45=0,\"\",cal!L45)","v":{"v":50,"d":"50.0"}},{"$f":"IF(cal!M45=0,\"\",cal!M45)","v":19.4},{"$f":"IF(cal!N45=0,\"\",cal!N45)","v":410}]
[null,{"$f":"IF(cal!$X$16=1,\"\",IF(cal!$X$16=2,\"\",cal!B46))","v":"Clima Canal height 13 cm width 32 cm length 200 cm (Type 6)"}]
[null,{"$f":"cal!B47","v":{"v":0.2,"d":"20%"}},{"$f":"cal!C47","v":2},{"$f":"IF($E$10<=$E$11,cal!$AC$3,cal!D47)","v":{"v":1526.5573511005555,"d":"1527"}},{"$f":"IF($E$10<=$E$11,\"\",cal!E47)","v":131},{"$f":"IF($E$10<=$E$11,\"\",cal!F47)","v":{"v":0.49942474242827456,"d":"0.50"}},{"$f":"IF($K$10>=$K$11,cal!$AC$3,cal!G47)","v":{"v":328.4952778654218,"d":"328"}},{"$f":"IF($K$10>=$K$11,\"\",cal!H47)","v":{"v":328.4952778654218,"d":"328"}},{"$f":"IF($K$10>=$K$11,\"\",cal!I47)","v":141},{"$f":"IF($K$10>=$K$11,\"\",cal!J47)","v":{"v":0.5716074272307419,"d":"0.57"}},{"$f":"IF(cal!K47=-8,\"\",cal!K47)","v":{"v":23,"d":"23.0"}},{"$f":"IF(cal!L47=0,\"\",cal!L47)","v":{"v":31,"d":"31.0"}},{"$f":"IF(cal!M47=0,\"\",cal!M47)","v":{"v":2.408,"d":"2.4"}},{"$f":"IF(cal!N47=0,\"\",cal!N47)","v":93}]
[null,{"$f":"cal!B48","v":{"v":0.4,"d":"40%"}},{"$f":"cal!C48","v":4},{"$f":"IF($E$10<=$E$11,cal!$AC$4,cal!D48)","v":{"v":3376.2428440753456,"d":"3376"}},{"$f":"IF($E$10<=$E$11,\"\",cal!E48)","v":290},{"$f":"IF($E$10<=$E$11,\"\",cal!F48)","v":{"v":2.146920988745705,"d":"2.15"}},{"$f":"IF($K$10>=$K$11,cal!$AC$5,cal!G48)","v":{"v":596.4650101168845,"d":"596"}},{"$f":"IF($K$10>=$K$11,\"\",cal!H48)","v":{"v":596.4650101168845,"d":"596"}},{"$f":"IF($K$10>=$K$11,\"\",cal!I48)","v":256},{"$f":"IF($K$10>=$K$11,\"\",cal!J48)","v":{"v":1.7077725518332227,"d":"1.71"}},{"$f":"IF(cal!K48=-8,\"\",cal!K48)","v":28.5},{"$f":"IF(cal!L48=0,\"\",cal!L48)","v":36.5},{"$f":"IF(cal!M48=0,\"\",cal!M48)","v":4.2},{"$f":"IF(cal!N48=0,\"\",cal!N48)","v":199}]
[null,{"$f":"cal!B49","v":{"v":0.6,"d":"60%"}},{"$f":"cal!C49","v":6},{"$f":"IF($E$10<=$E$11,\"\",cal!D49)","v":{"v":5033.046876208206,"d":"5033"}},{"$f":"IF($E$10<=$E$11,\"\",cal!E49)","v":433},{"$f":"IF($E$10<=$E$11,\"\",cal!F49)","v":{"v":4.480128288391389,"d":"4.48"}},{"$f":"IF($K$10>=$K$11,\"\",cal!G49)","v":{"v":851.8402465358071,"d":"852"}},{"$f":"IF($K$10>=$K$11,\"\",cal!H49)","v":{"v":851.8402465358071,"d":"852"}},{"$f":"IF($K$10>=$K$11,\"\",cal!I49)","v":366},{"$f":"IF($K$10>=$K$11,\"\",cal!J49)","v":{"v":3.2909009123245703,"d":"3.29"}},{"$f":"IF(cal!K49=-8,\"\",cal!K49)","v":32.5},{"$f":"IF(cal!L49=0,\"\",cal!L49)","v":40.5},{"$f":"IF(cal!M49=0,\"\",cal!M49)","v":7.4},{"$f":"IF(cal!N49=0,\"\",cal!N49)","v":307}]
[null,{"$f":"cal!B50","v":{"v":0.8,"d":"80%"}},{"$f":"cal!C50","v":8},{"$f":"IF($E$10<=$E$11,\"\",cal!D50)","v":{"v":6496.969447499138,"d":"6497"}},{"$f":"IF($E$10<=$E$11,\"\",cal!E50)","v":559},{"$f":"IF($E$10<=$E$11,\"\",cal!F50)","v":{"v":7.158931462328529,"d":"7.16"}},{"$f":"IF($K$10>=$K$11,\"\",cal!G50)","v":{"v":1094.6209871221893,"d":"1095"}},{"$f":"IF($K$10>=$K$11,\"\",cal!H50)","v":{"v":1094.6209871221893,"d":"1095"}},{"$f":"IF($K$10>=$K$11,\"\",cal!I50)","v":471},{"$f":"IF($K$10>=$K$11,\"\",cal!J50)","v":{"v":5.227964155640283,"d":"5.23"}},{"$f":"IF(cal!K50=-8,\"\",cal!K50)","v":39.5},{"$f":"IF(cal!L50=0,\"\",cal!L50)","v":47.5},{"$f":"IF(cal!M50=0,\"\",cal!M50)","v":{"v":13.600000000000001,"d":"13.6"}},{"$f":"IF(cal!N50=0,\"\",cal!N50)","v":403}]
[null,{"$f":"cal!B51","v":{"v":1,"d":"100%"}},{"$f":"cal!C51","v":10},{"$f":"IF($E$10<=$E$11,\"\",cal!D51)","v":{"v":7768.010557948142,"d":"7768"}},{"$f":"IF($E$10<=$E$11,\"\",cal!E51)","v":668},{"$f":"IF($E$10<=$E$11,\"\",cal!F51)","v":{"v":9.927067571733335,"d":"9.93"}},{"$f":"IF($K$10>=$K$11,\"\",cal!G51)","v":{"v":1324.8072318760314,"d":"1325"}},{"$f":"IF($K$10>=$K$11,\"\",cal!H51)","v":{"v":1324.8072318760314,"d":"1325"}},{"$f":"IF($K$10>=$K$11,\"\",cal!I51)","v":570},{"$f":"IF($K$10>=$K$11,\"\",cal!J51)","v":{"v":7.419571794935854,"d":"7.42"}},{"$f":"IF(cal!K51=-8,\"\",cal!K51)","v":42.5},{"$f":"IF(cal!L51=0,\"\",cal!L51)","v":50.5},{"$f":"IF(cal!M51=0,\"\",cal!M51)","v":20.9},{"$f":"IF(cal!N51=0,\"\",cal!N51)","v":475}]
[null,{"$f":"IF(cal!$X$16=1,\"\",IF(cal!$X$16=2,\"\",cal!B52))","v":"Clima Canal height 13 cm width 32 cm length 230 cm (Type 7)"}]
[null,{"$f":"cal!B53","v":{"v":0.2,"d":"20%"}},{"$f":"cal!C53","v":2},{"$f":"IF($E$10<=$E$11,cal!$AC$3,cal!D53)","v":{"v":1806.659617357538,"d":"1807"}},{"$f":"IF($E$10<=$E$11,\"\",cal!E53)","v":155},{"$f":"IF($E$10<=$E$11,\"\",cal!F53)","v":{"v":0.7625572810769893,"d":"0.76"}},{"$f":"IF($K$10>=$K$11,cal!$AC$3,cal!G53)","v":{"v":388.7696407765084,"d":"389"}},{"$f":"IF($K$10>=$K$11,\"\",cal!H53)","v":{"v":388.7696407765084,"d":"389"}},{"$f":"IF($K$10>=$K$11,\"\",cal!I53)","v":167},{"$f":"IF($K$10>=$K$11,\"\",cal!J53)","v":{"v":0.8737480669025174,"d":"0.87"}},{"$f":"IF(cal!K53=-8,\"\",cal!K53)","v":{"v":23,"d":"23.0"}},{"$f":"IF(cal!L53=0,\"\",cal!L53)","v":{"v":31,"d":"31.0"}},{"$f":"IF(cal!M53=0,\"\",cal!M53)","v":2.8},{"$f":"IF(cal!N53=0,\"\",cal!N53)","v":98}]
[null,{"$f":"cal!B54","v":{"v":0.4,"d":"40%"}},{"$f":"cal!C54","v":4},{"$f":"IF($E$10<=$E$11,cal!$AC$4,cal!D54)","v":{"v":3995.7369439056843,"d":"3996"}},{"$f":"IF($E$10<=$E$11,\"\",cal!E54)","v":344},{"$f":"IF($E$10<=$E$11,\"\",cal!F54)","v":{"v":3.2678319097682533,"d":"3.27"}},{"$f":"IF($K$10>=$K$11,cal!$AC$5,cal!G54)","v":{"v":705.9081312392486,"d":"706"}},{"$f":"IF($K$10>=$K$11,\"\",cal!H54)","v":{"v":705.9081312392486,"d":"706"}},{"$f":"IF($K$10>=$K$11,\"\",cal!I54)","v":303},{"$f":"IF($K$10>=$K$11,\"\",cal!J54)","v":{"v":2.592111626359494,"d":"2.59"}},{"$f":"IF(cal!K54=-8,\"\",cal!K54)","v":{"v":29,"d":"29.0"}},{"$f":"IF(cal!L54=0,\"\",cal!L54)","v":{"v":37,"d":"37.0"}},{"$f":"IF(cal!M54=0,\"\",cal!M54)","v":4.8},{"$f":"IF(cal!N54=0,\"\",cal!N54)","v":228}]
[null,{"$f":"cal!B55","v":{"v":0.6,"d":"60%"}},{"$f":"cal!C55","v":6},{"$f":"IF($E$10<=$E$11,\"\",cal!D55)","v":{"v":5956.541715879437,"d":"5957"}},{"$f":"IF($E$10<=$E$11,\"\",cal!E55)","v":512},{"$f":"IF($E$10<=$E$11,\"\",cal!F55)","v":{"v":6.753358447805807,"d":"6.75"}},{"$f":"IF($K$10>=$K$11,\"\",cal!G55)","v":{"v":1008.1412092029277,"d":"1008"}},{"$f":"IF($K$10>=$K$11,\"\",cal!H55)","v":{"v":1008.1412092029277,"d":"1008"}},{"$f":"IF($K$10>=$K$11,\"\",cal!I55)","v":433},{"$f":"IF($K$10>=$K$11,\"\",cal!J55)","v":{"v":4.973551128640903,"d":"4.97"}},{"$f":"IF(cal!K55=-8,\"\",cal!K55)","v":{"v":33,"d":"33.0"}},{"$f":"IF(cal!L55=0,\"\",cal!L55)","v":{"v":41,"d":"41.0"}},{"$f":"IF(cal!M55=0,\"\",cal!M55)","v":8.4},{"$f":"IF(cal!N55=0,\"\",cal!N55)","v":348}]
[null,{"$f":"cal!B56","v":{"v":0.8,"d":"80%"}},{"$f":"cal!C56","v":8},{"$f":"IF($E$10<=$E$11,\"\",cal!D56)","v":{"v":7689.073933278797,"d":"7689"}},{"$f":"IF($E$10<=$E$11,\"\",cal!E56)","v":661},{"$f":"IF($E$10<=$E$11,\"\",cal!F56)","v":{"v":10.764883466888408,"d":"10.76"}},{"$f":"IF($K$10>=$K$11,\"\",cal!G56)","v":{"v":1295.4688746675452,"d":"1295"}},{"$f":"IF($K$10>=$K$11,\"\",cal!H56)","v":{"v":1295.4688746675452,"d":"1295"}},{"$f":"IF($K$10>=$K$11,\"\",cal!I56)","v":557},{"$f":"IF($K$10>=$K$11,\"\",cal!J56)","v":{"v":7.875912748834125,"d":"7.88"}},{"$f":"IF(cal!K56=-8,\"\",cal!K56)","v":{"v":40,"d":"40.0"}},{"$f":"IF(cal!L56=0,\"\",cal!L56)","v":{"v":48,"d":"48.0"}},{"$f":"IF(cal!M56=0,\"\",cal!M56)","v":14.4},{"$f":"IF(cal!N56=0,\"\",cal!N56)","v":470}]
[null,{"$f":"cal!B57","v":{"v":1,"d":"100%"}},{"$f":"cal!C57","v":10},{"$f":"IF($E$10<=$E$11,\"\",cal!D57)","v":{"v":9193.333596103765,"d":"9193"}},{"$f":"IF($E$10<=$E$11,\"\",cal!E57)","v":790},{"$f":"IF($E$10<=$E$11,\"\",cal!F57)","v":{"v":14.905231059418846,"d":"14.91"}},{"$f":"IF($K$10>=$K$11,\"\",cal!G57)","v":{"v":1567.8911276331014,"d":"1568"}},{"$f":"IF($K$10>=$K$11,\"\",cal!H57)","v":{"v":1567.8911276331014,"d":"1568"}},{"$f":"IF($K$10>=$K$11,\"\",cal!I57)","v":674},{"$f":"IF($K$10>=$K$11,\"\",cal!J57)","v":{"v":11.154471439461101,"d":"11.15"}},{"$f":"IF(cal!K57=-8,\"\",cal!K57)","v":{"v":43,"d":"43.0"}},{"$f":"IF(cal!L57=0,\"\",cal!L57)","v":{"v":51,"d":"51.0"}},{"$f":"IF(cal!M57=0,\"\",cal!M57)","v":21.2},{"$f":"IF(cal!N57=0,\"\",cal!N57)","v":546}]
[null,{"$f":"IF(cal!$X$16=1,\"\",IF(cal!$X$16=2,\"\",cal!B58))","v":"Clima Canal height 13 cm width 32 cm length 280 cm (Type 8)"}]
[null,{"$f":"cal!B59","v":{"v":0.2,"d":"20%"}},{"$f":"cal!C59","v":2},{"$f":"IF($E$10<=$E$11,cal!$AC$3,cal!D59)","v":{"v":2273.4967277858427,"d":"2273"}},{"$f":"IF($E$10<=$E$11,\"\",cal!E59)","v":195},{"$f":"IF($E$10<=$E$11,\"\",cal!F59)","v":{"v":1.4135103689709119,"d":"1.41"}},{"$f":"IF($K$10>=$K$11,cal!$AC$3,cal!G59)","v":{"v":489.22691229498605,"d":"489"}},{"$f":"IF($K$10>=$K$11,\"\",cal!H59)","v":{"v":489.22691229498605,"d":"489"}},{"$f":"IF($K$10>=$K$11,\"\",cal!I59)","v":210},{"$f":"IF($K$10>=$K$11,\"\",cal!J59)","v":{"v":1.562994220505905,"d":"1.56"}},{"$f":"IF(cal!K59=-8,\"\",cal!K59)","v":{"v":24,"d":"24.0"}},{"$f":"IF(cal!L59=0,\"\",cal!L59)","v":{"v":32,"d":"32.0"}},{"$f":"IF(cal!M59=0,\"\",cal!M59)","v":{"v":3.784,"d":"3.8"}},{"$f":"IF(cal!N59=0,\"\",cal!N59)","v":133}]
[null,{"$f":"cal!B60","v":{"v":0.4,"d":"40%"}},{"$f":"cal!C60","v":4},{"$f":"IF($E$10<=$E$11,cal!$AC$4,cal!D60)","v":{"v":5028.227110289582,"d":"5028"}},{"$f":"IF($E$10<=$E$11,\"\",cal!E60)","v":432},{"$f":"IF($E$10<=$E$11,\"\",cal!F60)","v":{"v":5.96608930605324,"d":"5.97"}},{"$f":"IF($K$10>=$K$11,cal!$AC$5,cal!G60)","v":{"v":888.3133331098555,"d":"888"}},{"$f":"IF($K$10>=$K$11,\"\",cal!H60)","v":{"v":888.3133331098555,"d":"888"}},{"$f":"IF($K$10>=$K$11,\"\",cal!I60)","v":382},{"$f":"IF($K$10>=$K$11,\"\",cal!J60)","v":{"v":4.621296697129691,"d":"4.62"}},{"$f":"IF(cal!K60=-8,\"\",cal!K60)","v":29.5},{"$f":"IF(cal!L60=0,\"\",cal!L60)","v":37.5},{"$f":"IF(cal!M60=0,\"\",cal!M60)","v":{"v":6.432,"d":"6.4"}},{"$f":"IF(cal!N60=0,\"\",cal!N60)","v":272}]
[null,{"$f":"cal!B61","v":{"v":0.6,"d":"60%"}},{"$f":"cal!C61","v":6},{"$f":"IF($E$10<=$E$11,\"\",cal!D61)","v":{"v":7495.699781998155,"d":"7496"}},{"$f":"IF($E$10<=$E$11,\"\",cal!E61)","v":645},{"$f":"IF($E$10<=$E$11,\"\",cal!F61)","v":{"v":12.326269528637294,"d":"12.33"}},{"$f":"IF($K$10>=$K$11,\"\",cal!G61)","v":{"v":1268.6428136481286,"d":"1269"}},{"$f":"IF($K$10>=$K$11,\"\",cal!H61)","v":{"v":1268.6428136481286,"d":"1269"}},{"$f":"IF($K$10>=$K$11,\"\",cal!I61)","v":545},{"$f":"IF($K$10>=$K$11,\"\",cal!J61)","v":{"v":8.798266347816686,"d":"8.80"}},{"$f":"IF(cal!K61=-8,\"\",cal!K61)","v":{"v":34,"d":"34.0"}},{"$f":"IF(cal!L61=0,\"\",cal!L61)","v":{"v":42,"d":"42.0"}},{"$f":"IF(cal!M61=0,\"\",cal!M61)","v":{"v":11.600000000000001,"d":"11.6"}},{"$f":"IF(cal!N61=0,\"\",cal!N61)","v":433}]
[null,{"$f":"cal!B62","v":{"v":0.8,"d":"80%"}},{"$f":"cal!C62","v":8},{"$f":"IF($E$10<=$E$11,\"\",cal!D62)","v":{"v":9675.914742911562,"d":"9676"}},{"$f":"IF($E$10<=$E$11,\"\",cal!E62)","v":832},{"$f":"IF($E$10<=$E$11,\"\",cal!F62)","v":{"v":19.543066305604253,"d":"19.54"}},{"$f":"IF($K$10>=$K$11,\"\",cal!G62)","v":{"v":1630.215353909805,"d":"1630"}},{"$f":"IF($K$10>=$K$11,\"\",cal!H62)","v":{"v":1630.215353909805,"d":"1630"}},{"$f":"IF($K$10>=$K$11,\"\",cal!I62)","v":701},{"$f":"IF($K$10>=$K$11,\"\",cal!J62)","v":{"v":13.882723091543138,"d":"13.88"}},{"$f":"IF(cal!K62=-8,\"\",cal!K62)","v":{"v":41,"d":"41.0"}},{"$f":"IF(cal!L62=0,\"\",cal!L62)","v":{"v":49,"d":"49.0"}},{"$f":"IF(cal!M62=0,\"\",cal!M62)","v":20.3},{"$f":"IF(cal!N62=0,\"\",cal!N62)","v":587}]
[null,{"$f":"cal!B63","v":{"v":1,"d":"100%"}},{"$f":"cal!C63","v":10},{"$f":"IF($E$10<=$E$11,\"\",cal!D63)","v":{"v":11568.871993029803,"d":"11569"}},{"$f":"IF($E$10<=$E$11,\"\",cal!E63)","v":995},{"$f":"IF($E$10<=$E$11,\"\",cal!F63)","v":{"v":27.018299401107992,"d":"27.02"}},{"$f":"IF($K$10>=$K$11,\"\",cal!G63)","v":{"v":1973.0309538948848,"d":"1973"}},{"$f":"IF($K$10>=$K$11,\"\",cal!H63)","v":{"v":1973.0309538948848,"d":"1973"}},{"$f":"IF($K$10>=$K$11,\"\",cal!I63)","v":848},{"$f":"IF($K$10>=$K$11,\"\",cal!J63)","v":{"v":19.600946455549366,"d":"19.60"}},{"$f":"IF(cal!K63=-8,\"\",cal!K63)","v":{"v":44,"d":"44.0"}},{"$f":"IF(cal!L63=0,\"\",cal!L63)","v":{"v":52,"d":"52.0"}},{"$f":"IF(cal!M63=0,\"\",cal!M63)","v":{"v":30,"d":"30.0"}},{"$f":"IF(cal!N63=0,\"\",cal!N63)","v":683}]
[null,{"$f":"IF(cal!$X$16=1,\"\",IF(cal!$X$16=2,\"\",cal!B64))","v":"Clima Canal height 13 cm width 32 cm length 300 cm (Type 9)"}]
[null,{"$f":"cal!B65","v":{"v":0.2,"d":"20%"}},{"$f":"cal!C65","v":2},{"$f":"IF($E$10<=$E$11,cal!$AC$3,cal!D65)","v":{"v":2460.2200000000003,"d":"2460"}},{"$f":"IF($E$10<=$E$11,\"\",cal!E65)","v":212},{"$f":"IF($E$10<=$E$11,\"\",cal!F65)","v":{"v":1.6444387112676684,"d":"1.64"}},{"$f":"IF($K$10>=$K$11,cal!$AC$3,cal!G65)","v":{"v":529.396,"d":"529"}},{"$f":"IF($K$10>=$K$11,\"\",cal!H65)","v":{"v":529.396,"d":"529"}},{"$f":"IF($K$10>=$K$11,\"\",cal!I65)","v":228},{"$f":"IF($K$10>=$K$11,\"\",cal!J65)","v":{"v":1.87595988904386,"d":"1.88"}},{"$f":"IF(cal!K65=-8,\"\",cal!K65)","v":{"v":25,"d":"25.0"}},{"$f":"IF(cal!L65=0,\"\",cal!L65)","v":{"v":33,"d":"33.0"}},{"$f":"IF(cal!M65=0,\"\",cal!M65)","v":4.8},{"$f":"IF(cal!N65=0,\"\",cal!N65)","v":142}]
[null,{"$f":"cal!B66","v":{"v":0.4,"d":"40%"}},{"$f":"cal!C66","v":4},{"$f":"IF($E$10<=$E$11,cal!$AC$4,cal!D66)","v":{"v":5441.28,"d":"5441"}},{"$f":"IF($E$10<=$E$11,\"\",cal!E66)","v":468},{"$f":"IF($E$10<=$E$11,\"\",cal!F66)","v":{"v":6.896393348559132,"d":"6.90"}},{"$f":"IF($K$10>=$K$11,cal!$AC$5,cal!G66)","v":{"v":961.2700000000001,"d":"961"}},{"$f":"IF($K$10>=$K$11,\"\",cal!H66)","v":{"v":961.2700000000001,"d":"961"}},{"$f":"IF($K$10>=$K$11,\"\",cal!I66)","v":413},{"$f":"IF($K$10>=$K$11,\"\",cal!J66)","v":{"v":5.499542141797976,"d":"5.50"}},{"$f":"IF(cal!K66=-8,\"\",cal!K66)","v":{"v":31,"d":"31.0"}},{"$f":"IF(cal!L66=0,\"\",cal!L66)","v":{"v":39,"d":"39.0"}},{"$f":"IF(cal!M66=0,\"\",cal!M66)","v":{"v":8,"d":"8.0"}},{"$f":"IF(cal!N66=0,\"\",cal!N66)","v":313}]
[null,{"$f":"cal!B67","v":{"v":0.6,"d":"60%"}},{"$f":"cal!C67","v":6},{"$f":"IF($E$10<=$E$11,\"\",cal!D67)","v":{"v":8111.299999999999,"d":"8111"}},{"$f":"IF($E$10<=$E$11,\"\",cal!E67)","v":697},{"$f":"IF($E$10<=$E$11,\"\",cal!F67)","v":{"v":14.183792323153156,"d":"14.18"}},{"$f":"IF($K$10>=$K$11,\"\",cal!G67)","v":{"v":1372.83,"d":"1373"}},{"$f":"IF($K$10>=$K$11,\"\",cal!H67)","v":{"v":1372.83,"d":"1373"}},{"$f":"IF($K$10>=$K$11,\"\",cal!I67)","v":590},{"$f":"IF($K$10>=$K$11,\"\",cal!J67)","v":{"v":10.489538845374183,"d":"10.49"}},{"$f":"IF(cal!K67=-8,\"\",cal!K67)","v":{"v":35,"d":"35.0"}},{"$f":"IF(cal!L67=0,\"\",cal!L67)","v":{"v":43,"d":"43.0"}},{"$f":"IF(cal!M67=0,\"\",cal!M67)","v":14.8},{"$f":"IF(cal!N67=0,\"\",cal!N67)","v":481}]
[null,{"$f":"cal!B68","v":{"v":0.8,"d":"80%"}},{"$f":"cal!C68","v":8},{"$f":"IF($E$10<=$E$11,\"\",cal!D68)","v":{"v":10470.7,"d":"10471"}},{"$f":"IF($E$10<=$E$11,\"\",cal!E68)","v":900},{"$f":"IF($E$10<=$E$11,\"\",cal!F68)","v":{"v":22.52999270464744,"d":"22.53"}},{"$f":"IF($K$10>=$K$11,\"\",cal!G68)","v":{"v":1764.1099999999997,"d":"1764"}},{"$f":"IF($K$10>=$K$11,\"\",cal!H68)","v":{"v":1764.1099999999997,"d":"1764"}},{"$f":"IF($K$10>=$K$11,\"\",cal!I68)","v":758},{"$f":"IF($K$10>=$K$11,\"\",cal!J68)","v":{"v":16.510330960991837,"d":"16.51"}},{"$f":"IF(cal!K68=-8,\"\",cal!K68)","v":{"v":42,"d":"42.0"}},{"$f":"IF(cal!L68=0,\"\",cal!L68)","v":{"v":50,"d":"50.0"}},{"$f":"IF(cal!M68=0,\"\",cal!M68)","v":26.2},{"$f":"IF(cal!N68=0,\"\",cal!N68)","v":638}]
[null,{"$f":"cal!B69","v":{"v":1,"d":"100%"}},{"$f":"cal!C69","v":10},{"$f":"IF($E$10<=$E$11,\"\",cal!D69)","v":{"v":12519.2,"d":"12519"}},{"$f":"IF($E$10<=$E$11,\"\",cal!E69)","v":1076},{"$f":"IF($E$10<=$E$11,\"\",cal!F69)","v":{"v":31.13085301525779,"d":"31.13"}},{"$f":"IF($K$10>=$K$11,\"\",cal!G69)","v":{"v":2135.09,"d":"2135"}},{"$f":"IF($K$10>=$K$11,\"\",cal!H69)","v":{"v":2135.09,"d":"2135"}},{"$f":"IF($K$10>=$K$11,\"\",cal!I69)","v":918},{"$f":"IF($K$10>=$K$11,\"\",cal!J69)","v":{"v":23.35234746783593,"d":"23.35"}},{"$f":"IF(cal!K69=-8,\"\",cal!K69)","v":{"v":45,"d":"45.0"}},{"$f":"IF(cal!L69=0,\"\",cal!L69)","v":{"v":53,"d":"53.0"}},{"$f":"IF(cal!M69=0,\"\",cal!M69)","v":38.8},{"$f":"IF(cal!N69=0,\"\",cal!N69)","v":748}]
[null,{"$f":"cal!B70","v":"*Values according to EN 16430"},{"$nulls":13},"v2022-12-13"]
[null,{"$f":"cal!B71","v":"**Sound power according to ISO 3741:2010"}]
[null,{"$f":"cal!B72","v":"***Sound pressure with an assumed room damping of 8dB(A)"}]

{"sheet":"cal","index":1,"n_rows":72,"n_cols":99,"rows_kept":72,"hidden":true,"merged":[[6,12,6,13],[6,14,6,15],[7,12,7,13],[7,14,7,15],[8,1,8,3],[8,6,8,9],[8,12,8,13],[9,1,9,3],[9,6,9,9],[10,1,10,3],[10,6,10,9],[15,1,15,15],[15,23,15,29],[15,30,15,36],[15,37,15,43],[15,48,15,54],[15,55,15,61],[15,62,15,68],[15,70,15,76],[15,77,15,83],[15,85,15,91],[15,92,15,98],[21,1,21,15],[27,1,27,15],[33,1,33,15],[39,1,39,15],[45,1,45,15],[51,1,51,15],[57,1,57,15],[63,1,63,15]]}
[{"$nulls":6},"Nederlands","English","Deutsch","Français","Norsk","Español","Svenska","Čeština","ExtraTaal1","ExtraTaal2","ExtraTaal3",{"$nulls":3},{"$f":"IF($S$7=1,NL!Q7,IF($S$7=2,EN!Q7,IF($S$7=3,DE!Q7,IF($S$7=4,FR!Q7,IF($S$7=5,NR!Q7,IF($S$7=6,SP!Q7,IF($S$7=7,SW!Q7,IF($S$7=8,TS!Q7,IF($S$7=9,ExtraTaal1!Q7,IF($S$7=10,ExtraTaal2!Q7,IF($S$7=11,ExtraTaal3!Q7,)))))))))))","v":"Copy all data"},{"$nulls":10},"Clima Canal"]
[{"$nulls":20},{"$f":"IF($S$7=1,NL!Q8,IF($S$7=2,EN!Q8,IF($S$7=3,DE!Q8,IF($S$7=4,FR!Q8,IF($S$7=5,NR!Q8,IF($S$7=6,SP!Q8,IF($S$7=7,SW!Q8,IF($S$7=8,TS!Q8,IF($S$7=9,ExtraTaal1!Q8,IF($S$7=10,ExtraTaal2!Q8,IF($S$7=11,ExtraTaal3!Q8,)))))))))))","v":"SI-units"},{"$nulls":9},"Clima H8 B18",{"$f":"AE16","v":"Clima H8 B18"}]
[null,{"$f":"IF($S$7=1,NL!A2,IF(cal!$S$7=2,EN!A2,IF(cal!$S$7=3,DE!A2,IF(cal!$S$7=4,FR!A2,))))","v":"Formulary"},{"$nulls":18},{"$f":"IF($S$7=1,NL!Q9,IF($S$7=2,EN!Q9,IF($S$7=3,DE!Q9,IF($S$7=4,FR!Q9,IF($S$7=5,NR!Q9,IF($S$7=6,SP!Q9,IF($S$7=7,SW!Q9,IF($S$7=8,TS!Q9,IF($S$7=9,ExtraTaal1!Q9,IF($S$7=10,ExtraTaal2!Q9,IF($S$7=11,ExtraTaal3!Q9,)))))))))))","v":"Imperial-units"},{"$nulls":7},{"$f":"IF($S$7=1,NL!Q15,IF(cal!$S$7=2,EN!Q15,IF(cal!$S$7=3,DE!Q15,IF(cal!$S$7=4,FR!Q15,IF(cal!$S$7=5,NR!Q15,IF(cal!$S$7=6,SP!Q15,))))))","v":"Temp."},null,"Clima H10 B18",{"$f":"AL16","v":"Clima H10 B18"}]
[{"$nulls":23},1,{"$nulls":4},{"$f":"IF($S$7=1,NL!Q16,IF(cal!$S$7=2,EN!Q16,IF(cal!$S$7=3,DE!Q16,IF(cal!$S$7=4,FR!Q16,IF(cal!$S$7=5,NR!Q16,IF(cal!$S$7=6,SP!Q16,))))))","v":"heating!"},null,"Clima H13 B27 4P",{"$f":"AW16","v":"Clima H13 B27 4P"}]
[null,{"$f":"IF($S$7=1,NL!A4,IF(cal!$S$7=2,EN!A4,IF(cal!$S$7=3,DE!A4,IF(cal!$S$7=4,FR!A4,))))","v":"Conditions"},{"$nulls":26},{"$f":"IF($S$7=1,NL!Q17,IF(cal!$S$7=2,EN!Q17,IF(cal!$S$7=3,DE!Q17,IF(cal!$S$7=4,FR!Q17,IF(cal!$S$7=5,NR!Q17,IF(cal!$S$7=6,SP!Q17,))))))","v":"cooling!"},null,"Clima H13 B32 2P",{"$f":"BK16","v":"Clima H13 B32 2P"}]
[{"$nulls":30},"Clima H13 B32 4P",{"$f":"BD16","v":"Clima H13 B32 4P"}]
[null,{"$f":"IF($S$7=1,NL!A6,IF(cal!$S$7=2,EN!A6,IF(cal!$S$7=3,DE!A6,IF(cal!$S$7=4,FR!A6,IF(cal!$S$7=5,NR!A6,IF(cal!$S$7=6,SP!A6,IF(cal!$S$7=7,SW!A6,IF(cal!$S$7=8,TS!A6,IF(cal!$S$7=9,ExtraTaal1!A6,IF(cal!$S$7=10,ExtraTaal2!A6,IF(cal!$S$7=11,ExtraTaal3!A6,)))))))))))","v":"Temperatures"},{"$nulls":10},{"$f":"IF($S$7=1,NL!L6,IF(cal!$S$7=2,EN!L6,IF(cal!$S$7=3,DE!L6,IF(cal!$S$7=4,FR!L6,IF(cal!$S$7=5,NR!L6,IF(cal!$S$7=6,SP!L6,IF(cal!$S$7=7,SW!L6,IF(cal!$S$7=8,TS!L6,IF(cal!$S$7=9,ExtraTaal1!L6,IF(cal!$S$7=10,ExtraTaal2!L6,IF(cal!$S$7=11,ExtraTaal3!L6,)))))))))))","v":"Altitude"},{"$f":"IF($S$7=1,NL!M6,IF(cal!$S$7=2,EN!M6,IF(cal!$S$7=3,DE!M6,IF(cal!$S$7=4,FR!M6,IF(cal!$S$7=5,NR!M6,IF(cal!$S$7=6,SP!M6,IF(cal!$S$7=7,SW!M6,IF(cal!$S$7=8,TS!M6,IF(cal!$S$7=9,ExtraTaal1!M6,IF(cal!$S$7=10,ExtraTaal2!M6,IF(cal!$S$7=11,ExtraTaal3!M6,)))))))))))","v":0},{"$nulls":4},{"$f":"IF('Clima Canal'!$K$4=cal!G1,1,IF('Clima Canal'!$K$4=cal!H1,2,IF('Clima Canal'!$K$4=cal!I1,3,IF('Clima Canal'!$K$4=cal!J1,4,IF('Clima Canal'!$K$4=cal!K1,5,IF('Clima Canal'!$K$4=cal!L1,6,IF('Clima Canal'!$K$4=cal!M1,7,IF('Clima Canal'!$K$4=cal!N1,8,IF('Clima Canal'!$K$4=cal!O1,9,IF('Clima Canal'!$K$4=cal!P1,10,IF('Clima Canal'!$K$4=cal!Q1,11,)))))))))))","v":2},{"$nulls":11},"Clima H15 B32 2P",{"$f":"CH16","v":"Clima H15 B32 4P"}]
[null,{"$f":"IF($S$7=1,NL!A7,IF(cal!$S$7=2,EN!A7,IF(cal!$S$7=3,DE!A7,IF(cal!$S$7=4,FR!A7,IF(cal!$S$7=5,NR!A7,IF(cal!$S$7=6,SP!A7,IF(cal!$S$7=7,SW!A7,IF(cal!$S$7=8,TS!A7,IF(cal!$S$7=9,ExtraTaal1!A7,IF(cal!$S$7=10,ExtraTaal2!A7,IF(cal!$S$7=11,ExtraTaal3!A7,)))))))))))","v":"Heating:"},{"$nulls":4},{"$f":"IF($S$7=1,NL!F7,IF(cal!$S$7=2,EN!F7,IF(cal!$S$7=3,DE!F7,IF(cal!$S$7=4,FR!F7,IF(cal!$S$7=5,NR!F7,IF(cal!$S$7=6,SP!F7,IF(cal!$S$7=7,SW!F7,IF(cal!$S$7=8,TS!F7,IF(cal!$S$7=9,ExtraTaal1!F7,IF(cal!$S$7=10,ExtraTaal2!F7,IF(cal!$S$7=11,ExtraTaal3!F7,)))))))))))","v":"Cooling:"},{"$nulls":5},{"$f":"'Clima Canal'!M9:N9","v":{"v":0,"d":"0.00"}},{"v":0,"d":"0.00"},{"$f":"IF($X$4=1,\"m\",IF($X$4=2,\"ft\"))","v":"m"},{"$nulls":3},"Temp",{"$nulls":4},"Temp",{"$nulls":6},"Clima H15 B32 4P",{"$f":"CO16","v":"Clima H15 B32 2P"}]
[null,{"$f":"IF($S$7=1,NL!A8,IF(cal!$S$7=2,EN!A8,IF(cal!$S$7=3,DE!A8,IF(cal!$S$7=4,FR!A8,IF(cal!$S$7=5,NR!A8,IF(cal!$S$7=6,SP!A8,IF(cal!$S$7=7,SW!A8,IF(cal!$S$7=8,TS!A8,IF(cal!$S$7=9,ExtraTaal1!A8,IF(cal!$S$7=10,ExtraTaal2!A8,IF(cal!$S$7=11,ExtraTaal3!A8,)))))))))))","v":"Inlet temp."},{"$f":"IF($S$7=1,NL!B8,IF(cal!$S$7=2,EN!B8,IF(cal!$S$7=3,DE!B8,IF(cal!$S$7=4,FR!B8,IF(cal!$S$7=5,NR!B8,IF(cal!$S$7=6,SP!B8,IF(cal!$S$7=7,SW!B8,IF(cal!$S$7=8,TS!B8,IF(cal!$S$7=9,ExtraTaal1!B8,IF(cal!$S$7=10,ExtraTaal2!B8,IF(cal!$S$7=11,ExtraTaal3!B8,)))))))))))","v":0},{"$f":"IF($S$7=1,NL!C8,IF(cal!$S$7=2,EN!C8,IF(cal!$S$7=3,DE!C8,IF(cal!$S$7=4,FR!C8,IF(cal!$S$7=5,NR!C8,IF(cal!$S$7=6,SP!C8,IF(cal!$S$7=7,SW!C8,IF(cal!$S$7=8,TS!C8,IF(cal!$S$7=9,ExtraTaal1!C8,IF(cal!$S$7=10,ExtraTaal2!C8,IF(cal!$S$7=11,ExtraTaal3!C8,)))))))))))","v":0},{"$f":"'Clima Canal'!E10","v":75},null,{"$f":"B9","v":"Inlet temp."},{"$f":"IF($S$7=1,NL!G8,IF(cal!$S$7=2,EN!G8,IF(cal!$S$7=3,DE!G8,IF(cal!$S$7=4,FR!G8,))))","v":0},{"$f":"IF($S$7=1,NL!H8,IF(cal!$S$7=2,EN!H8,IF(cal!$S$7=3,DE!H8,IF(cal!$S$7=4,FR!H8,))))","v":0},{"$f":"IF($S$7=1,NL!I8,IF(cal!$S$7=2,EN!I8,IF(cal!$S$7=3,DE!I8,IF(cal!$S$7=4,FR!I8,))))","v":0},{"$f":"'Clima Canal'!K10","v":16},null,{"$f":"IF($S$7=1,NL!L8,IF(cal!$S$7=2,EN!L8,IF(cal!$S$7=3,DE!L8,IF(cal!$S$7=4,FR!L8,IF(cal!$S$7=5,NR!L8,IF(cal!$S$7=6,SP!L8,IF(cal!$S$7=7,SW!L8,IF(cal!$S$7=8,TS!L8,IF(cal!$S$7=9,ExtraTaal1!L8,IF(cal!$S$7=10,ExtraTaal2!L8,IF(cal!$S$7=11,ExtraTaal3!L8,)))))))))))","v":"Unit conversion"},{"$f":"IF($S$7=1,NL!M8,IF(cal!$S$7=2,EN!M8,IF(cal!$S$7=3,DE!M8,IF(cal!$S$7=4,FR!M8,IF(cal!$S$7=5,NR!M8,IF(cal!$S$7=6,SP!M8,IF(cal!$S$7=7,SW!M8,IF(cal!$S$7=8,TS!M8,IF(cal!$S$7=9,ExtraTaal1!M8,IF(cal!$S$7=10,ExtraTaal2!M8,IF(cal!$S$7=11,ExtraTaal3!M8,)))))))))))","v":0},{"$nulls":4},{"$f":"IF($X$4=1,E9,IF($X$4=2,(E9-32)/1.8))","v":{"v":75,"d":"75.0"}},{"$nulls":4},{"$f":"IF($X$4=1,K9,IF($X$4=2,(K9-32)/1.8))","v":{"v":16,"d":"16.0"}},{"$nulls":6},"Clima H19 B34 2P",{"$f":"BZ16","v":"Clima H19 B34 2P"}]
[null,{"$f":"IF($S$7=1,NL!A9,IF(cal!$S$7=2,EN!A9,IF(cal!$S$7=3,DE!A9,IF(cal!$S$7=4,FR!A9,IF(cal!$S$7=5,NR!A9,IF(cal!$S$7=6,SP!A9,IF(cal!$S$7=7,SW!A9,IF(cal!$S$7=8,TS!A9,IF(cal!$S$7=9,ExtraTaal1!A9,IF(cal!$S$7=10,ExtraTaal2!A9,IF(cal!$S$7=11,ExtraTaal3!A9,)))))))))))","v":"Return temp."},{"$f":"IF($S$7=1,NL!B9,IF(cal!$S$7=2,EN!B9,IF(cal!$S$7=3,DE!B9,IF(cal!$S$7=4,FR!B9,IF(cal!$S$7=5,NR!B9,IF(cal!$S$7=6,SP!B9,IF(cal!$S$7=7,SW!B9,IF(cal!$S$7=8,TS!B9,IF(cal!$S$7=9,ExtraTaal1!B9,IF(cal!$S$7=10,ExtraTaal2!B9,IF(cal!$S$7=11,ExtraTaal3!B9,)))))))))))","v":0},{"$f":"IF($S$7=1,NL!C9,IF(cal!$S$7=2,EN!C9,IF(cal!$S$7=3,DE!C9,IF(cal!$S$7=4,FR!C9,IF(cal!$S$7=5,NR!C9,IF(cal!$S$7=6,SP!C9,IF(cal!$S$7=7,SW!C9,IF(cal!$S$7=8,TS!C9,IF(cal!$S$7=9,ExtraTaal1!C9,IF(cal!$S$7=10,ExtraTaal2!C9,IF(cal!$S$7=11,ExtraTaal3!C9,)))))))))))","v":0},{"$f":"'Clima Canal'!E11","v":65},null,{"$f":"B10","v":"Return temp."},{"$f":"IF($S$7=1,NL!G9,IF(cal!$S$7=2,EN!G9,IF(cal!$S$7=3,DE!G9,IF(cal!$S$7=4,FR!G9,))))","v":0},{"$f":"IF($S$7=1,NL!H9,IF(cal!$S$7=2,EN!H9,IF(cal!$S$7=3,DE!H9,IF(cal!$S$7=4,FR!H9,))))","v":0},{"$f":"IF($S$7=1,NL!I9,IF(cal!$S$7=2,EN!I9,IF(cal!$S$7=3,DE!I9,IF(cal!$S$7=4,FR!I9,))))","v":0},{"$f":"'Clima Canal'!K11","v":18},{"$nulls":7},{"$f":"IF($X$4=1,E10,IF($X$4=2,(E10-32)/1.8))","v":{"v":65,"d":"65.0"}},"CF,h",null,null,"CF,c",{"$f":"IF($X$4=1,K10,IF($X$4=2,(K10-32)/1.8))","v":{"v":18,"d":"18.0"}},null,"p_atm","h[mm]","cf_h",null,null,"Clima H19 B34 4P",{"$f":"BS16","v":"Clima H19 B34 4P"}]
[null,{"$f":"IF($S$7=1,NL!A10,IF(cal!$S$7=2,EN!A10,IF(cal!$S$7=3,DE!A10,IF(cal!$S$7=4,FR!A10,IF(cal!$S$7=5,NR!A10,IF(cal!$S$7=6,SP!A10,IF(cal!$S$7=7,SW!A10,IF(cal!$S$7=8,TS!A10,IF(cal!$S$7=9,ExtraTaal1!A10,IF(cal!$S$7=10,ExtraTaal2!A10,IF(cal!$S$7=11,ExtraTaal3!A10,)))))))))))","v":"Room temp."},{"$f":"IF($S$7=1,NL!B10,IF(cal!$S$7=2,EN!B10,IF(cal!$S$7=3,DE!B10,IF(cal!$S$7=4,FR!B10,IF(cal!$S$7=5,NR!B10,IF(cal!$S$7=6,SP!B10,IF(cal!$S$7=7,SW!B10,IF(cal!$S$7=8,TS!B10,IF(cal!$S$7=9,ExtraTaal1!B10,IF(cal!$S$7=10,ExtraTaal2!B10,IF(cal!$S$7=11,ExtraTaal3!B10,)))))))))))","v":0},{"$f":"IF($S$7=1,NL!C10,IF(cal!$S$7=2,EN!C10,IF(cal!$S$7=3,DE!C10,IF(cal!$S$7=4,FR!C10,IF(cal!$S$7=5,NR!C10,IF(cal!$S$7=6,SP!C10,IF(cal!$S$7=7,SW!C10,IF(cal!$S$7=8,TS!C10,IF(cal!$S$7=9,ExtraTaal1!C10,IF(cal!$S$7=10,ExtraTaal2!C10,IF(cal!$S$7=11,ExtraTaal3!C10,)))))))))))","v":0},{"$f":"'Clima Canal'!E12","v":20},null,{"$f":"B11","v":"Room temp."},{"$f":"IF($S$7=1,NL!G10,IF(cal!$S$7=2,EN!G10,IF(cal!$S$7=3,DE!G10,IF(cal!$S$7=4,FR!G10,))))","v":0},null,null,{"$f":"'Clima Canal'!K12","v":27},{"$nulls":7},{"$f":"IF($X$4=1,E11,IF($X$4=2,(E11-32)/1.8))","v":{"v":20,"d":"20.0"}},{"$f":"(($S$9-$S$10)/LN(($S$9-$S$11)/($S$10-$S$11)))/((75-65)/LN((75-20)/(65-20)))","v":{"v":1,"d":"1.000"}},null,null,{"$f":"(($X$9-$X$10)/LN(($X$9-$X$11)/($X$10-$X$11)))/((16-18)/LN((16-27)/(18-27)))","v":{"v":1,"d":"1.000"}},{"$f":"IF($X$4=1,K11,IF($X$4=2,(K11-32)/1.8))","v":{"v":27,"d":"27.0"}},null,{"$f":"IF($X$4=1,(101325*(1-((0.0065*M8)/(288.15)))^((9.81*0.028964)/(8.31447*0.0065))),IF($X$4=2,(101325*(1-((0.0065*(M8*0.3048))/(288.15)))^((9.81*0.028964)/(8.31447*0.0065)))))","v":101325},{"$f":"IF($X$4=1,M8/1000,IF($X$4=2,M8*0.0003048))","v":0},{"$f":"-(0.000265264729874266*AA11^6)+(0.000957582908802335*AA11^5)+(0.00470250661483425*AA11^4)-(0.0298716926548353*AA11^3)+(0.0557086806557086*AA11^2)-(0.0484008125693582*AA11)+1","v":1}]
[null,{"$f":"G12","v":"Relative humidity"},null,null,{"v":0.5,"d":"50%"},null,{"$f":"IF($S$7=1,NL!F11,IF(cal!$S$7=2,EN!F11,IF(cal!$S$7=3,DE!F11,IF(cal!$S$7=4,FR!F11,IF(cal!$S$7=5,NR!F11,IF(cal!$S$7=6,SP!F11,IF(cal!$S$7=7,SW!F11,IF(cal!$S$7=8,TS!F11,IF(cal!$S$7=9,ExtraTaal1!F11,IF(cal!$S$7=10,ExtraTaal2!F11,IF(cal!$S$7=11,ExtraTaal3!F11,)))))))))))","v":"Relative humidity"},{"$nulls":3},{"$f":"'Clima Canal'!K13","v":{"v":0.5,"d":"50%"}}]
[]
[{"$nulls":4},{"$f":"IF($X$4=1,1,IF($X$4=2,0.004403))","v":{"v":1,"d":"1.0000"}},{"$f":"IF($X$4=1,1,IF($X$4=2,4.0147))","v":{"v":1,"d":"1.0000"}},{"$f":"IF($X$4=1,0.000334444444444444,IF($X$4=2,0.000568224721372))","v":{"v":0.000334444444444444,"d":"0.0003"}},{"$f":"IF($X$4=1,1,IF($X$4=2,3.4121416331))","v":{"v":1,"d":"1.0000"}},{"$f":"IF($X$4=1,1,IF($X$4=2,0.004403))","v":{"v":1,"d":"1.0000"}},{"$f":"IF($X$4=1,1,IF($X$4=2,4.0147))","v":{"v":1,"d":"1.0000"}},{"$nulls":3},{"$f":"IF($X$4=1,1,IF($X$4=2,0.588575))","v":{"v":1,"d":"1.0000"}},{"$f":"IF($X$4=1,1,1.8)","v":{"v":1,"d":"1.0000"}},{"$f":"IF($X$4=1,0,32)","v":{"v":0,"d":"0.0000"}},null,null,"8 & 10","13/27","13/32",19]
[null,{"$f":"IF($S$7=1,NL!A14,IF(cal!$S$7=2,EN!A14,IF(cal!$S$7=3,DE!A14,IF(cal!$S$7=4,FR!A14,IF(cal!$S$7=5,NR!A14,IF(cal!$S$7=6,SP!A14,IF(cal!$S$7=7,SW!A14,IF(cal!$S$7=8,TS!A14,IF(cal!$S$7=9,ExtraTaal1!A14,IF(cal!$S$7=10,ExtraTaal2!A14,IF(cal!$S$7=11,ExtraTaal3!A14,)))))))))))","v":"Speed level:"},{"$f":"IF($S$7=1,NL!B14,IF(cal!$S$7=2,EN!B14,IF(cal!$S$7=3,DE!B14,IF(cal!$S$7=4,FR!B14,IF(cal!$S$7=5,NR!B14,IF(cal!$S$7=6,SP!B14,IF(cal!$S$7=7,SW!B14,IF(cal!$S$7=8,TS!B14,IF(cal!$S$7=9,ExtraTaal1!B14,IF(cal!$S$7=10,ExtraTaal2!B14,IF(cal!$S$7=11,ExtraTaal3!B14,)))))))))))","v":"Control voltage [V]"},{"$f":"IF($S$7=1,NL!C14,IF(cal!$S$7=2,EN!C14,IF(cal!$S$7=3,DE!C14,IF(cal!$S$7=4,FR!C14,IF(cal!$S$7=5,NR!C14,IF(cal!$S$7=6,SP!C14,IF(cal!$S$7=7,SW!C14,IF(cal!$S$7=8,TS!C14,IF(cal!$S$7=9,ExtraTaal1!C14,IF(cal!$S$7=10,ExtraTaal2!C14,IF(cal!$S$7=11,ExtraTaal3!C14,)))))))))))","v":"Heat output * 75/65/20 [W]"},{"$f":"IF($S$7=1,NL!D14,IF(cal!$S$7=2,EN!D14,IF(cal!$S$7=3,DE!D14,IF(cal!$S$7=4,FR!D14,IF(cal!$S$7=5,NR!D14,IF(cal!$S$7=6,SP!D14,IF(cal!$S$7=7,SW!D14,IF(cal!$S$7=8,TS!D14,IF(cal!$S$7=9,ExtraTaal1!D14,IF(cal!$S$7=10,ExtraTaal2!D14,IF(cal!$S$7=11,ExtraTaal3!D14,)))))))))))","v":"Water flowrate, heating [l/h]"},{"$f":"IF($S$7=1,NL!E14,IF(cal!$S$7=2,EN!E14,IF(cal!$S$7=3,DE!E14,IF(cal!$S$7=4,FR!E14,IF(cal!$S$7=5,NR!E14,IF(cal!$S$7=6,SP!E14,IF(cal!$S$7=7,SW!E14,IF(cal!$S$7=8,TS!E14,IF(cal!$S$7=9,ExtraTaal1!E14,IF(cal!$S$7=10,ExtraTaal2!E14,IF(cal!$S$7=11,ExtraTaal3!E14,)))))))))))","v":"Watersided pressure loss [kPa]"},{"$f":"IF($S$7=1,NL!F14,IF(cal!$S$7=2,EN!F14,IF(cal!$S$7=3,DE!F14,IF(cal!$S$7=4,FR!F14,IF(cal!$S$7=5,NR!F14,IF(cal!$S$7=6,SP!F14,IF(cal!$S$7=7,SW!F14,IF(cal!$S$7=8,TS!F14,IF(cal!$S$7=9,ExtraTaal1!F14,IF(cal!$S$7=10,ExtraTaal2!F14,IF(cal!$S$7=11,ExtraTaal3!F14,)))))))))))","v":"Sens. cooling capacity * 16/18/27 [W]"},{"$f":"IF($S$7=1,NL!G14,IF(cal!$S$7=2,EN!G14,IF(cal!$S$7=3,DE!G14,IF(cal!$S$7=4,FR!G14,IF(cal!$S$7=5,NR!G14,IF(cal!$S$7=6,SP!G14,IF(cal!$S$7=7,SW!G14,IF(cal!$S$7=8,TS!G14,IF(cal!$S$7=9,ExtraTaal1!G14,IF(cal!$S$7=10,ExtraTaal2!G14,IF(cal!$S$7=11,ExtraTaal3!G14,)))))))))))","v":"Tot. cooling capacity 16/18/27 [W]"},{"$f":"IF($S$7=1,NL!H14,IF(cal!$S$7=2,EN!H14,IF(cal!$S$7=3,DE!H14,IF(cal!$S$7=4,FR!H14,IF(cal!$S$7=5,NR!H14,IF(cal!$S$7=6,SP!H14,IF(cal!$S$7=7,SW!H14,IF(cal!$S$7=8,TS!H14,IF(cal!$S$7=9,ExtraTaal1!H14,IF(cal!$S$7=10,ExtraTaal2!H14,IF(cal!$S$7=11,ExtraTaal3!H14,)))))))))))","v":"Water flowrate, cooling [l/h]"},{"$f":"IF($S$7=1,NL!I14,IF(cal!$S$7=2,EN!I14,IF(cal!$S$7=3,DE!I14,IF(cal!$S$7=4,FR!I14,IF(cal!$S$7=5,NR!I14,IF(cal!$S$7=6,SP!I14,IF(cal!$S$7=7,SW!I14,IF(cal!$S$7=8,TS!I14,IF(cal!$S$7=9,ExtraTaal1!I14,IF(cal!$S$7=10,ExtraTaal2!I14,IF(cal!$S$7=11,ExtraTaal3!I14,)))))))))))","v":"Watersided pressure loss [kPa]"},{"$f":"IF($S$7=1,NL!J14,IF(cal!$S$7=2,EN!J14,IF(cal!$S$7=3,DE!J14,IF(cal!$S$7=4,FR!J14,IF(cal!$S$7=5,NR!J14,IF(cal!$S$7=6,SP!J14,IF(cal!$S$7=7,SW!J14,IF(cal!$S$7=8,TS!J14,IF(cal!$S$7=9,ExtraTaal1!J14,IF(cal!$S$7=10,ExtraTaal2!J14,IF(cal!$S$7=11,ExtraTaal3!J14,)))))))))))","v":"Sound pressure *** [dB(A)]"},{"$f":"IF($S$7=1,NL!K14,IF(cal!$S$7=2,EN!K14,IF(cal!$S$7=3,DE!K14,IF(cal!$S$7=4,FR!K14,IF(cal!$S$7=5,NR!K14,IF(cal!$S$7=6,SP!K14,IF(cal!$S$7=7,SW!K14,IF(cal!$S$7=8,TS!K14,IF(cal!$S$7=9,ExtraTaal1!K14,IF(cal!$S$7=10,ExtraTaal2!K14,IF(cal!$S$7=11,ExtraTaal3!K14,)))))))))))","v":"Sound power ** [dB(A)]"},{"$f":"IF($S$7=1,NL!L14,IF(cal!$S$7=2,EN!L14,IF(cal!$S$7=3,DE!L14,IF(cal!$S$7=4,FR!L14,IF(cal!$S$7=5,NR!L14,IF(cal!$S$7=6,SP!L14,IF(cal!$S$7=7,SW!L14,IF(cal!$S$7=8,TS!L14,IF(cal!$S$7=9,ExtraTaal1!L14,IF(cal!$S$7=10,ExtraTaal2!L14,IF(cal!$S$7=11,ExtraTaal3!L14,)))))))))))","v":"Electrical power [W]"},{"$f":"IF($S$7=1,NL!M14,IF(cal!$S$7=2,EN!M14,IF(cal!$S$7=3,DE!M14,IF(cal!$S$7=4,FR!M14,IF(cal!$S$7=5,NR!M14,IF(cal!$S$7=6,SP!M14,IF(cal!$S$7=7,SW!M14,IF(cal!$S$7=8,TS!M14,IF(cal!$S$7=9,ExtraTaal1!M14,IF(cal!$S$7=10,ExtraTaal2!M14,IF(cal!$S$7=11,ExtraTaal3!M14,)))))))))))","v":"Air flowrate [m³/h]"},{"$f":"IF($S$7=1,NL!N14,IF(cal!$S$7=2,EN!N14,IF(cal!$S$7=3,DE!N14,IF(cal!$S$7=4,FR!N14,IF(cal!$S$7=5,NR!N14,IF(cal!$S$7=6,SP!N14,IF(cal!$S$7=7,SW!N14,IF(cal!$S$7=8,TS!N14,IF(cal!$S$7=9,ExtraTaal1!N14,IF(cal!$S$7=10,ExtraTaal2!N14,IF(cal!$S$7=11,ExtraTaal3!N14,)))))))))))","v":"Air exhaust temp. heating [°C]"},{"$f":"IF($S$7=1,NL!O14,IF(cal!$S$7=2,EN!O14,IF(cal!$S$7=3,DE!O14,IF(cal!$S$7=4,FR!O14,IF(cal!$S$7=5,NR!O14,IF(cal!$S$7=6,SP!O14,IF(cal!$S$7=7,SW!O14,IF(cal!$S$7=8,TS!O14,IF(cal!$S$7=9,ExtraTaal1!O14,IF(cal!$S$7=10,ExtraTaal2!O14,IF(cal!$S$7=11,ExtraTaal3!O14,)))))))))))","v":"Air exhaust temp. cooling [°C]"},"n- heating","n- cooling","n- cooling","n- cooling","n- cooling","n- cooling",null,"Q_verw","dP_verw","Q_voelb_c","dP_cool","Geluid_P","P_elek","V_air","Q_verw","dP_verw","Q_voelb_c","dP_cool","Geluid_P","P_elek","V_air","Q_verw","dP_verw","Q_voelb_c","dP_cool","Geluid_P","P_elek","V_air",{"$nulls":4},"Q_verw","dP_verw","Q_voelb_c","dP_cool","Geluid_P","P_elek","V_air","Q_verw","dP_verw","Q_voelb_c","dP_cool","Geluid_P","P_elek","V_air","Q_verw","dP_verw","Q_voelb_c","dP_cool","Geluid_P","P_elek","V_air",null,"Q_verw","dP_verw","Q_voelb_c","dP_cool","Geluid_P","P_elek","V_air","Q_verw","dP_verw","Q_voelb_c","dP_cool","Geluid_P","P_elek","V_air",null,"Q_verw","dP_verw","Q_voelb_c","dP_cool","Geluid_P","P_elek","V_air","Q_verw","dP_verw","Q_voelb_c","dP_cool","Geluid_P","P_elek","V_air"]
[null,{"$f":"IF($S$7=1,NL!A15,IF(cal!$S$7=2,EN!A15,IF(cal!$S$7=3,DE!A15,IF(cal!$S$7=4,FR!A15,IF(cal!$S$7=5,NR!A15,IF(cal!$S$7=6,SP!A15,IF(cal!$S$7=7,SW!A15,IF(cal!$S$7=8,TS!A15,IF(cal!$S$7=9,ExtraTaal1!A15,IF(cal!$S$7=10,ExtraTaal2!A15,IF(cal!$S$7=11,ExtraTaal3!A15,)))))))))))","v":"Clima Canal height 13 cm width 32 cm length 70 cm (Type 1)"},{"$f":"IF($S$7=1,NL!B15,IF(cal!$S$7=2,EN!B15,IF(cal!$S$7=3,DE!B15,IF(cal!$S$7=4,FR!B15,IF(cal!$S$7=5,NR!B15,IF(cal!$S$7=6,SP!B15,IF(cal!$S$7=7,SW!B15,IF(cal!$S$7=8,TS!B15,IF(cal!$S$7=9,ExtraTaal1!B15,IF(cal!$S$7=10,ExtraTaal2!B15,IF(cal!$S$7=11,ExtraTaal3!B15,)))))))))))","v":0},{"$f":"IF($S$7=1,NL!C15,IF(cal!$S$7=2,EN!C15,IF(cal!$S$7=3,DE!C15,IF(cal!$S$7=4,FR!C15,IF(cal!$S$7=5,NR!C15,IF(cal!$S$7=6,SP!C15,IF(cal!$S$7=7,SW!C15,IF(cal!$S$7=8,TS!C15,IF(cal!$S$7=9,ExtraTaal1!C15,IF(cal!$S$7=10,ExtraTaal2!C15,IF(cal!$S$7=11,ExtraTaal3!C15,)))))))))))","v":0},{"$f":"IF($S$7=1,NL!D15,IF(cal!$S$7=2,EN!D15,IF(cal!$S$7=3,DE!D15,IF(cal!$S$7=4,FR!D15,IF(cal!$S$7=5,NR!D15,IF(cal!$S$7=6,SP!D15,IF(cal!$S$7=7,SW!D15,IF(cal!$S$7=8,TS!D15,IF(cal!$S$7=9,ExtraTaal1!D15,IF(cal!$S$7=10,ExtraTaal2!D15,IF(cal!$S$7=11,ExtraTaal3!D15,)))))))))))","v":0},{"$f":"IF($S$7=1,NL!E15,IF(cal!$S$7=2,EN!E15,IF(cal!$S$7=3,DE!E15,IF(cal!$S$7=4,FR!E15,IF(cal!$S$7=5,NR!E15,IF(cal!$S$7=6,SP!E15,IF(cal!$S$7=7,SW!E15,IF(cal!$S$7=8,TS!E15,IF(cal!$S$7=9,ExtraTaal1!E15,IF(cal!$S$7=10,ExtraTaal2!E15,IF(cal!$S$7=11,ExtraTaal3!E15,)))))))))))","v":0},{"$f":"IF($S$7=1,NL!F15,IF(cal!$S$7=2,EN!F15,IF(cal!$S$7=3,DE!F15,IF(cal!$S$7=4,FR!F15,IF(cal!$S$7=5,NR!F15,IF(cal!$S$7=6,SP!F15,IF(cal!$S$7=7,SW!F15,IF(cal!$S$7=8,TS!F15,IF(cal!$S$7=9,ExtraTaal1!F15,IF(cal!$S$7=10,ExtraTaal2!F15,IF(cal!$S$7=11,ExtraTaal3!F15,)))))))))))","v":0},{"$f":"IF($S$7=1,NL!G15,IF(cal!$S$7=2,EN!G15,IF(cal!$S$7=3,DE!G15,IF(cal!$S$7=4,FR!G15,IF(cal!$S$7=5,NR!G15,IF(cal!$S$7=6,SP!G15,IF(cal!$S$7=7,SW!G15,IF(cal!$S$7=8,TS!G15,IF(cal!$S$7=9,ExtraTaal1!G15,IF(cal!$S$7=10,ExtraTaal2!G15,IF(cal!$S$7=11,ExtraTaal3!G15,)))))))))))","v":0},{"$f":"IF($S$7=1,NL!H15,IF(cal!$S$7=2,EN!H15,IF(cal!$S$7=3,DE!H15,IF(cal!$S$7=4,FR!H15,IF(cal!$S$7=5,NR!H15,IF(cal!$S$7=6,SP!H15,IF(cal!$S$7=7,SW!H15,IF(cal!$S$7=8,TS!H15,IF(cal!$S$7=9,ExtraTaal1!H15,IF(cal!$S$7=10,ExtraTaal2!H15,IF(cal!$S$7=11,ExtraTaal3!H15,)))))))))))","v":0},{"$f":"IF($S$7=1,NL!I15,IF(cal!$S$7=2,EN!I15,IF(cal!$S$7=3,DE!I15,IF(cal!$S$7=4,FR!I15,IF(cal!$S$7=5,NR!I15,IF(cal!$S$7=6,SP!I15,IF(cal!$S$7=7,SW!I15,IF(cal!$S$7=8,TS!I15,IF(cal!$S$7=9,ExtraTaal1!I15,IF(cal!$S$7=10,ExtraTaal2!I15,IF(cal!$S$7=11,ExtraTaal3!I15,)))))))))))","v":0},{"$f":"IF($S$7=1,NL!J15,IF(cal!$S$7=2,EN!J15,IF(cal!$S$7=3,DE!J15,IF(cal!$S$7=4,FR!J15,IF(cal!$S$7=5,NR!J15,IF(cal!$S$7=6,SP!J15,IF(cal!$S$7=7,SW!J15,IF(cal!$S$7=8,TS!J15,IF(cal!$S$7=9,ExtraTaal1!J15,IF(cal!$S$7=10,ExtraTaal2!J15,IF(cal!$S$7=11,ExtraTaal3!J15,)))))))))))","v":0},{"$f":"IF($S$7=1,NL!K15,IF(cal!$S$7=2,EN!K15,IF(cal!$S$7=3,DE!K15,IF(cal!$S$7=4,FR!K15,IF(cal!$S$7=5,NR!K15,IF(cal!$S$7=6,SP!K15,IF(cal!$S$7=7,SW!K15,IF(cal!$S$7=8,TS!K15,IF(cal!$S$7=9,ExtraTaal1!K15,IF(cal!$S$7=10,ExtraTaal2!K15,IF(cal!$S$7=11,ExtraTaal3!K15,)))))))))))","v":0},{"$f":"IF($S$7=1,NL!L15,IF(cal!$S$7=2,EN!L15,IF(cal!$S$7=3,DE!L15,IF(cal!$S$7=4,FR!L15,IF(cal!$S$7=5,NR!L15,IF(cal!$S$7=6,SP!L15,IF(cal!$S$7=7,SW!L15,IF(cal!$S$7=8,TS!L15,IF(cal!$S$7=9,ExtraTaal1!L15,IF(cal!$S$7=10,ExtraTaal2!L15,IF(cal!$S$7=11,ExtraTaal3!L15,)))))))))))","v":0},{"$f":"IF($S$7=1,NL!M15,IF(cal!$S$7=2,EN!M15,IF(cal!$S$7=3,DE!M15,IF(cal!$S$7=4,FR!M15,IF(cal!$S$7=5,NR!M15,IF(cal!$S$7=6,SP!M15,IF(cal!$S$7=7,SW!M15,IF(cal!$S$7=8,TS!M15,IF(cal!$S$7=9,ExtraTaal1!M15,IF(cal!$S$7=10,ExtraTaal2!M15,IF(cal!$S$7=11,ExtraTaal3!M15,)))))))))))","v":0},{"$f":"IF($S$7=1,NL!N15,IF(cal!$S$7=2,EN!N15,IF(cal!$S$7=3,DE!N15,IF(cal!$S$7=4,FR!N15,IF(cal!$S$7=5,NR!N15,IF(cal!$S$7=6,SP!N15,IF(cal!$S$7=7,SW!N15,IF(cal!$S$7=8,TS!N15,IF(cal!$S$7=9,ExtraTaal1!N15,IF(cal!$S$7=10,ExtraTaal2!N15,IF(cal!$S$7=11,ExtraTaal3!N15,)))))))))))","v":0},{"$f":"IF($S$7=1,NL!O15,IF(cal!$S$7=2,EN!O15,IF(cal!$S$7=3,DE!O15,IF(cal!$S$7=4,FR!O15,IF(cal!$S$7=5,NR!O15,IF(cal!$S$7=6,SP!O15,IF(cal!$S$7=7,SW!O15,IF(cal!$S$7=8,TS!O15,IF(cal!$S$7=9,ExtraTaal1!O15,IF(cal!$S$7=10,ExtraTaal2!O15,IF(cal!$S$7=11,ExtraTaal3!O15,)))))))))))","v":0},"n-value","n-value","n-value","n-value","n-value","n-value",null,{"$f":"IF('Clima Canal'!$K$6=cal!AE2,1,IF('Clima Canal'!$K$6=cal!AE3,2,IF('Clima Canal'!$K$6=cal!AE5,3,IF('Clima Canal'!$K$6=cal!AE6,4,IF('Clima Canal'!$K$6=cal!AE9,5,IF('Clima Canal'!$K$6=cal!AE10,6,IF('Clima Canal'!$K$6=cal!AE4,7,IF('Clima Canal'!$K$6=AE7,8,IF('Clima Canal'!$K$6=AE8,9,)))))))))","v":3},{"$nulls":6},{"$f":"CONCATENATE(\"Clima H\",AF22,\" B\",AH22)","v":"Clima H8 B18"},{"$nulls":6},{"$f":"CONCATENATE(\"Clima H\",AM22,\" B\",AO22)","v":"Clima H10 B18"},{"$nulls":7},"voelbare koelcapaciteit","totale koelcapaciteit",null,{"$f":"CONCATENATE(\"Clima H\",AX22,\" B\",AZ22,\" 4P\")","v":"Clima H13 B27 4P"},{"$nulls":6},{"$f":"CONCATENATE(\"Clima H\",BE22,\" B\",BG22,\" 4P\")","v":"Clima H13 B32 4P"},{"$nulls":6},{"$f":"CONCATENATE(\"Clima H\",BL22,\" B\",BN22,\" 2P\")","v":"Clima H13 B32 2P"},{"$nulls":7},{"$f":"CONCATENATE(\"Clima H\",BT22,\" B\",BV22,\" 4P\")","v":"Clima H19 B34 4P"},{"$nulls":6},{"$f":"CONCATENATE(\"Clima H\",CA22,\" B\",CC22,\" 2P\")","v":"Clima H19 B34 2P"},{"$nulls":7},{"$f":"CONCATENATE(\"Clima H\",CI22,\" B\",CK22,\" 4P\")","v":"Clima H15 B32 4P"},{"$nulls":6},{"$f":"CONCATENATE(\"Clima H\",CP22,\" B\",CR22,\" 2P\")","v":"Clima H15 B32 2P"}]
[null,{"v":0.2,"d":"20%"},2,{"$f":"(X17*($T$11^$Q17))*Watts*CF_Altit","v":{"v":312.780863986964,"d":"313"}},{"$f":"ROUND(((D17/Watts)/(($S$9-$S$10)*1.163))*$E$14,IF($X$4=1,0,IF($X$4=2,2)))","v":27},{"$f":"($Y$18*(E17/$E$14)^$Y$20)*$F$14","v":{"v":0.011330472972336471,"d":"0.01"}},{"$f":"(Z17*($W$11^R17))*Watts*CF_Altit","v":{"v":67.30637191738002,"d":"67"}},{"$f":"((G17/Watts)/(IF((237.3*LN((RH*EXP(17.27*(Tl_cool/(Tl_cool+237.3))))))/(17.27-LN((RH*EXP(17.27*(Tl_cool/(Tl_cool+237.3))))))<Tavg_cold,1,IF(1/(1+((2258*((0.622/(($Z$11/(1*611*EXP(17.27*(Tavg_cold/(Tavg_cold+237.3))))))-1)*1000-(0.622/(($Z$11/(RH*611*EXP(17.27*(Tl_cool/(Tl_cool+237.3))))))-1)*1000))/(1005*(Tavg_cold-Tl_cool))))*1.039+((-0.000729*$C17+0.001448)*(Tl_cool-Tavg_cold)+(0.016908*$C17-0.033574))*1.039>1,1,1/(1+((2258*((0.622/(($Z$11/(1*611*EXP(17.27*(Tavg_cold/(Tavg_cold+237.3))))))-1)*1000-(0.622/(($Z$11/(RH*611*EXP(17.27*(Tl_cool/(Tl_cool+237.3))))))-1)*1000))/(1005*(Tavg_cold-Tl_cool))))*1.039+((-0.000729*$C17+0.001448)*(Tl_cool-Tavg_cold)+(0.016908*$C17-0.033574))*1.039))))*Watts","v":{"v":67.30637191738002,"d":"67"}},{"$f":"ROUND(((H17/Watts)/((Tr_cool-Tv_cool)*1.163))*$I$14,IF($X$4=1,0,IF($X$4=2,2)))","v":29},{"$f":"($AA$18*(I17/$I$14)^$AA$20)*$J$14","v":{"v":0.012997932122495996,"d":"0.01"}},{"$f":"L17-8","v":{"v":16,"d":"16.0"}},{"$f":"AB17","v":{"v":24,"d":"24.0"}},{"v":0.984,"d":"1.0"},{"$f":"AD17*Cubics","v":35},{"$f":"((($D17/Watts)/(((p_atm*0.028964)/(8.31447*(20+273.15)))*(($N17/3600)/Cubics)*(1005+1870*((0.622)/(((p_atm)/($E$12*Pvs_Heat_in))-1)))))+Tl_heat)*Celc1+Celc2","v":{"v":46.231789507245956,"d":"46"}},{"$f":"(Tl_cool-(($G17/Watts)/(1006*$N17*kgss)))*Celc1+Celc2","v":{"v":21.284342853591117,"d":"21"}},1,{"$f":"IF($X$16=1,S17,IF($X$16=2,S17,IF($X$16=3,U17,IF($X$16=4,U17,IF(OR($X$16=5,$X$16=8),V17,IF(OR($X$16=6,$X$16=9),V17,IF($X$16=7,T17,)))))))","v":{"v":0.7807,"d":"0.781"}},{"v":0.6,"d":"0.600"},{"v":1.16,"d":"1.160"},{"v":0.7807,"d":"0.781"},{"v":0.8766,"d":"0.877"},{"$f":"(H17-G17)/H17","v":{"v":0,"d":"0.0%"}},{"$f":"IF($X$16=1,AE17,IF($X$16=2,AL17,IF($X$16=3,BK17,IF($X$16=4,BD17,IF($X$16=5,BZ17,IF($X$16=6,BS17,IF($X$16=7,AW17,IF($X$16=9,CH17,IF($X$16=8,CO17,)))))))))","v":312.780863986964},{"$f":"IF($X$16=1,AF17,IF($X$16=2,AM17,IF($X$16=3,BL17,IF($X$16=4,BE17,IF($X$16=5,CA17,IF($X$16=6,BT17,IF($X$16=7,AX17,IF($X$16=9,CI17,IF($X$16=8,CP17,)))))))))","v":"a"},67.30637191738002,"a",{"v":24,"d":"24.0"},{"v":0.984,"d":"1.0"},35,276,"a",30,"a",{"v":22,"d":"22.0"},0.5,24,{"$f":"AE17","v":276},"a",30,"a",{"$f":"AI17","v":{"v":22,"d":"22.0"}},{"$f":"AJ17","v":0.5},{"$f":"AK17","v":24},null,{"$f":"(AG17*((((Tv_cool-Tr_cool)/LN((Tv_cool-Tl_cool)/(Tr_cool-Tl_cool)))/((16-18)/LN((16-27)/(18-27))))^S17))*$G$14","v":0.010033333333333321},{"$f":"((AT17/$G$14)/(IF((237.3*LN((RH*EXP(17.27*(Tl_cool/(Tl_cool+237.3))))))/(17.27-LN((RH*EXP(17.27*(Tl_cool/(Tl_cool+237.3))))))<((Tv_cool+Tr_cool)/2),1,1/(1+((2258*((0.622/((p_atm/(1*611*EXP(17.27*(((Tv_cool+Tr_cool)/2)/(((Tv_cool+Tr_cool)/2)+237.3))))))-1)*1000-(0.622/((p_atm/(RH*611*EXP(17.27*(Tl_cool/(Tl_cool+237.3))))))-1)*1000))/(1005*(((Tv_cool+Tr_cool)/2)-Tl_cool))))+-((-0.000625*$C17+0.00625)*(Tl_cool-(Tv_cool+Tr_cool)/2)-(-0.000625*$C17+0.00625)*10))))*$H$14","v":30.000000000000004},null,362,"a",41,"a",{"v":24,"d":"24.0"},{"v":1,"d":"1.0"},38,268.32763,"a",64.62350778752945,"a",{"v":24,"d":"24.0"},{"v":0.984,"d":"1.0"},35,312.780863986964,"a",67.30637191738002,"a",{"$f":"BH17","v":{"v":24,"d":"24.0"}},{"$f":"BI17","v":{"v":0.984,"d":"1.0"}},35,null,830.2698508944231,"a",149.14769510261706,"a",{"v":24.96461248200304,"d":"25.0"},1.5,97,1245.404776341635,"a",164.0624646128788,"a",{"v":24.96461248200304,"d":"25.0"},1.5,97,null,{"$f":"BS17*0.9","v":747.2428658049809},"a",{"$f":"BU17*0.9","v":134.23292559235537},"a",{"v":24.96461248200304,"d":"25.0"},1.5,97,{"$f":"BZ17*0.9","v":1120.8642987074716},"a",{"$f":"CB17*0.9","v":147.65621815159093},"a",{"v":24.96461248200304,"d":"25.0"},1.5,97]
[null,{"v":0.4,"d":"40%"},4,{"$f":"(X18*($T$11^$Q18))*Watts*CF_Altit","v":{"v":691.7684114772115,"d":"692"}},{"$f":"ROUND(((D18/Watts)/(($S$9-$S$10)*1.163))*$E$14,IF($X$4=1,0,IF($X$4=2,2)))","v":59},{"$f":"($Y$18*(E18/$E$14)^$Y$20)*$F$14","v":{"v":0.050875474673144246,"d":"0.05"}},{"$f":"(Z18*($W$11^R18))*Watts*CF_Altit","v":{"v":122.2114852533066,"d":"122"}},{"$f":"((G18/Watts)/(IF((237.3*LN((RH*EXP(17.27*(Tl_cool/(Tl_cool+237.3))))))/(17.27-LN((RH*EXP(17.27*(Tl_cool/(Tl_cool+237.3))))))<Tavg_cold,1,IF(1/(1+((2258*((0.622/(($Z$11/(1*611*EXP(17.27*(Tavg_cold/(Tavg_cold+237.3))))))-1)*1000-(0.622/(($Z$11/(RH*611*EXP(17.27*(Tl_cool/(Tl_cool+237.3))))))-1)*1000))/(1005*(Tavg_cold-Tl_cool))))*1.039+((-0.000729*$C18+0.001448)*(Tl_cool-Tavg_cold)+(0.016908*$C18-0.033574))*1.039>1,1,1/(1+((2258*((0.622/(($Z$11/(1*611*EXP(17.27*(Tavg_cold/(Tavg_cold+237.3))))))-1)*1000-(0.622/(($Z$11/(RH*611*EXP(17.27*(Tl_cool/(Tl_cool+237.3))))))-1)*1000))/(1005*(Tavg_cold-Tl_cool))))*1.039+((-0.000729*$C18+0.001448)*(Tl_cool-Tavg_cold)+(0.016908*$C18-0.033574))*1.039))))*Watts","v":{"v":122.2114852533066,"d":"122"}},{"$f":"ROUND(((H18/Watts)/((Tr_cool-Tv_cool)*1.163))*$I$14,IF($X$4=1,0,IF($X$4=2,2)))","v":53},{"$f":"($AA$18*(I18/$I$14)^$AA$20)*$J$14","v":{"v":0.04140201745291053,"d":"0.04"}},{"$f":"L18-8","v":{"v":19,"d":"19.0"}},{"v":27,"d":"27.0"},{"v":1.6320000000000001,"d":"1.6"},{"$f":"AD18*Cubics","v":44},{"$f":"((($D18/Watts)/(((p_atm*0.028964)/(8.31447*(20+273.15)))*(($N18/3600)/Cubics)*(1005+1870*((0.622)/(((p_atm)/($E$12*Pvs_Heat_in))-1)))))+Tl_heat)*Celc1+Celc2","v":{"v":66.14916403171667,"d":"66"}},{"$f":"(Tl_cool-(($G18/Watts)/(1006*$N18*kgss)))*Celc1+Celc2","v":{"v":18.744614108765102,"d":"19"}},1,{"$f":"IF($X$16=1,S18,IF($X$16=2,S18,IF($X$16=3,U18,IF($X$16=4,U18,IF(OR($X$16=5,$X$16=8),V18,IF(OR($X$16=6,$X$16=9),V18,IF($X$16=7,T18,)))))))","v":{"v":0.8587,"d":"0.859"}},{"v":0.68,"d":"0.680"},{"v":1.04,"d":"1.040"},{"v":0.8587,"d":"0.859"},{"v":0.8775,"d":"0.878"},{"$f":"(H18-G18)/H18","v":{"v":0,"d":"0.0%"}},{"$f":"IF($X$16=1,AE18,IF($X$16=2,AL18,IF($X$16=3,BK18,IF($X$16=4,BD18,IF($X$16=5,BZ18,IF($X$16=6,BS18,IF($X$16=7,AW18,IF($X$16=9,CH18,IF($X$16=8,CO18,)))))))))","v":691.7684114772115},{"$f":"IF($X$16=1,AF18,IF($X$16=2,AM18,IF($X$16=3,BL18,IF($X$16=4,BE18,IF($X$16=5,CA18,IF($X$16=6,BT18,IF($X$16=7,AX18,IF($X$16=9,CI18,IF($X$16=8,CP18,)))))))))","v":2.0144747035437757E-5},{"$f":"IF($X$16=1,AG18,IF($X$16=2,AN18,IF($X$16=3,BM18,IF($X$16=4,BF18,IF($X$16=5,CB18,IF($X$16=6,BU18,IF($X$16=7,AY18,IF($X$16=9,CJ18,IF($X$16=8,CQ18,)))))))))","v":122.2114852533066},{"$f":"IF($X$16=1,AH18,IF($X$16=2,AO18,IF($X$16=3,BN18,IF($X$16=4,BG18,IF($X$16=5,CC18,IF($X$16=6,BV18,IF($X$16=7,AZ18,IF($X$16=9,CK18,IF($X$16=8,CR18,)))))))))","v":2.0144747035437757E-5},{"$f":"IF($X$16=1,AI18,IF($X$16=2,AP18,IF($X$16=3,BO18,IF($X$16=4,BH18,IF($X$16=5,CD18,IF($X$16=6,BW18,IF($X$16=7,BA18,IF($X$16=9,CL18,IF($X$16=8,CS18,)))))))))","v":{"v":27,"d":"27.0"}},{"$f":"IF($X$16=1,AJ18,IF($X$16=2,AQ18,IF($X$16=3,BP18,IF($X$16=4,BI18,IF($X$16=5,CE18,IF($X$16=6,BX18,IF($X$16=7,BB18,IF($X$16=9,CM18,IF($X$16=8,CT18,)))))))))","v":{"v":1.6320000000000001,"d":"1.6"}},{"$f":"IF($X$16=1,AK18,IF($X$16=2,AR18,IF($X$16=3,BQ18,IF($X$16=4,BJ18,IF($X$16=5,CF18,IF($X$16=6,BY18,IF($X$16=7,BC18,IF($X$16=9,CN18,IF($X$16=8,CU18,)))))))))","v":44},496,2.5649818987149339E-4,66,{"$f":"AF18","v":2.5649818987149339E-4},{"v":23,"d":"23.0"},0.8,37,{"$f":"AE18","v":496},{"$f":"AH18","v":2.5649818987149339E-4},66,{"$f":"AM18","v":2.5649818987149339E-4},{"$f":"AI18","v":{"v":23,"d":"23.0"}},0.8,37,null,{"$f":"(AG18*((((Tv_cool-Tr_cool)/LN((Tv_cool-Tl_cool)/(Tr_cool-Tl_cool)))/((16-18)/LN((16-27)/(18-27))))^S18))*$G$14","v":0.022073333333333306},{"$f":"((AT18/$G$14)/(IF((237.3*LN((RH*EXP(17.27*(Tl_cool/(Tl_cool+237.3))))))/(17.27-LN((RH*EXP(17.27*(Tl_cool/(Tl_cool+237.3))))))<((Tv_cool+Tr_cool)/2),1,1/(1+((2258*((0.622/((p_atm/(1*611*EXP(17.27*(((Tv_cool+Tr_cool)/2)/(((Tv_cool+Tr_cool)/2)+237.3))))))-1)*1000-(0.622/((p_atm/(RH*611*EXP(17.27*(Tl_cool/(Tl_cool+237.3))))))-1)*1000))/(1005*(((Tv_cool+Tr_cool)/2)-Tl_cool))))+-((-0.000625*$C18+0.00625)*(Tl_cool-(Tv_cool+Tr_cool)/2)-(-0.000625*$C18+0.00625)*10))))*$H$14","v":66},null,590,2.55E-5,84,{"v":5.80812e-06,"d":"5.81E-06"},{"v":27,"d":"27.0"},1.6,55,535.1363699999999,2.92985e-05,117.3585340330626,1.1996876822122094E-5,{"v":27,"d":"27.0"},{"v":1.6320000000000001,"d":"1.6"},44,691.7684114772115,2.0144747035437757E-5,122.2114852533066,{"$f":"BL18","v":2.0144747035437757E-5},{"$f":"BH18","v":{"v":27,"d":"27.0"}},{"v":1.6320000000000001,"d":"1.6"},44,null,1310.3000494857993,2.2035480565662373E-5,291.40048094666514,6.6066314442915391E-5,{"v":29.00836437340129,"d":"29.0"},2.7,167,1965.4500742286991,2.7734576306310619E-5,320.54052904133164,2.7734576306310619E-5,{"v":29.00836437340129,"d":"29.0"},2.7,167,null,{"$f":"BS18*0.9","v":1179.2700445372193},2.2035480565662373E-5,{"$f":"BU18*0.9","v":262.26043285199864},6.6066314442915391E-5,{"v":29.00836437340129,"d":"29.0"},2.7,167,{"$f":"BZ18*0.9","v":1768.9050668058292},2.7734576306310619E-5,{"$f":"CB18*0.9","v":288.4864761371985},2.7734576306310619E-5,{"v":29.00836437340129,"d":"29.0"},2.7,167]
[null,{"v":0.6,"d":"60%"},6,{"$f":"(X19*($T$11^$Q19))*Watts*CF_Altit","v":{"v":1031.2359042995408,"d":"1031"}},{"$f":"ROUND(((D19/Watts)/(($S$9-$S$10)*1.163))*$E$14,IF($X$4=1,0,IF($X$4=2,2)))","v":89},{"$f":"($Y$18*(E19/$E$14)^$Y$20)*$F$14","v":{"v":0.11208162007510875,"d":"0.11"}},{"$f":"(Z19*($W$11^R19))*Watts*CF_Altit","v":{"v":174.53607497828463,"d":"175"}},{"$f":"((G19/Watts)/(IF((237.3*LN((RH*EXP(17.27*(Tl_cool/(Tl_cool+237.3))))))/(17.27-LN((RH*EXP(17.27*(Tl_cool/(Tl_cool+237.3))))))<Tavg_cold,1,IF(1/(1+((2258*((0.622/(($Z$11/(1*611*EXP(17.27*(Tavg_cold/(Tavg_cold+237.3))))))-1)*1000-(0.622/(($Z$11/(RH*611*EXP(17.27*(Tl_cool/(Tl_cool+237.3))))))-1)*1000))/(1005*(Tavg_cold-Tl_cool))))*1.039+((-0.000729*$C19+0.001448)*(Tl_cool-Tavg_cold)+(0.016908*$C19-0.033574))*1.039>1,1,1/(1+((2258*((0.622/(($Z$11/(1*611*EXP(17.27*(Tavg_cold/(Tavg_cold+237.3))))))-1)*1000-(0.622/(($Z$11/(RH*611*EXP(17.27*(Tl_cool/(Tl_cool+237.3))))))-1)*1000))/(1005*(Tavg_cold-Tl_cool))))*1.039+((-0.000729*$C19+0.001448)*(Tl_cool-Tavg_cold)+(0.016908*$C19-0.033574))*1.039))))*Watts","v":{"v":174.53607497828463,"d":"175"}},{"$f":"ROUND(((H19/Watts)/((Tr_cool-Tv_cool)*1.163))*$I$14,IF($X$4=1,0,IF($X$4=2,2)))","v":75},{"$f":"($AA$18*(I19/$I$14)^$AA$20)*$J$14","v":{"v":0.08067263097288387,"d":"0.08"}},{"$f":"L19-8","v":{"v":27,"d":"27.0"}},{"v":35,"d":"35.0"},3.2,{"$f":"AD19*Cubics","v":85},{"$f":"((($D19/Watts)/(((p_atm*0.028964)/(8.31447*(20+273.15)))*(($N19/3600)/Cubics)*(1005+1870*((0.622)/(((p_atm)/($E$12*Pvs_Heat_in))-1)))))+Tl_heat)*Celc1+Celc2","v":{"v":55.61187889212015,"d":"56"}},{"$f":"(Tl_cool-(($G19/Watts)/(1006*$N19*kgss)))*Celc1+Celc2","v":{"v":20.89698675329472,"d":"21"}},1,{"v":0.8831,"d":"0.883"},{"v":0.79,"d":"0.790"},{"v":0.95,"d":"0.950"},{"v":0.8831,"d":"0.883"},0.882,{"$f":"(H19-G19)/H19","v":{"v":0,"d":"0.0%"}},1031.2359042995408,"b",174.53607497828463,"b",{"v":35,"d":"35.0"},3.2,85,699,"b",104,"b",{"v":31,"d":"31.0"},1.3,52,{"$f":"AE19","v":699},"b",104,"b",{"v":31,"d":"31.0"},1.3,52,null,{"$f":"(AG19*((((Tv_cool-Tr_cool)/LN((Tv_cool-Tl_cool)/(Tr_cool-Tl_cool)))/((16-18)/LN((16-27)/(18-27))))^S19))*$G$14","v":0.03478222222222218},{"$f":"((AT19/$G$14)/(IF((237.3*LN((RH*EXP(17.27*(Tl_cool/(Tl_cool+237.3))))))/(17.27-LN((RH*EXP(17.27*(Tl_cool/(Tl_cool+237.3))))))<((Tv_cool+Tr_cool)/2),1,1/(1+((2258*((0.622/((p_atm/(1*611*EXP(17.27*(((Tv_cool+Tr_cool)/2)/(((Tv_cool+Tr_cool)/2)+237.3))))))-1)*1000-(0.622/((p_atm/(RH*611*EXP(17.27*(Tl_cool/(Tl_cool+237.3))))))-1)*1000))/(1005*(((Tv_cool+Tr_cool)/2)-Tl_cool))))+-((-0.000625*$C19+0.00625)*(Tl_cool-(Tv_cool+Tr_cool)/2)-(-0.000625*$C19+0.00625)*10))))*$H$14","v":104},null,786,"b",127,"b",35.1,2.9,85,754.79587,"b",168.71575127942032,"b",{"v":35,"d":"35.0"},3.2,85,1031.2359042995408,"b",174.53607497828463,"b",{"$f":"BH19","v":{"v":35,"d":"35.0"}},3.2,85,null,1711.1258342562737,"b",431.1620038649479,"b",{"v":34.99390078244104,"d":"35.0"},4.8,236,2566.688751384411,"b",474.2782042514428,"b",{"v":34.99390078244104,"d":"35.0"},4.8,236,null,1540.0132508306465,"b",388.04580347845314,"b",{"v":34.99390078244104,"d":"35.0"},4.8,236,2310.01987624597,"b",426.8503838262985,"b",{"v":34.99390078244104,"d":"35.0"},4.8,236]
[null,{"v":0.8,"d":"80%"},8,{"$f":"(X20*($T$11^$Q20))*Watts*CF_Altit","v":{"v":1331.183342453952,"d":"1331"}},{"$f":"ROUND(((D20/Watts)/(($S$9-$S$10)*1.163))*$E$14,IF($X$4=1,0,IF($X$4=2,2)))","v":114},{"$f":"($Y$18*(E20/$E$14)^$Y$20)*$F$14","v":{"v":0.1803446229891348,"d":"0.18"}},{"$f":"(Z20*($W$11^R20))*Watts*CF_Altit","v":{"v":224.28014109231404,"d":"224"}},{"$f":"((G20/Watts)/(IF((237.3*LN((RH*EXP(17.27*(Tl_cool/(Tl_cool+237.3))))))/(17.27-LN((RH*EXP(17.27*(Tl_cool/(Tl_cool+237.3))))))<Tavg_cold,1,IF(1/(1+((2258*((0.622/(($Z$11/(1*611*EXP(17.27*(Tavg_cold/(Tavg_cold+237.3))))))-1)*1000-(0.622/(($Z$11/(RH*611*EXP(17.27*(Tl_cool/(Tl_cool+237.3))))))-1)*1000))/(1005*(Tavg_cold-Tl_cool))))*1.039+((-0.000729*$C20+0.001448)*(Tl_cool-Tavg_cold)+(0.016908*$C20-0.033574))*1.039>1,1,1/(1+((2258*((0.622/(($Z$11/(1*611*EXP(17.27*(Tavg_cold/(Tavg_cold+237.3))))))-1)*1000-(0.622/(($Z$11/(RH*611*EXP(17.27*(Tl_cool/(Tl_cool+237.3))))))-1)*1000))/(1005*(Tavg_cold-Tl_cool))))*1.039+((-0.000729*$C20+0.001448)*(Tl_cool-Tavg_cold)+(0.016908*$C20-0.033574))*1.039))))*Watts","v":{"v":224.28014109231404,"d":"224"}},{"$f":"ROUND(((H20/Watts)/((Tr_cool-Tv_cool)*1.163))*$I$14,IF($X$4=1,0,IF($X$4=2,2)))","v":96},{"$f":"($AA$18*(I20/$I$14)^$AA$20)*$J$14","v":{"v":0.12963111643218425,"d":"0.13"}},{"$f":"L20-8","v":{"v":35,"d":"35.0"}},{"v":43,"d":"43.0"},5.9,{"$f":"AD20*Cubics","v":117},{"$f":"((($D20/Watts)/(((p_atm*0.028964)/(8.31447*(20+273.15)))*(($N20/3600)/Cubics)*(1005+1870*((0.622)/(((p_atm)/($E$12*Pvs_Heat_in))-1)))))+Tl_heat)*Celc1+Celc2","v":{"v":53.3970264791252,"d":"53"}},{"$f":"(Tl_cool-(($G20/Watts)/(1006*$N20*kgss)))*Celc1+Celc2","v":{"v":21.302517603494437,"d":"21"}},1,{"v":0.8539,"d":"0.854"},{"v":0.87,"d":"0.870"},{"v":0.95,"d":"0.950"},{"v":0.8539,"d":"0.854"},0.895,{"$f":"(H20-G20)/H20","v":{"v":0,"d":"0.0%"}},1331.183342453952,1.9213049050521955,224.28014109231404,1.9213049050521955,{"v":43,"d":"43.0"},5.9,117,891,1.8235155847906248,144,{"$f":"AF20","v":1.8235155847906248},{"v":36,"d":"36.0"},2.1,68,{"$f":"AE20","v":891},{"$f":"AH20","v":1.8235155847906248},144,{"$f":"AM20","v":1.8235155847906248},{"v":36,"d":"36.0"},2.1,68,null,{"$f":"(AG20*((((Tv_cool-Tr_cool)/LN((Tv_cool-Tl_cool)/(Tr_cool-Tl_cool)))/((16-18)/LN((16-27)/(18-27))))^S20))*$G$14","v":0.04815999999999994},{"$f":"((AT20/$G$14)/(IF((237.3*LN((RH*EXP(17.27*(Tl_cool/(Tl_cool+237.3))))))/(17.27-LN((RH*EXP(17.27*(Tl_cool/(Tl_cool+237.3))))))<((Tv_cool+Tr_cool)/2),1,1/(1+((2258*((0.622/((p_atm/(1*611*EXP(17.27*(((Tv_cool+Tr_cool)/2)/(((Tv_cool+Tr_cool)/2)+237.3))))))-1)*1000-(0.622/((p_atm/(RH*611*EXP(17.27*(Tl_cool/(Tl_cool+237.3))))))-1)*1000))/(1005*(((Tv_cool+Tr_cool)/2)-Tl_cool))))+-((-0.000625*$C20+0.00625)*(Tl_cool-(Tv_cool+Tr_cool)/2)-(-0.000625*$C20+0.00625)*10))))*$H$14","v":144},null,962,1.8,170,2,{"v":43,"d":"43.0"},{"v":5,"d":"5.0"},117,927.3061299999999,1.91852,218.69515952660262,1.9520723695113043,{"v":43,"d":"43.0"},5.9,117,1331.183342453952,1.9213049050521955,224.28014109231404,{"$f":"BL20","v":1.9213049050521955},{"$f":"BH20","v":{"v":43,"d":"43.0"}},5.9,117,null,2067.865306481912,2,569.3298863084995,2,{"v":42.99363224187082,"d":"43.0"},9.3,309,3101.7979597228677,2,626.2628749393494,2,{"v":42.99363224187082,"d":"43.0"},9.3,309,null,1861.0787758337208,2,512.3968976776496,2,{"v":42.99363224187082,"d":"43.0"},9.3,309,2791.618163750581,2,563.6365874454145,2,{"v":42.99363224187082,"d":"43.0"},9.3,309]
[null,{"v":1,"d":"100%"},10,{"$f":"(X21*($T$11^$Q21))*Watts*CF_Altit","v":{"v":1591.6107259404453,"d":"1592"}},{"$f":"ROUND(((D21/Watts)/(($S$9-$S$10)*1.163))*$E$14,IF($X$4=1,0,IF($X$4=2,2)))","v":137},{"$f":"($Y$18*(E21/$E$14)^$Y$20)*$F$14","v":{"v":0.25671634719537284,"d":"0.26"}},{"$f":"(Z21*($W$11^R21))*Watts*CF_Altit","v":{"v":271.4436835953948,"d":"271"}},{"$f":"((G21/Watts)/(IF((237.3*LN((RH*EXP(17.27*(Tl_cool/(Tl_cool+237.3))))))/(17.27-LN((RH*EXP(17.27*(Tl_cool/(Tl_cool+237.3))))))<Tavg_cold,1,IF(1/(1+((2258*((0.622/(($Z$11/(1*611*EXP(17.27*(Tavg_cold/(Tavg_cold+237.3))))))-1)*1000-(0.622/(($Z$11/(RH*611*EXP(17.27*(Tl_cool/(Tl_cool+237.3))))))-1)*1000))/(1005*(Tavg_cold-Tl_cool))))*1.039+((-0.000729*$C21+0.001448)*(Tl_cool-Tavg_cold)+(0.016908*$C21-0.033574))*1.039>1,1,1/(1+((2258*((0.622/(($Z$11/(1*611*EXP(17.27*(Tavg_cold/(Tavg_cold+237.3))))))-1)*1000-(0.622/(($Z$11/(RH*611*EXP(17.27*(Tl_cool/(Tl_cool+237.3))))))-1)*1000))/(1005*(Tavg_cold-Tl_cool))))*1.039+((-0.000729*$C21+0.001448)*(Tl_cool-Tavg_cold)+(0.016908*$C21-0.033574))*1.039))))*Watts","v":{"v":271.4436835953948,"d":"271"}},{"$f":"ROUND(((H21/Watts)/((Tr_cool-Tv_cool)*1.163))*$I$14,IF($X$4=1,0,IF($X$4=2,2)))","v":117},{"$f":"($AA$18*(I21/$I$14)^$AA$20)*$J$14","v":{"v":0.18957342604976077,"d":"0.19"}},{"$f":"L21-8","v":{"v":38,"d":"38.0"}},{"v":46,"d":"46.0"},8.8,{"$f":"AD21*Cubics","v":137},{"$f":"((($D21/Watts)/(((p_atm*0.028964)/(8.31447*(20+273.15)))*(($N21/3600)/Cubics)*(1005+1870*((0.622)/(((p_atm)/($E$12*Pvs_Heat_in))-1)))))+Tl_heat)*Celc1+Celc2","v":{"v":54.10138973779445,"d":"54"}},{"$f":"(Tl_cool-(($G21/Watts)/(1006*$N21*kgss)))*Celc1+Celc2","v":{"v":21.111058960015022,"d":"21"}},1,{"v":0.7711,"d":"0.771"},{"v":0.91,"d":"0.910"},{"v":0.98,"d":"0.980"},{"v":0.7711,"d":"0.771"},{"v":0.9111,"d":"0.911"},{"$f":"(H21-G21)/H21","v":{"v":0,"d":"0.0%"}},1591.6107259404453,0,271.4436835953948,0,{"v":46,"d":"46.0"},8.8,137,1075,null,185,null,{"v":42,"d":"42.0"},{"v":3,"d":"3.0"},79,{"$f":"AE21","v":1075},null,185,null,{"v":42,"d":"42.0"},{"v":3,"d":"3.0"},79,null,{"$f":"(AG21*((((Tv_cool-Tr_cool)/LN((Tv_cool-Tl_cool)/(Tr_cool-Tl_cool)))/((16-18)/LN((16-27)/(18-27))))^S21))*$G$14","v":0.06187222222222214},{"$f":"((AT21/$G$14)/(IF((237.3*LN((RH*EXP(17.27*(Tl_cool/(Tl_cool+237.3))))))/(17.27-LN((RH*EXP(17.27*(Tl_cool/(Tl_cool+237.3))))))<((Tv_cool+Tr_cool)/2),1,1/(1+((2258*((0.622/((p_atm/(1*611*EXP(17.27*(((Tv_cool+Tr_cool)/2)/(((Tv_cool+Tr_cool)/2)+237.3))))))-1)*1000-(0.622/((p_atm/(RH*611*EXP(17.27*(Tl_cool/(Tl_cool+237.3))))))-1)*1000))/(1005*(((Tv_cool+Tr_cool)/2)-Tl_cool))))+-((-0.000625*$C21+0.00625)*(Tl_cool-(Tv_cool+Tr_cool)/2)-(-0.000625*$C21+0.00625)*10))))*$H$14","v":185},null,1126,null,214,null,{"v":46,"d":"46.0"},7.7,147,1052.6671499999998,null,267.2967587746095,null,{"v":46,"d":"46.0"},8.8,137,1591.6107259404453,null,271.4436835953948,null,{"$f":"BH21","v":{"v":46,"d":"46.0"}},8.8,137,null,2395.0400407465454,null,706.324716887829,null,{"v":47.99930704368858,"d":"48.0"},{"v":15,"d":"15.0"},351,3592.5600611198183,null,776.9571885766121,null,{"v":47.99930704368858,"d":"48.0"},{"v":15,"d":"15.0"},351,null,2155.536036671891,null,635.6922451990462,null,{"v":47.99930704368858,"d":"48.0"},{"v":15,"d":"15.0"},351,3233.3040550078367,null,699.2614697189509,null,{"v":47.99930704368858,"d":"48.0"},{"v":15,"d":"15.0"},351]
[null,{"$f":"IF($S$7=1,NL!A21,IF(cal!$S$7=2,EN!A21,IF(cal!$S$7=3,DE!A21,IF(cal!$S$7=4,FR!A21,IF(cal!$S$7=5,NR!A21,IF(cal!$S$7=6,SP!A21,IF(cal!$S$7=7,SW!A21,IF(cal!$S$7=8,TS!A21,IF(cal!$S$7=9,ExtraTaal1!A21,IF(cal!$S$7=10,ExtraTaal2!A21,IF(cal!$S$7=11,ExtraTaal3!A21,)))))))))))","v":"Clima Canal height 13 cm width 32 cm length 100 cm (Type 2)"},{"$f":"IF($S$7=1,NL!B21,IF(cal!$S$7=2,EN!B21,IF(cal!$S$7=3,DE!B21,IF(cal!$S$7=4,FR!B21,IF(cal!$S$7=5,NR!B21,IF(cal!$S$7=6,SP!B21,IF(cal!$S$7=7,SW!B21,IF(cal!$S$7=8,TS!B21,IF(cal!$S$7=9,ExtraTaal1!B21,IF(cal!$S$7=10,ExtraTaal2!B21,IF(cal!$S$7=11,ExtraTaal3!B21,)))))))))))","v":0},{"$f":"IF($S$7=1,NL!C21,IF(cal!$S$7=2,EN!C21,IF(cal!$S$7=3,DE!C21,IF(cal!$S$7=4,FR!C21,IF(cal!$S$7=5,NR!C21,IF(cal!$S$7=6,SP!C21,IF(cal!$S$7=7,SW!C21,IF(cal!$S$7=8,TS!C21,IF(cal!$S$7=9,ExtraTaal1!C21,IF(cal!$S$7=10,ExtraTaal2!C21,IF(cal!$S$7=11,ExtraTaal3!C21,)))))))))))","v":0},{"$f":"IF($S$7=1,NL!D21,IF(cal!$S$7=2,EN!D21,IF(cal!$S$7=3,DE!D21,IF(cal!$S$7=4,FR!D21,IF(cal!$S$7=5,NR!D21,IF(cal!$S$7=6,SP!D21,IF(cal!$S$7=7,SW!D21,IF(cal!$S$7=8,TS!D21,IF(cal!$S$7=9,ExtraTaal1!D21,IF(cal!$S$7=10,ExtraTaal2!D21,IF(cal!$S$7=11,ExtraTaal3!D21,)))))))))))","v":0},{"$f":"IF($S$7=1,NL!E21,IF(cal!$S$7=2,EN!E21,IF(cal!$S$7=3,DE!E21,IF(cal!$S$7=4,FR!E21,IF(cal!$S$7=5,NR!E21,IF(cal!$S$7=6,SP!E21,IF(cal!$S$7=7,SW!E21,IF(cal!$S$7=8,TS!E21,IF(cal!$S$7=9,ExtraTaal1!E21,IF(cal!$S$7=10,ExtraTaal2!E21,IF(cal!$S$7=11,ExtraTaal3!E21,)))))))))))","v":0},{"$f":"IF($S$7=1,NL!F21,IF(cal!$S$7=2,EN!F21,IF(cal!$S$7=3,DE!F21,IF(cal!$S$7=4,FR!F21,IF(cal!$S$7=5,NR!F21,IF(cal!$S$7=6,SP!F21,IF(cal!$S$7=7,SW!F21,IF(cal!$S$7=8,TS!F21,IF(cal!$S$7=9,ExtraTaal1!F21,IF(cal!$S$7=10,ExtraTaal2!F21,IF(cal!$S$7=11,ExtraTaal3!F21,)))))))))))","v":0},{"$f":"IF($S$7=1,NL!G21,IF(cal!$S$7=2,EN!G21,IF(cal!$S$7=3,DE!G21,IF(cal!$S$7=4,FR!G21,IF(cal!$S$7=5,NR!G21,IF(cal!$S$7=6,SP!G21,IF(cal!$S$7=7,SW!G21,IF(cal!$S$7=8,TS!G21,IF(cal!$S$7=9,ExtraTaal1!G21,IF(cal!$S$7=10,ExtraTaal2!G21,IF(cal!$S$7=11,ExtraTaal3!G21,)))))))))))","v":0},{"$f":"IF($S$7=1,NL!H21,IF(cal!$S$7=2,EN!H21,IF(cal!$S$7=3,DE!H21,IF(cal!$S$7=4,FR!H21,IF(cal!$S$7=5,NR!H21,IF(cal!$S$7=6,SP!H21,IF(cal!$S$7=7,SW!H21,IF(cal!$S$7=8,TS!H21,IF(cal!$S$7=9,ExtraTaal1!H21,IF(cal!$S$7=10,ExtraTaal2!H21,IF(cal!$S$7=11,ExtraTaal3!H21,)))))))))))","v":0},{"$f":"IF($S$7=1,NL!I21,IF(cal!$S$7=2,EN!I21,IF(cal!$S$7=3,DE!I21,IF(cal!$S$7=4,FR!I21,IF(cal!$S$7=5,NR!I21,IF(cal!$S$7=6,SP!I21,IF(cal!$S$7=7,SW!I21,IF(cal!$S$7=8,TS!I21,IF(cal!$S$7=9,ExtraTaal1!I21,IF(cal!$S$7=10,ExtraTaal2!I21,IF(cal!$S$7=11,ExtraTaal3!I21,)))))))))))","v":0},{"$f":"IF($S$7=1,NL!J21,IF(cal!$S$7=2,EN!J21,IF(cal!$S$7=3,DE!J21,IF(cal!$S$7=4,FR!J21,IF(cal!$S$7=5,NR!J21,IF(cal!$S$7=6,SP!J21,IF(cal!$S$7=7,SW!J21,IF(cal!$S$7=8,TS!J21,IF(cal!$S$7=9,ExtraTaal1!J21,IF(cal!$S$7=10,ExtraTaal2!J21,IF(cal!$S$7=11,ExtraTaal3!J21,)))))))))))","v":0},{"$f":"IF($S$7=1,NL!K21,IF(cal!$S$7=2,EN!K21,IF(cal!$S$7=3,DE!K21,IF(cal!$S$7=4,FR!K21,IF(cal!$S$7=5,NR!K21,IF(cal!$S$7=6,SP!K21,IF(cal!$S$7=7,SW!K21,IF(cal!$S$7=8,TS!K21,IF(cal!$S$7=9,ExtraTaal1!K21,IF(cal!$S$7=10,ExtraTaal2!K21,IF(cal!$S$7=11,ExtraTaal3!K21,)))))))))))","v":0},{"$f":"IF($S$7=1,NL!L21,IF(cal!$S$7=2,EN!L21,IF(cal!$S$7=3,DE!L21,IF(cal!$S$7=4,FR!L21,IF(cal!$S$7=5,NR!L21,IF(cal!$S$7=6,SP!L21,IF(cal!$S$7=7,SW!L21,IF(cal!$S$7=8,TS!L21,IF(cal!$S$7=9,ExtraTaal1!L21,IF(cal!$S$7=10,ExtraTaal2!L21,IF(cal!$S$7=11,ExtraTaal3!L21,)))))))))))","v":0},{"$f":"IF($S$7=1,NL!M21,IF(cal!$S$7=2,EN!M21,IF(cal!$S$7=3,DE!M21,IF(cal!$S$7=4,FR!M21,IF(cal!$S$7=5,NR!M21,IF(cal!$S$7=6,SP!M21,IF(cal!$S$7=7,SW!M21,IF(cal!$S$7=8,TS!M21,IF(cal!$S$7=9,ExtraTaal1!M21,IF(cal!$S$7=10,ExtraTaal2!M21,IF(cal!$S$7=11,ExtraTaal3!M21,)))))))))))","v":0},{"$f":"IF($S$7=1,NL!N21,IF(cal!$S$7=2,EN!N21,IF(cal!$S$7=3,DE!N21,IF(cal!$S$7=4,FR!N21,IF(cal!$S$7=5,NR!N21,IF(cal!$S$7=6,SP!N21,IF(cal!$S$7=7,SW!N21,IF(cal!$S$7=8,TS!N21,IF(cal!$S$7=9,ExtraTaal1!N21,IF(cal!$S$7=10,ExtraTaal2!N21,IF(cal!$S$7=11,ExtraTaal3!N21,)))))))))))","v":0},{"$f":"IF($S$7=1,NL!O21,IF(cal!$S$7=2,EN!O21,IF(cal!$S$7=3,DE!O21,IF(cal!$S$7=4,FR!O21,IF(cal!$S$7=5,NR!O21,IF(cal!$S$7=6,SP!O21,IF(cal!$S$7=7,SW!O21,IF(cal!$S$7=8,TS!O21,IF(cal!$S$7=9,ExtraTaal1!O21,IF(cal!$S$7=10,ExtraTaal2!O21,IF(cal!$S$7=11,ExtraTaal3!O21,)))))))))))","v":0},"n-value","n-value","n-value","n-value","n-value","n-value",null,"H",13,"B",32,"L",70,0,"H",{"$f":"ROUND(8*IF($X$4=1,1,IF($X$4=2,1/2.54)),1)","v":8},"B",{"$f":"ROUND(18*IF($X$4=1,1,IF($X$4=2,1/2.54)),1)","v":18},"L",{"$f":"72*IF($X$4=1,1,IF($X$4=2,1/2.54))","v":72},null,"H",{"$f":"ROUND(10*IF($X$4=1,1,IF($X$4=2,1/2.54)),1)","v":10},"B",{"$f":"AH22","v":18},"L",{"$f":"AJ22","v":72},{"$nulls":5},"H",{"$f":"ROUND(IF($X$4=1,13,13/2.54),1)","v":13},"B",{"$f":"ROUND(IF($X$4=1,27,27/2.54),1)","v":27},"L",{"$f":"IF($X$4=1,79.8,79.8/2.54)","v":79.8},null,"H",{"$f":"ROUND(IF($X$4=1,13,13/2.54),1)","v":13},"B",{"$f":"ROUND(IF($X$4=1,32,32/2.54),1)","v":32},"L",{"$f":"IF($X$4=1,70,70/2.54)","v":70},null,"H",{"$f":"ROUND(IF($X$4=1,13,13/2.54),1)","v":13},"B",{"$f":"ROUND(IF($X$4=1,32,32/2.54),1)","v":32},"L",{"$f":"IF($X$4=1,70,70/2.54)","v":70},null,null,"H",{"$f":"ROUND(19*IF($X$4=1,1,IF($X$4=2,1/2.54)),1)","v":19},"B",{"$f":"ROUND(34*IF($X$4=1,1,IF($X$4=2,1/2.54)),1)","v":34},"L",{"$f":"105*IF($X$4=1,1,IF($X$4=2,1/2.54))","v":105},null,"H",{"$f":"BT22","v":19},"B",{"$f":"BV22","v":34},"L",{"$f":"BX22","v":105},null,null,"H",15,"B",32,"L",{"$f":"105*IF($X$4=1,1,IF($X$4=2,1/2.54))","v":105},null,"H",{"$f":"CI22","v":15},"B",{"$f":"CK22","v":32},"L",{"$f":"CM22","v":105}]
[null,{"v":0.2,"d":"20%"},2,{"$f":"(X23*($T$11^$Q23))*Watts*CF_Altit","v":{"v":592.8831302439467,"d":"593"}},{"$f":"ROUND(((D23/Watts)/(($S$9-$S$10)*1.163))*$E$14,IF($X$4=1,0,IF($X$4=2,2)))","v":51},{"$f":"($Y$24*(E23/$E$14)^$Y$26)*$F$14","v":{"v":0.04974904941793316,"d":"0.05"}},{"$f":"(Z23*($W$11^R23))*Watts*CF_Altit","v":{"v":127.58073482846659,"d":"128"}},{"$f":"((G23/Watts)/(IF((237.3*LN((RH*EXP(17.27*(Tl_cool/(Tl_cool+237.3))))))/(17.27-LN((RH*EXP(17.27*(Tl_cool/(Tl_cool+237.3))))))<Tavg_cold,1,IF(1/(1+((2258*((0.622/(($Z$11/(1*611*EXP(17.27*(Tavg_cold/(Tavg_cold+237.3))))))-1)*1000-(0.622/(($Z$11/(RH*611*EXP(17.27*(Tl_cool/(Tl_cool+237.3))))))-1)*1000))/(1005*(Tavg_cold-Tl_cool))))*1.039+((-0.000729*$C23+0.001448)*(Tl_cool-Tavg_cold)+(0.016908*$C23-0.033574))*1.039>1,1,1/(1+((2258*((0.622/(($Z$11/(1*611*EXP(17.27*(Tavg_cold/(Tavg_cold+237.3))))))-1)*1000-(0.622/(($Z$11/(RH*611*EXP(17.27*(Tl_cool/(Tl_cool+237.3))))))-1)*1000))/(1005*(Tavg_cold-Tl_cool))))*1.039+((-0.000729*$C23+0.001448)*(Tl_cool-Tavg_cold)+(0.016908*$C23-0.033574))*1.039))))*Watts","v":{"v":127.58073482846659,"d":"128"}},{"$f":"ROUND(((H23/Watts)/((Tr_cool-Tv_cool)*1.163))*$I$14,IF($X$4=1,0,IF($X$4=2,2)))","v":55},{"$f":"($AA$24*(I23/$I$14)^$AA$26)*$J$14","v":{"v":0.05738165864004263,"d":"0.06"}},{"$f":"L23-8","v":{"v":20,"d":"20.0"}},{"$f":"AB23","v":{"v":28,"d":"28.0"}},{"v":1.008,"d":"1.0"},{"$f":"AD23*Cubics","v":44},{"$f":"((($D23/Watts)/(((p_atm*0.028964)/(8.31447*(20+273.15)))*(($N23/3600)/Cubics)*(1005+1870*((0.622)/(((p_atm)/($E$12*Pvs_Heat_in))-1)))))+Tl_heat)*Celc1+Celc2","v":{"v":59.55234204874772,"d":"60"}},{"$f":"(Tl_cool-(($G23/Watts)/(1006*$N23*kgss)))*Celc1+Celc2","v":{"v":18.381921297222696,"d":"18"}},1,{"v":0.7807,"d":"0.781"},{"v":0.6,"d":"0.600"},{"v":1.16,"d":"1.160"},{"v":0.7807,"d":"0.781"},{"v":0.8766,"d":"0.877"},{"$f":"(H23-G23)/H23","v":{"v":0,"d":"0.0%"}},592.8831302439467,"a",{"$f":"IF($X$16=1,AG23,IF($X$16=2,AN23,IF($X$16=3,BM23,IF($X$16=4,BF23,IF($X$16=5,CB23,IF($X$16=6,BU23,IF($X$16=7,AY23,IF($X$16=9,CJ23,IF($X$16=8,CQ23,)))))))))","v":127.58073482846659},"a",{"v":28,"d":"28.0"},{"v":1.008,"d":"1.0"},44,569,"a",62,"a",{"v":23,"d":"23.0"},0.6,42,{"$f":"AE23","v":569},"a",62,"a",{"$f":"AI23","v":{"v":23,"d":"23.0"}},0.6,42,null,{"$f":"(AG23*((((Tv_cool-Tr_cool)/LN((Tv_cool-Tl_cool)/(Tr_cool-Tl_cool)))/((16-18)/LN((16-27)/(18-27))))^S23))*$G$14","v":0.020735555555555528},{"$f":"((AT23/$G$14)/(IF((237.3*LN((RH*EXP(17.27*(Tl_cool/(Tl_cool+237.3))))))/(17.27-LN((RH*EXP(17.27*(Tl_cool/(Tl_cool+237.3))))))<((Tv_cool+Tr_cool)/2),1,1/(1+((2258*((0.622/((p_atm/(1*611*EXP(17.27*(((Tv_cool+Tr_cool)/2)/(((Tv_cool+Tr_cool)/2)+237.3))))))-1)*1000-(0.622/((p_atm/(RH*611*EXP(17.27*(Tl_cool/(Tl_cool+237.3))))))-1)*1000))/(1005*(((Tv_cool+Tr_cool)/2)-Tl_cool))))+-((-0.000625*$C23+0.00625)*(Tl_cool-(Tv_cool+Tr_cool)/2)-(-0.000625*$C23+0.00625)*10))))*$H$14","v":62},null,622,"a",71,"a",{"v":27,"d":"27.0"},{"v":1,"d":"1.0"},52,508.62102999999996,"a",122.49530580621254,"a",{"v":28,"d":"28.0"},{"v":1.008,"d":"1.0"},44,592.8831302439467,"a",127.58073482846659,"a",{"$f":"BH23","v":{"v":28,"d":"28.0"}},{"v":1.008,"d":"1.0"},44,null,1031.6962644250227,"a",185.3314554529561,"a",{"v":26.98962805075108,"d":"27.0"},3.2,82,1547.5443966375344,"a",203.86460099825175,"a",{"v":26.98962805075108,"d":"27.0"},3.2,82,null,{"$f":"BS23*0.9","v":928.5266379825205},"a",{"$f":"BU23*0.9","v":166.7983099076605},"a",{"v":26.98962805075108,"d":"27.0"},3.2,82,{"$f":"BZ23*0.9","v":1392.789956973781},"a",{"$f":"CB23*0.9","v":183.47814089842657},"a",{"v":26.98962805075108,"d":"27.0"},3.2,82]
[null,{"v":0.4,"d":"40%"},4,{"$f":"(X24*($T$11^$Q24))*Watts*CF_Altit","v":{"v":1311.26251130755,"d":"1311"}},{"$f":"ROUND(((D24/Watts)/(($S$9-$S$10)*1.163))*$E$14,IF($X$4=1,0,IF($X$4=2,2)))","v":113},{"$f":"($Y$24*(E24/$E$14)^$Y$26)*$F$14","v":{"v":0.2238234701257517,"d":"0.22"}},{"$f":"(Z24*($W$11^R24))*Watts*CF_Altit","v":{"v":231.65460637567074,"d":"232"}},{"$f":"((G24/Watts)/(IF((237.3*LN((RH*EXP(17.27*(Tl_cool/(Tl_cool+237.3))))))/(17.27-LN((RH*EXP(17.27*(Tl_cool/(Tl_cool+237.3))))))<Tavg_cold,1,IF(1/(1+((2258*((0.622/(($Z$11/(1*611*EXP(17.27*(Tavg_cold/(Tavg_cold+237.3))))))-1)*1000-(0.622/(($Z$11/(RH*611*EXP(17.27*(Tl_cool/(Tl_cool+237.3))))))-1)*1000))/(1005*(Tavg_cold-Tl_cool))))*1.039+((-0.000729*$C24+0.001448)*(Tl_cool-Tavg_cold)+(0.016908*$C24-0.033574))*1.039>1,1,1/(1+((2258*((0.622/(($Z$11/(1*611*EXP(17.27*(Tavg_cold/(Tavg_cold+237.3))))))-1)*1000-(0.622/(($Z$11/(RH*611*EXP(17.27*(Tl_cool/(Tl_cool+237.3))))))-1)*1000))/(1005*(Tavg_cold-Tl_cool))))*1.039+((-0.000729*$C24+0.001448)*(Tl_cool-Tavg_cold)+(0.016908*$C24-0.033574))*1.039))))*Watts","v":{"v":231.65460637567074,"d":"232"}},{"$f":"ROUND(((H24/Watts)/((Tr_cool-Tv_cool)*1.163))*$I$14,IF($X$4=1,0,IF($X$4=2,2)))","v":100},{"$f":"($AA$24*(I24/$I$14)^$AA$26)*$J$14","v":{"v":0.1776521366573867,"d":"0.18"}},{"$f":"L24-8","v":{"v":25,"d":"25.0"}},{"v":33,"d":"33.0"},1.8,{"$f":"AD24*Cubics","v":85},{"$f":"((($D24/Watts)/(((p_atm*0.028964)/(8.31447*(20+273.15)))*(($N24/3600)/Cubics)*(1005+1870*((0.622)/(((p_atm)/($E$12*Pvs_Heat_in))-1)))))+Tl_heat)*Celc1+Celc2","v":{"v":65.28209457580908,"d":"65"}},{"$f":"(Tl_cool-(($G24/Watts)/(1006*$N24*kgss)))*Celc1+Celc2","v":{"v":18.89971969091824,"d":"19"}},1,{"v":0.8587,"d":"0.859"},{"v":0.68,"d":"0.680"},{"v":1.04,"d":"1.040"},{"v":0.8587,"d":"0.859"},{"v":0.8775,"d":"0.878"},{"$f":"(H24-G24)/H24","v":{"v":0,"d":"0.0%"}},1311.26251130755,2.9439637778696419E-5,231.65460637567074,2.9439637778696419E-5,{"v":33,"d":"33.0"},1.8,85,1021,4.0202009009986008E-4,135,{"$f":"AF24","v":4.0202009009986008E-4},{"v":27,"d":"27.0"},1.3,75,{"$f":"AE24","v":1021},{"$f":"AH24","v":4.0202009009986008E-4},135,{"$f":"AM24","v":4.0202009009986008E-4},{"v":27,"d":"27.0"},1.3,75,null,{"$f":"(AG24*((((Tv_cool-Tr_cool)/LN((Tv_cool-Tl_cool)/(Tr_cool-Tl_cool)))/((16-18)/LN((16-27)/(18-27))))^S24))*$G$14","v":0.04514999999999994},{"$f":"((AT24/$G$14)/(IF((237.3*LN((RH*EXP(17.27*(Tl_cool/(Tl_cool+237.3))))))/(17.27-LN((RH*EXP(17.27*(Tl_cool/(Tl_cool+237.3))))))<((Tv_cool+Tr_cool)/2),1,1/(1+((2258*((0.622/((p_atm/(1*611*EXP(17.27*(((Tv_cool+Tr_cool)/2)/(((Tv_cool+Tr_cool)/2)+237.3))))))-1)*1000-(0.622/((p_atm/(RH*611*EXP(17.27*(Tl_cool/(Tl_cool+237.3))))))-1)*1000))/(1005*(((Tv_cool+Tr_cool)/2)-Tl_cool))))+-((-0.000625*$C24+0.00625)*(Tl_cool-(Tv_cool+Tr_cool)/2)-(-0.000625*$C24+0.00625)*10))))*$H$14","v":135},null,1015,4.5e-05,144,{"v":6.08413e-06,"d":"6.08E-06"},31.9,1.8,78,1014.3629699999999,4.01952e-05,222.45572868953656,1.3302510869177982E-5,{"v":33,"d":"33.0"},1.8,85,1311.26251130755,2.9439637778696419E-5,231.65460637567074,{"$f":"BL24","v":2.9439637778696419E-5},{"v":33,"d":"33.0"},1.8,85,null,1628.1834934438923,2.3978861066814286E-5,362.09527218224656,7.1743257974481045E-5,{"v":30.019276797677907,"d":"30.0"},6.7,179,2442.275240165839,2.8777145031522588E-5,398.30479940047127,2.8777145031522588E-5,{"v":30.019276797677907,"d":"30.0"},6.7,179,null,{"$f":"BS24*0.9","v":1465.3651440995031},2.3978861066814286E-5,{"$f":"BU24*0.9","v":325.8857449640219},7.1743257974481045E-5,{"v":30.019276797677907,"d":"30.0"},6.7,179,{"$f":"BZ24*0.9","v":2198.0477161492554},2.8777145031522588E-5,{"$f":"CB24*0.9","v":358.47431946042417},2.8777145031522588E-5,{"v":30.019276797677907,"d":"30.0"},6.7,179]
[null,{"v":0.6,"d":"60%"},6,{"$f":"(X25*($T$11^$Q25))*Watts*CF_Altit","v":{"v":1954.7307439707715,"d":"1955"}},{"$f":"ROUND(((D25/Watts)/(($S$9-$S$10)*1.163))*$E$14,IF($X$4=1,0,IF($X$4=2,2)))","v":168},{"$f":"($Y$24*(E25/$E$14)^$Y$26)*$F$14","v":{"v":0.47367105666773596,"d":"0.47"}},{"$f":"(Z25*($W$11^R25))*Watts*CF_Altit","v":{"v":330.8370376454052,"d":"331"}},{"$f":"((G25/Watts)/(IF((237.3*LN((RH*EXP(17.27*(Tl_cool/(Tl_cool+237.3))))))/(17.27-LN((RH*EXP(17.27*(Tl_cool/(Tl_cool+237.3))))))<Tavg_cold,1,IF(1/(1+((2258*((0.622/(($Z$11/(1*611*EXP(17.27*(Tavg_cold/(Tavg_cold+237.3))))))-1)*1000-(0.622/(($Z$11/(RH*611*EXP(17.27*(Tl_cool/(Tl_cool+237.3))))))-1)*1000))/(1005*(Tavg_cold-Tl_cool))))*1.039+((-0.000729*$C25+0.001448)*(Tl_cool-Tavg_cold)+(0.016908*$C25-0.033574))*1.039>1,1,1/(1+((2258*((0.622/(($Z$11/(1*611*EXP(17.27*(Tavg_cold/(Tavg_cold+237.3))))))-1)*1000-(0.622/(($Z$11/(RH*611*EXP(17.27*(Tl_cool/(Tl_cool+237.3))))))-1)*1000))/(1005*(Tavg_cold-Tl_cool))))*1.039+((-0.000729*$C25+0.001448)*(Tl_cool-Tavg_cold)+(0.016908*$C25-0.033574))*1.039))))*Watts","v":{"v":330.8370376454052,"d":"331"}},{"$f":"ROUND(((H25/Watts)/((Tr_cool-Tv_cool)*1.163))*$I$14,IF($X$4=1,0,IF($X$4=2,2)))","v":142},{"$f":"($AA$24*(I25/$I$14)^$AA$26)*$J$14","v":{"v":0.3447021434795522,"d":"0.34"}},{"$f":"L25-8","v":{"v":29,"d":"29.0"}},{"v":37,"d":"37.0"},3.2,{"$f":"AD25*Cubics","v":133},{"$f":"((($D25/Watts)/(((p_atm*0.028964)/(8.31447*(20+273.15)))*(($N25/3600)/Cubics)*(1005+1870*((0.622)/(((p_atm)/($E$12*Pvs_Heat_in))-1)))))+Tl_heat)*Celc1+Celc2","v":{"v":63.14108771635473,"d":"63"}},{"$f":"(Tl_cool-(($G25/Watts)/(1006*$N25*kgss)))*Celc1+Celc2","v":{"v":19.606662776547694,"d":"20"}},1,{"v":0.8831,"d":"0.883"},{"v":0.79,"d":"0.790"},{"v":0.95,"d":"0.950"},{"v":0.8831,"d":"0.883"},0.882,{"$f":"(H25-G25)/H25","v":{"v":0,"d":"0.0%"}},1954.7307439707715,"b",330.8370376454052,"b",{"v":37,"d":"37.0"},3.2,133,1438,"b",214,"b",{"v":37,"d":"37.0"},2.7,98,{"$f":"AE25","v":1438},"b",214,"b",{"v":37,"d":"37.0"},2.7,98,null,{"$f":"(AG25*((((Tv_cool-Tr_cool)/LN((Tv_cool-Tl_cool)/(Tr_cool-Tl_cool)))/((16-18)/LN((16-27)/(18-27))))^S25))*$G$14","v":0.07157111111111102},{"$f":"((AT25/$G$14)/(IF((237.3*LN((RH*EXP(17.27*(Tl_cool/(Tl_cool+237.3))))))/(17.27-LN((RH*EXP(17.27*(Tl_cool/(Tl_cool+237.3))))))<((Tv_cool+Tr_cool)/2),1,1/(1+((2258*((0.622/((p_atm/(1*611*EXP(17.27*(((Tv_cool+Tr_cool)/2)/(((Tv_cool+Tr_cool)/2)+237.3))))))-1)*1000-(0.622/((p_atm/(RH*611*EXP(17.27*(Tl_cool/(Tl_cool+237.3))))))-1)*1000))/(1005*(((Tv_cool+Tr_cool)/2)-Tl_cool))))+-((-0.000625*$C25+0.00625)*(Tl_cool-(Tv_cool+Tr_cool)/2)-(-0.000625*$C25+0.00625)*10))))*$H$14","v":214},null,1351,"b",218,"b",{"v":37,"d":"37.0"},3.6,123,1430.73247,"b",319.8044837684534,"b",{"v":37,"d":"37.0"},3.2,133,1954.7307439707715,"b",330.8370376454052,"b",{"v":37,"d":"37.0"},3.2,133,null,2126.2510366498072,"b",535.7634367552606,"b",{"v":35.99082010896673,"d":"36.0"},12.1,260,3189.3765549747113,"b",589.3397804307868,"b",{"v":35.99082010896673,"d":"36.0"},12.1,260,null,1913.6259329848265,"b",482.18709307973455,"b",{"v":35.99082010896673,"d":"36.0"},12.1,260,2870.4388994772403,"b",530.4058023877081,"b",{"v":35.99082010896673,"d":"36.0"},12.1,260]
[null,{"v":0.8,"d":"80%"},8,{"$f":"(X26*($T$11^$Q26))*Watts*CF_Altit","v":{"v":2523.2878282336105,"d":"2523"}},{"$f":"ROUND(((D26/Watts)/(($S$9-$S$10)*1.163))*$E$14,IF($X$4=1,0,IF($X$4=2,2)))","v":217},{"$f":"($Y$24*(E26/$E$14)^$Y$26)*$F$14","v":{"v":0.7683987652022146,"d":"0.77"}},{"$f":"(Z26*($W$11^R26))*Watts*CF_Altit","v":{"v":425.1280286376699,"d":"425"}},{"$f":"((G26/Watts)/(IF((237.3*LN((RH*EXP(17.27*(Tl_cool/(Tl_cool+237.3))))))/(17.27-LN((RH*EXP(17.27*(Tl_cool/(Tl_cool+237.3))))))<Tavg_cold,1,IF(1/(1+((2258*((0.622/(($Z$11/(1*611*EXP(17.27*(Tavg_cold/(Tavg_cold+237.3))))))-1)*1000-(0.622/(($Z$11/(RH*611*EXP(17.27*(Tl_cool/(Tl_cool+237.3))))))-1)*1000))/(1005*(Tavg_cold-Tl_cool))))*1.039+((-0.000729*$C26+0.001448)*(Tl_cool-Tavg_cold)+(0.016908*$C26-0.033574))*1.039>1,1,1/(1+((2258*((0.622/(($Z$11/(1*611*EXP(17.27*(Tavg_cold/(Tavg_cold+237.3))))))-1)*1000-(0.622/(($Z$11/(RH*611*EXP(17.27*(Tl_cool/(Tl_cool+237.3))))))-1)*1000))/(1005*(Tavg_cold-Tl_cool))))*1.039+((-0.000729*$C26+0.001448)*(Tl_cool-Tavg_cold)+(0.016908*$C26-0.033574))*1.039))))*Watts","v":{"v":425.1280286376699,"d":"425"}},{"$f":"ROUND(((H26/Watts)/((Tr_cool-Tv_cool)*1.163))*$I$14,IF($X$4=1,0,IF($X$4=2,2)))","v":183},{"$f":"($AA$24*(I26/$I$14)^$AA$26)*$J$14","v":{"v":0.5567839569891521,"d":"0.56"}},{"$f":"L26-8","v":{"v":36,"d":"36.0"}},{"v":44,"d":"44.0"},6.4,{"$f":"AD26*Cubics","v":168},{"$f":"((($D26/Watts)/(((p_atm*0.028964)/(8.31447*(20+273.15)))*(($N26/3600)/Cubics)*(1005+1870*((0.622)/(((p_atm)/($E$12*Pvs_Heat_in))-1)))))+Tl_heat)*Celc1+Celc2","v":{"v":64.08727935797097,"d":"64"}},{"$f":"(Tl_cool-(($G26/Watts)/(1006*$N26*kgss)))*Celc1+Celc2","v":{"v":19.47877656985819,"d":"19"}},1,{"v":0.8539,"d":"0.854"},{"v":0.87,"d":"0.870"},{"v":0.95,"d":"0.950"},{"v":0.8539,"d":"0.854"},0.895,{"$f":"(H26-G26)/H26","v":{"v":0,"d":"0.0%"}},2523.2878282336105,1.8903189865021812,425.1280286376699,1.8903189865021812,{"v":44,"d":"44.0"},6.4,168,1834,1.8235155847906248,296,{"$f":"AF26","v":1.8235155847906248},{"v":40,"d":"40.0"},4.6,125,{"$f":"AE26","v":1834},{"$f":"AH26","v":1.8235155847906248},296,{"$f":"AM26","v":1.8235155847906248},{"v":40,"d":"40.0"},4.6,125,null,{"$f":"(AG26*((((Tv_cool-Tr_cool)/LN((Tv_cool-Tl_cool)/(Tr_cool-Tl_cool)))/((16-18)/LN((16-27)/(18-27))))^S26))*$G$14","v":0.09899555555555543},{"$f":"((AT26/$G$14)/(IF((237.3*LN((RH*EXP(17.27*(Tl_cool/(Tl_cool+237.3))))))/(17.27-LN((RH*EXP(17.27*(Tl_cool/(Tl_cool+237.3))))))<((Tv_cool+Tr_cool)/2),1,1/(1+((2258*((0.622/((p_atm/(1*611*EXP(17.27*(((Tv_cool+Tr_cool)/2)/(((Tv_cool+Tr_cool)/2)+237.3))))))-1)*1000-(0.622/((p_atm/(RH*611*EXP(17.27*(Tl_cool/(Tl_cool+237.3))))))-1)*1000))/(1005*(((Tv_cool+Tr_cool)/2)-Tl_cool))))+-((-0.000625*$C26+0.00625)*(Tl_cool-(Tv_cool+Tr_cool)/2)-(-0.000625*$C26+0.00625)*10))))*$H$14","v":296},null,1654,1.8,293,2,{"v":44,"d":"44.0"},6.5,168,1757.7295299999996,1.89443,414.54157104296314,1.9435633812010937,{"v":44,"d":"44.0"},6.4,168,2523.2878282336105,1.8903189865021812,425.1280286376699,{"$f":"BL26","v":1.8903189865021812},{"v":44,"d":"44.0"},6.4,168,null,2569.5367713680557,2,707.4513380164785,2,{"v":44.01549794824809,"d":"44.0"},18.4,351,3854.305157052084,2,778.1964718181265,2,{"v":44.01549794824809,"d":"44.0"},18.4,351,null,2312.58309423125,2,636.7062042148307,2,{"v":44.01549794824809,"d":"44.0"},18.4,351,3468.8746413468757,2,700.3768246363138,2,{"v":44.01549794824809,"d":"44.0"},18.4,351]
[null,{"v":1,"d":"100%"},10,{"$f":"(X27*($T$11^$Q27))*Watts*CF_Altit","v":{"v":3016.9337640960675,"d":"3017"}},{"$f":"ROUND(((D27/Watts)/(($S$9-$S$10)*1.163))*$E$14,IF($X$4=1,0,IF($X$4=2,2)))","v":259},{"$f":"($Y$24*(E27/$E$14)^$Y$26)*$F$14","v":{"v":1.073590911618762,"d":"1.07"}},{"$f":"(Z27*($W$11^R27))*Watts*CF_Altit","v":{"v":514.5275793524648,"d":"515"}},{"$f":"((G27/Watts)/(IF((237.3*LN((RH*EXP(17.27*(Tl_cool/(Tl_cool+237.3))))))/(17.27-LN((RH*EXP(17.27*(Tl_cool/(Tl_cool+237.3))))))<Tavg_cold,1,IF(1/(1+((2258*((0.622/(($Z$11/(1*611*EXP(17.27*(Tavg_cold/(Tavg_cold+237.3))))))-1)*1000-(0.622/(($Z$11/(RH*611*EXP(17.27*(Tl_cool/(Tl_cool+237.3))))))-1)*1000))/(1005*(Tavg_cold-Tl_cool))))*1.039+((-0.000729*$C27+0.001448)*(Tl_cool-Tavg_cold)+(0.016908*$C27-0.033574))*1.039>1,1,1/(1+((2258*((0.622/(($Z$11/(1*611*EXP(17.27*(Tavg_cold/(Tavg_cold+237.3))))))-1)*1000-(0.622/(($Z$11/(RH*611*EXP(17.27*(Tl_cool/(Tl_cool+237.3))))))-1)*1000))/(1005*(Tavg_cold-Tl_cool))))*1.039+((-0.000729*$C27+0.001448)*(Tl_cool-Tavg_cold)+(0.016908*$C27-0.033574))*1.039))))*Watts","v":{"v":514.5275793524648,"d":"515"}},{"$f":"ROUND(((H27/Watts)/((Tr_cool-Tv_cool)*1.163))*$I$14,IF($X$4=1,0,IF($X$4=2,2)))","v":221},{"$f":"($AA$24*(I27/$I$14)^$AA$26)*$J$14","v":{"v":0.7953928614947363,"d":"0.80"}},{"$f":"L27-8","v":{"v":39,"d":"39.0"}},{"v":47,"d":"47.0"},10.3,{"$f":"AD27*Cubics","v":202},{"$f":"((($D27/Watts)/(((p_atm*0.028964)/(8.31447*(20+273.15)))*(($N27/3600)/Cubics)*(1005+1870*((0.622)/(((p_atm)/($E$12*Pvs_Heat_in))-1)))))+Tl_heat)*Celc1+Celc2","v":{"v":63.83996453730498,"d":"64"}},{"$f":"(Tl_cool-(($G27/Watts)/(1006*$N27*kgss)))*Celc1+Celc2","v":{"v":19.429312460861638,"d":"19"}},1,{"v":0.7711,"d":"0.771"},{"v":0.91,"d":"0.910"},0.98,{"v":0.7711,"d":"0.771"},{"v":0.9111,"d":"0.911"},{"$f":"(H27-G27)/H27","v":{"v":0,"d":"0.0%"}},3016.9337640960675,0,514.5275793524648,0,{"v":47,"d":"47.0"},10.3,202,2214,null,381,null,{"v":45,"d":"45.0"},7.1,160,{"$f":"AE27","v":2214},null,381,null,{"v":45,"d":"45.0"},7.1,160,null,{"$f":"(AG27*((((Tv_cool-Tr_cool)/LN((Tv_cool-Tl_cool)/(Tr_cool-Tl_cool)))/((16-18)/LN((16-27)/(18-27))))^S27))*$G$14","v":0.12742333333333317},{"$f":"((AT27/$G$14)/(IF((237.3*LN((RH*EXP(17.27*(Tl_cool/(Tl_cool+237.3))))))/(17.27-LN((RH*EXP(17.27*(Tl_cool/(Tl_cool+237.3))))))<((Tv_cool+Tr_cool)/2),1,1/(1+((2258*((0.622/((p_atm/(1*611*EXP(17.27*(((Tv_cool+Tr_cool)/2)/(((Tv_cool+Tr_cool)/2)+237.3))))))-1)*1000-(0.622/((p_atm/(RH*611*EXP(17.27*(Tl_cool/(Tl_cool+237.3))))))-1)*1000))/(1005*(((Tv_cool+Tr_cool)/2)-Tl_cool))))+-((-0.000625*$C27+0.00625)*(Tl_cool-(Tv_cool+Tr_cool)/2)-(-0.000625*$C27+0.00625)*10))))*$H$14","v":381},null,1936,null,368,null,47.1,9.8,202,1995.3541499999994,null,506.6669905130658,null,{"v":47,"d":"47.0"},10.3,202,3016.9337640960675,null,514.5275793524648,null,{"v":47,"d":"47.0"},10.3,202,null,2976.085257732393,null,877.681600866533,null,{"v":49.00333602110482,"d":"49.0"},{"v":24,"d":"24.0"},401,4464.1278865985905,null,965.4497609531866,null,{"v":49.00333602110482,"d":"49.0"},{"v":24,"d":"24.0"},401,null,2678.4767319591538,null,789.9134407798797,null,{"v":49.00333602110482,"d":"49.0"},{"v":24,"d":"24.0"},401,4017.7150979387316,null,868.904784857868,null,{"v":49.00333602110482,"d":"49.0"},{"v":24,"d":"24.0"},401]
[null,{"$f":"IF($S$7=1,NL!A27,IF(cal!$S$7=2,EN!A27,IF(cal!$S$7=3,DE!A27,IF(cal!$S$7=4,FR!A27,IF(cal!$S$7=5,NR!A27,IF(cal!$S$7=6,SP!A27,IF(cal!$S$7=7,SW!A27,IF(cal!$S$7=8,TS!A27,IF(cal!$S$7=9,ExtraTaal1!A27,IF(cal!$S$7=10,ExtraTaal2!A27,IF(cal!$S$7=11,ExtraTaal3!A27,)))))))))))","v":"Clima Canal height 13 cm width 32 cm length 120 cm (Type 3)"},{"$f":"IF($S$7=1,NL!B27,IF(cal!$S$7=2,EN!B27,IF(cal!$S$7=3,DE!B27,IF(cal!$S$7=4,FR!B27,IF(cal!$S$7=5,NR!B27,IF(cal!$S$7=6,SP!B27,IF(cal!$S$7=7,SW!B27,IF(cal!$S$7=8,TS!B27,IF(cal!$S$7=9,ExtraTaal1!B27,IF(cal!$S$7=10,ExtraTaal2!B27,IF(cal!$S$7=11,ExtraTaal3!B27,)))))))))))","v":0},{"$f":"IF($S$7=1,NL!C27,IF(cal!$S$7=2,EN!C27,IF(cal!$S$7=3,DE!C27,IF(cal!$S$7=4,FR!C27,IF(cal!$S$7=5,NR!C27,IF(cal!$S$7=6,SP!C27,IF(cal!$S$7=7,SW!C27,IF(cal!$S$7=8,TS!C27,IF(cal!$S$7=9,ExtraTaal1!C27,IF(cal!$S$7=10,ExtraTaal2!C27,IF(cal!$S$7=11,ExtraTaal3!C27,)))))))))))","v":0},{"$f":"IF($S$7=1,NL!D27,IF(cal!$S$7=2,EN!D27,IF(cal!$S$7=3,DE!D27,IF(cal!$S$7=4,FR!D27,IF(cal!$S$7=5,NR!D27,IF(cal!$S$7=6,SP!D27,IF(cal!$S$7=7,SW!D27,IF(cal!$S$7=8,TS!D27,IF(cal!$S$7=9,ExtraTaal1!D27,IF(cal!$S$7=10,ExtraTaal2!D27,IF(cal!$S$7=11,ExtraTaal3!D27,)))))))))))","v":0},{"$f":"IF($S$7=1,NL!E27,IF(cal!$S$7=2,EN!E27,IF(cal!$S$7=3,DE!E27,IF(cal!$S$7=4,FR!E27,IF(cal!$S$7=5,NR!E27,IF(cal!$S$7=6,SP!E27,IF(cal!$S$7=7,SW!E27,IF(cal!$S$7=8,TS!E27,IF(cal!$S$7=9,ExtraTaal1!E27,IF(cal!$S$7=10,ExtraTaal2!E27,IF(cal!$S$7=11,ExtraTaal3!E27,)))))))))))","v":0},{"$f":"IF($S$7=1,NL!F27,IF(cal!$S$7=2,EN!F27,IF(cal!$S$7=3,DE!F27,IF(cal!$S$7=4,FR!F27,IF(cal!$S$7=5,NR!F27,IF(cal!$S$7=6,SP!F27,IF(cal!$S$7=7,SW!F27,IF(cal!$S$7=8,TS!F27,IF(cal!$S$7=9,ExtraTaal1!F27,IF(cal!$S$7=10,ExtraTaal2!F27,IF(cal!$S$7=11,ExtraTaal3!F27,)))))))))))","v":0},{"$f":"IF($S$7=1,NL!G27,IF(cal!$S$7=2,EN!G27,IF(cal!$S$7=3,DE!G27,IF(cal!$S$7=4,FR!G27,IF(cal!$S$7=5,NR!G27,IF(cal!$S$7=6,SP!G27,IF(cal!$S$7=7,SW!G27,IF(cal!$S$7=8,TS!G27,IF(cal!$S$7=9,ExtraTaal1!G27,IF(cal!$S$7=10,ExtraTaal2!G27,IF(cal!$S$7=11,ExtraTaal3!G27,)))))))))))","v":0},{"$f":"IF($S$7=1,NL!H27,IF(cal!$S$7=2,EN!H27,IF(cal!$S$7=3,DE!H27,IF(cal!$S$7=4,FR!H27,IF(cal!$S$7=5,NR!H27,IF(cal!$S$7=6,SP!H27,IF(cal!$S$7=7,SW!H27,IF(cal!$S$7=8,TS!H27,IF(cal!$S$7=9,ExtraTaal1!H27,IF(cal!$S$7=10,ExtraTaal2!H27,IF(cal!$S$7=11,ExtraTaal3!H27,)))))))))))","v":0},{"$f":"IF($S$7=1,NL!I27,IF(cal!$S$7=2,EN!I27,IF(cal!$S$7=3,DE!I27,IF(cal!$S$7=4,FR!I27,IF(cal!$S$7=5,NR!I27,IF(cal!$S$7=6,SP!I27,IF(cal!$S$7=7,SW!I27,IF(cal!$S$7=8,TS!I27,IF(cal!$S$7=9,ExtraTaal1!I27,IF(cal!$S$7=10,ExtraTaal2!I27,IF(cal!$S$7=11,ExtraTaal3!I27,)))))))))))","v":0},{"$f":"IF($S$7=1,NL!J27,IF(cal!$S$7=2,EN!J27,IF(cal!$S$7=3,DE!J27,IF(cal!$S$7=4,FR!J27,IF(cal!$S$7=5,NR!J27,IF(cal!$S$7=6,SP!J27,IF(cal!$S$7=7,SW!J27,IF(cal!$S$7=8,TS!J27,IF(cal!$S$7=9,ExtraTaal1!J27,IF(cal!$S$7=10,ExtraTaal2!J27,IF(cal!$S$7=11,ExtraTaal3!J27,)))))))))))","v":0},{"$f":"IF($S$7=1,NL!K27,IF(cal!$S$7=2,EN!K27,IF(cal!$S$7=3,DE!K27,IF(cal!$S$7=4,FR!K27,IF(cal!$S$7=5,NR!K27,IF(cal!$S$7=6,SP!K27,IF(cal!$S$7=7,SW!K27,IF(cal!$S$7=8,TS!K27,IF(cal!$S$7=9,ExtraTaal1!K27,IF(cal!$S$7=10,ExtraTaal2!K27,IF(cal!$S$7=11,ExtraTaal3!K27,)))))))))))","v":0},{"$f":"IF($S$7=1,NL!L27,IF(cal!$S$7=2,EN!L27,IF(cal!$S$7=3,DE!L27,IF(cal!$S$7=4,FR!L27,IF(cal!$S$7=5,NR!L27,IF(cal!$S$7=6,SP!L27,IF(cal!$S$7=7,SW!L27,IF(cal!$S$7=8,TS!L27,IF(cal!$S$7=9,ExtraTaal1!L27,IF(cal!$S$7=10,ExtraTaal2!L27,IF(cal!$S$7=11,ExtraTaal3!L27,)))))))))))","v":0},{"$f":"IF($S$7=1,NL!M27,IF(cal!$S$7=2,EN!M27,IF(cal!$S$7=3,DE!M27,IF(cal!$S$7=4,FR!M27,IF(cal!$S$7=5,NR!M27,IF(cal!$S$7=6,SP!M27,IF(cal!$S$7=7,SW!M27,IF(cal!$S$7=8,TS!M27,IF(cal!$S$7=9,ExtraTaal1!M27,IF(cal!$S$7=10,ExtraTaal2!M27,IF(cal!$S$7=11,ExtraTaal3!M27,)))))))))))","v":0},{"$f":"IF($S$7=1,NL!N27,IF(cal!$S$7=2,EN!N27,IF(cal!$S$7=3,DE!N27,IF(cal!$S$7=4,FR!N27,IF(cal!$S$7=5,NR!N27,IF(cal!$S$7=6,SP!N27,IF(cal!$S$7=7,SW!N27,IF(cal!$S$7=8,TS!N27,IF(cal!$S$7=9,ExtraTaal1!N27,IF(cal!$S$7=10,ExtraTaal2!N27,IF(cal!$S$7=11,ExtraTaal3!N27,)))))))))))","v":0},{"$f":"IF($S$7=1,NL!O27,IF(cal!$S$7=2,EN!O27,IF(cal!$S$7=3,DE!O27,IF(cal!$S$7=4,FR!O27,IF(cal!$S$7=5,NR!O27,IF(cal!$S$7=6,SP!O27,IF(cal!$S$7=7,SW!O27,IF(cal!$S$7=8,TS!O27,IF(cal!$S$7=9,ExtraTaal1!O27,IF(cal!$S$7=10,ExtraTaal2!O27,IF(cal!$S$7=11,ExtraTaal3!O27,)))))))))))","v":0},"n-value","n-value","n-value","n-value","n-value","n-value",null,"H",13,"B",32,"L",100,0,"H",{"$f":"AF22","v":8},"B",{"$f":"AH22","v":18},"L",{"$f":"108*IF($X$4=1,1,IF($X$4=2,1/2.54))","v":108},null,"H",{"$f":"AM22","v":10},"B",{"$f":"AO22","v":18},"L",{"$f":"AJ28","v":108},{"$nulls":5},"H",{"$f":"AX22","v":13},"B",{"$f":"AZ22","v":27},"L",{"$f":"IF($X$4=1,108.3,108.3/2.54)","v":108.3},null,"H",{"$f":"BE22","v":13},"B",{"$f":"BG22","v":32},"L",{"$f":"IF($X$4=1,100,100/2.54)","v":100},null,"H",{"$f":"BL22","v":13},"B",{"$f":"BN22","v":32},"L",{"$f":"IF($X$4=1,100,100/2.54)","v":100},null,null,"H",{"$f":"BT22","v":19},"B",{"$f":"BV22","v":34},"L",{"$f":"120*IF($X$4=1,1,IF($X$4=2,1/2.54))","v":120},null,"H",{"$f":"CA22","v":19},"B",{"$f":"CC22","v":34},"L",{"$f":"BX28","v":120},null,null,"H",{"$f":"CI22","v":15},"B",{"$f":"CK22","v":32},"L",{"$f":"120*IF($X$4=1,1,IF($X$4=2,1/2.54))","v":120},null,"H",{"$f":"CP22","v":15},"B",{"$f":"CR22","v":32},"L",{"$f":"CM28","v":120}]
[null,{"v":0.2,"d":"20%"},2,{"$f":"(X29*($T$11^$Q29))*Watts*CF_Altit","v":{"v":779.6179744152683,"d":"780"}},{"$f":"ROUND(((D29/Watts)/(($S$9-$S$10)*1.163))*$E$14,IF($X$4=1,0,IF($X$4=2,2)))","v":67},{"$f":"($Y$30*(E29/$E$14)^$Y$32)*$F$14","v":{"v":0.09568037019898874,"d":"0.10"}},{"$f":"(Z29*($W$11^R29))*Watts*CF_Altit","v":{"v":167.76364343585763,"d":"168"}},{"$f":"((G29/Watts)/(IF((237.3*LN((RH*EXP(17.27*(Tl_cool/(Tl_cool+237.3))))))/(17.27-LN((RH*EXP(17.27*(Tl_cool/(Tl_cool+237.3))))))<Tavg_cold,1,IF(1/(1+((2258*((0.622/(($Z$11/(1*611*EXP(17.27*(Tavg_cold/(Tavg_cold+237.3))))))-1)*1000-(0.622/(($Z$11/(RH*611*EXP(17.27*(Tl_cool/(Tl_cool+237.3))))))-1)*1000))/(1005*(Tavg_cold-Tl_cool))))*1.039+((-0.000729*$C29+0.001448)*(Tl_cool-Tavg_cold)+(0.016908*$C29-0.033574))*1.039>1,1,1/(1+((2258*((0.622/(($Z$11/(1*611*EXP(17.27*(Tavg_cold/(Tavg_cold+237.3))))))-1)*1000-(0.622/(($Z$11/(RH*611*EXP(17.27*(Tl_cool/(Tl_cool+237.3))))))-1)*1000))/(1005*(Tavg_cold-Tl_cool))))*1.039+((-0.000729*$C29+0.001448)*(Tl_cool-Tavg_cold)+(0.016908*$C29-0.033574))*1.039))))*Watts","v":{"v":167.76364343585763,"d":"168"}},{"$f":"ROUND(((H29/Watts)/((Tr_cool-Tv_cool)*1.163))*$I$14,IF($X$4=1,0,IF($X$4=2,2)))","v":72},{"$f":"($AA$30*(I29/$I$14)^$AA$32)*$J$14","v":{"v":0.10950426958037363,"d":"0.11"}},{"$f":"L29-8","v":{"v":20,"d":"20.0"}},{"$f":"AB29","v":{"v":28,"d":"28.0"}},1.4,{"$f":"AD29*Cubics","v":49},{"$f":"((($D29/Watts)/(((p_atm*0.028964)/(8.31447*(20+273.15)))*(($N29/3600)/Cubics)*(1005+1870*((0.622)/(((p_atm)/($E$12*Pvs_Heat_in))-1)))))+Tl_heat)*Celc1+Celc2","v":{"v":66.70265296066178,"d":"67"}},{"$f":"(Tl_cool-(($G29/Watts)/(1006*$N29*kgss)))*Celc1+Celc2","v":{"v":16.82393663699058,"d":"17"}},1,{"v":0.7807,"d":"0.781"},{"v":0.6,"d":"0.600"},{"v":1.16,"d":"1.160"},{"v":0.7807,"d":"0.781"},{"v":0.8766,"d":"0.877"},{"$f":"(H29-G29)/H29","v":{"v":0,"d":"0.0%"}},779.6179744152683,"a",167.76364343585763,"a",{"v":28,"d":"28.0"},1.4,49,894,"a",97,"a",{"v":24,"d":"24.0"},1.1,66,{"$f":"AE29","v":894},"a",97,"a",{"$f":"AI29","v":{"v":24,"d":"24.0"}},1.1,66,null,{"$f":"(AG29*((((Tv_cool-Tr_cool)/LN((Tv_cool-Tl_cool)/(Tr_cool-Tl_cool)))/((16-18)/LN((16-27)/(18-27))))^S29))*$G$14","v":0.032441111111111066},{"$f":"((AT29/$G$14)/(IF((237.3*LN((RH*EXP(17.27*(Tl_cool/(Tl_cool+237.3))))))/(17.27-LN((RH*EXP(17.27*(Tl_cool/(Tl_cool+237.3))))))<((Tv_cool+Tr_cool)/2),1,1/(1+((2258*((0.622/((p_atm/(1*611*EXP(17.27*(((Tv_cool+Tr_cool)/2)/(((Tv_cool+Tr_cool)/2)+237.3))))))-1)*1000-(0.622/((p_atm/(RH*611*EXP(17.27*(Tl_cool/(Tl_cool+237.3))))))-1)*1000))/(1005*(((Tv_cool+Tr_cool)/2)-Tl_cool))))+-((-0.000625*$C29+0.00625)*(Tl_cool-(Tv_cool+Tr_cool)/2)-(-0.000625*$C29+0.00625)*10))))*$H$14","v":96.99999999999999},null,1091,"a",125,"a",28.8,{"v":2,"d":"2.0"},90,668.8166299999999,"a",161.0765044853346,"a",{"v":28,"d":"28.0"},1.4,49,779.6179744152683,"a",167.76364343585763,"a",{"$f":"BH29","v":{"v":28,"d":"28.0"}},1.4,49,null,2014.2641353059967,"a",361.8376035033905,"a",{"v":29.1043935579596,"d":"29.1"},4.6,179,3021.3962029589957,"a",398.0213638537296,"a",{"v":29.1043935579596,"d":"29.1"},4.6,179,null,{"$f":"BS29*0.9","v":1812.837721775397},"a",{"$f":"BU29*0.9","v":325.65384315305147},"a",{"v":29.1043935579596,"d":"29.1"},4.6,179,{"$f":"BZ29*0.9","v":2719.256582663096},"a",{"$f":"CB29*0.9","v":358.2192274683567},"a",{"v":29.1043935579596,"d":"29.1"},4.6,179]
[null,{"v":0.4,"d":"40%"},4,{"$f":"(X30*($T$11^$Q30))*Watts*CF_Altit","v":{"v":1724.2585778611092,"d":"1724"}},{"$f":"ROUND(((D30/Watts)/(($S$9-$S$10)*1.163))*$E$14,IF($X$4=1,0,IF($X$4=2,2)))","v":148},{"$f":"($Y$30*(E30/$E$14)^$Y$32)*$F$14","v":{"v":0.42283763794736967,"d":"0.42"}},{"$f":"(Z30*($W$11^R30))*Watts*CF_Altit","v":{"v":304.6166871239135,"d":"305"}},{"$f":"((G30/Watts)/(IF((237.3*LN((RH*EXP(17.27*(Tl_cool/(Tl_cool+237.3))))))/(17.27-LN((RH*EXP(17.27*(Tl_cool/(Tl_cool+237.3))))))<Tavg_cold,1,IF(1/(1+((2258*((0.622/(($Z$11/(1*611*EXP(17.27*(Tavg_cold/(Tavg_cold+237.3))))))-1)*1000-(0.622/(($Z$11/(RH*611*EXP(17.27*(Tl_cool/(Tl_cool+237.3))))))-1)*1000))/(1005*(Tavg_cold-Tl_cool))))*1.039+((-0.000729*$C30+0.001448)*(Tl_cool-Tavg_cold)+(0.016908*$C30-0.033574))*1.039>1,1,1/(1+((2258*((0.622/(($Z$11/(1*611*EXP(17.27*(Tavg_cold/(Tavg_cold+237.3))))))-1)*1000-(0.622/(($Z$11/(RH*611*EXP(17.27*(Tl_cool/(Tl_cool+237.3))))))-1)*1000))/(1005*(Tavg_cold-Tl_cool))))*1.039+((-0.000729*$C30+0.001448)*(Tl_cool-Tavg_cold)+(0.016908*$C30-0.033574))*1.039))))*Watts","v":{"v":304.6166871239135,"d":"305"}},{"$f":"ROUND(((H30/Watts)/((Tr_cool-Tv_cool)*1.163))*$I$14,IF($X$4=1,0,IF($X$4=2,2)))","v":131},{"$f":"($AA$30*(I30/$I$14)^$AA$32)*$J$14","v":{"v":0.3363694540454542,"d":"0.34"}},{"$f":"L30-8","v":{"v":26,"d":"26.0"}},{"v":34,"d":"34.0"},2.4,{"$f":"AD30*Cubics","v":114},{"$f":"((($D30/Watts)/(((p_atm*0.028964)/(8.31447*(20+273.15)))*(($N30/3600)/Cubics)*(1005+1870*((0.622)/(((p_atm)/($E$12*Pvs_Heat_in))-1)))))+Tl_heat)*Celc1+Celc2","v":{"v":64.39697005826841,"d":"64"}},{"$f":"(Tl_cool-(($G30/Watts)/(1006*$N30*kgss)))*Celc1+Celc2","v":{"v":19.058055049909132,"d":"19"}},1,{"v":0.8587,"d":"0.859"},{"v":0.68,"d":"0.680"},{"v":1.04,"d":"1.040"},{"v":0.8587,"d":"0.859"},{"v":0.8775,"d":"0.878"},{"$f":"(H30-G30)/H30","v":{"v":0,"d":"0.0%"}},1724.2585778611092,3.6052122831577476E-5,304.6166871239135,3.6052122831577476E-5,{"v":34,"d":"34.0"},2.4,114,1605,5.6054747775989447E-4,212,{"$f":"AF30","v":5.6054747775989447E-4},{"v":28,"d":"28.0"},2.1,112,{"$f":"AE30","v":1605},{"$f":"AH30","v":5.6054747775989447E-4},212,{"$f":"AM30","v":5.6054747775989447E-4},{"v":28,"d":"28.0"},2.1,112,null,{"$f":"(AG30*((((Tv_cool-Tr_cool)/LN((Tv_cool-Tl_cool)/(Tr_cool-Tl_cool)))/((16-18)/LN((16-27)/(18-27))))^S30))*$G$14","v":0.07090222222222213},{"$f":"((AT30/$G$14)/(IF((237.3*LN((RH*EXP(17.27*(Tl_cool/(Tl_cool+237.3))))))/(17.27-LN((RH*EXP(17.27*(Tl_cool/(Tl_cool+237.3))))))<((Tv_cool+Tr_cool)/2),1,1/(1+((2258*((0.622/((p_atm/(1*611*EXP(17.27*(((Tv_cool+Tr_cool)/2)/(((Tv_cool+Tr_cool)/2)+237.3))))))-1)*1000-(0.622/((p_atm/(RH*611*EXP(17.27*(Tl_cool/(Tl_cool+237.3))))))-1)*1000))/(1005*(((Tv_cool+Tr_cool)/2)-Tl_cool))))+-((-0.000625*$C30+0.00625)*(Tl_cool-(Tv_cool+Tr_cool)/2)-(-0.000625*$C30+0.00625)*10))))*$H$14","v":212},null,1779,6.85e-05,253,{"v":6.4513e-06,"d":"6.45E-06"},33.1,3.5,133,1333.8473699999997,4.82908e-05,292.52052512718586,1.411968325044228E-5,{"v":34,"d":"34.0"},2.4,114,1724.2585778611092,3.6052122831577476E-5,304.6166871239135,{"$f":"BL30","v":3.6052122831577476E-5},{"v":34,"d":"34.0"},2.4,114,null,3178.8344395809327,3.3026323224877546E-5,706.9479123558147,9.8542791184631786E-5,{"v":32.553468286911865,"d":"32.6"},9.4,346,4768.2516593714,3.3622644513664882E-5,777.6427035913963,3.3622644513664882E-5,{"v":32.553468286911865,"d":"32.6"},9.4,346,null,{"$f":"BS30*0.9","v":2860.9509956228394},3.3026323224877546E-5,{"$f":"BU30*0.9","v":636.2531211202332},9.8542791184631786E-5,{"v":32.553468286911865,"d":"32.6"},9.4,346,{"$f":"BZ30*0.9","v":4291.42649343426},3.3622644513664882E-5,{"$f":"CB30*0.9","v":699.8784332322567},3.3622644513664882E-5,{"v":32.553468286911865,"d":"32.6"},9.4,346]
[null,{"v":0.6,"d":"60%"},6,{"$f":"(X31*($T$11^$Q31))*Watts*CF_Altit","v":{"v":2570.3939704182585,"d":"2570"}},{"$f":"ROUND(((D31/Watts)/(($S$9-$S$10)*1.163))*$E$14,IF($X$4=1,0,IF($X$4=2,2)))","v":221},{"$f":"($Y$30*(E31/$E$14)^$Y$32)*$F$14","v":{"v":0.8967442523572674,"d":"0.90"}},{"$f":"(Z31*($W$11^R31))*Watts*CF_Altit","v":{"v":435.03767942348554,"d":"435"}},{"$f":"((G31/Watts)/(IF((237.3*LN((RH*EXP(17.27*(Tl_cool/(Tl_cool+237.3))))))/(17.27-LN((RH*EXP(17.27*(Tl_cool/(Tl_cool+237.3))))))<Tavg_cold,1,IF(1/(1+((2258*((0.622/(($Z$11/(1*611*EXP(17.27*(Tavg_cold/(Tavg_cold+237.3))))))-1)*1000-(0.622/(($Z$11/(RH*611*EXP(17.27*(Tl_cool/(Tl_cool+237.3))))))-1)*1000))/(1005*(Tavg_cold-Tl_cool))))*1.039+((-0.000729*$C31+0.001448)*(Tl_cool-Tavg_cold)+(0.016908*$C31-0.033574))*1.039>1,1,1/(1+((2258*((0.622/(($Z$11/(1*611*EXP(17.27*(Tavg_cold/(Tavg_cold+237.3))))))-1)*1000-(0.622/(($Z$11/(RH*611*EXP(17.27*(Tl_cool/(Tl_cool+237.3))))))-1)*1000))/(1005*(Tavg_cold-Tl_cool))))*1.039+((-0.000729*$C31+0.001448)*(Tl_cool-Tavg_cold)+(0.016908*$C31-0.033574))*1.039))))*Watts","v":{"v":435.03767942348554,"d":"435"}},{"$f":"ROUND(((H31/Watts)/((Tr_cool-Tv_cool)*1.163))*$I$14,IF($X$4=1,0,IF($X$4=2,2)))","v":187},{"$f":"($AA$30*(I31/$I$14)^$AA$32)*$J$14","v":{"v":0.6555956017793811,"d":"0.66"}},{"$f":"L31-8","v":{"v":30,"d":"30.0"}},{"v":38,"d":"38.0"},4.2,{"$f":"AD31*Cubics","v":174},{"$f":"((($D31/Watts)/(((p_atm*0.028964)/(8.31447*(20+273.15)))*(($N31/3600)/Cubics)*(1005+1870*((0.622)/(((p_atm)/($E$12*Pvs_Heat_in))-1)))))+Tl_heat)*Celc1+Celc2","v":{"v":63.36169333278826,"d":"63"}},{"$f":"(Tl_cool-(($G31/Watts)/(1006*$N31*kgss)))*Celc1+Celc2","v":{"v":19.56885631866688,"d":"20"}},1,{"v":0.8831,"d":"0.883"},{"v":0.79,"d":"0.790"},{"v":0.95,"d":"0.950"},{"v":0.8831,"d":"0.883"},0.882,{"$f":"(H31-G31)/H31","v":{"v":0,"d":"0.0%"}},2570.3939704182585,"b",435.03767942348554,"b",{"v":38,"d":"38.0"},4.2,174,2260,"b",336,"b",{"v":38,"d":"38.0"},{"v":4,"d":"4.0"},150,{"$f":"AE31","v":2260},"b",336,"b",{"v":38,"d":"38.0"},{"v":4,"d":"4.0"},150,null,{"$f":"(AG31*((((Tv_cool-Tr_cool)/LN((Tv_cool-Tl_cool)/(Tr_cool-Tl_cool)))/((16-18)/LN((16-27)/(18-27))))^S31))*$G$14","v":0.11237333333333319},{"$f":"((AT31/$G$14)/(IF((237.3*LN((RH*EXP(17.27*(Tl_cool/(Tl_cool+237.3))))))/(17.27-LN((RH*EXP(17.27*(Tl_cool/(Tl_cool+237.3))))))<((Tv_cool+Tr_cool)/2),1,1/(1+((2258*((0.622/((p_atm/(1*611*EXP(17.27*(((Tv_cool+Tr_cool)/2)/(((Tv_cool+Tr_cool)/2)+237.3))))))-1)*1000-(0.622/((p_atm/(RH*611*EXP(17.27*(Tl_cool/(Tl_cool+237.3))))))-1)*1000))/(1005*(((Tv_cool+Tr_cool)/2)-Tl_cool))))+-((-0.000625*$C31+0.00625)*(Tl_cool-(Tv_cool+Tr_cool)/2)-(-0.000625*$C31+0.00625)*10))))*$H$14","v":336},null,2367,"b",383,"b",39.2,6.5,208,1881.3568699999998,"b",420.5303054278088,"b",{"v":38,"d":"38.0"},4.2,174,2570.3939704182585,"b",435.03767942348554,"b",{"v":38,"d":"38.0"},4.2,174,null,4151.252023935338,"b",1046.014328903128,"b",{"v":38.531203067291,"d":"38.5"},16.9,496,6226.878035903008,"b",1150.615761793441,"b",{"v":38.531203067291,"d":"38.5"},16.9,496,null,3736.1268215418045,"b",941.4128960128152,"b",{"v":38.531203067291,"d":"38.5"},16.9,496,5604.190232312707,"b",1035.554185614097,"b",{"v":38.531203067291,"d":"38.5"},16.9,496]
[null,{"v":0.8,"d":"80%"},8,{"$f":"(X32*($T$11^$Q32))*Watts*CF_Altit","v":{"v":3318.024152086716,"d":"3318"}},{"$f":"ROUND(((D32/Watts)/(($S$9-$S$10)*1.163))*$E$14,IF($X$4=1,0,IF($X$4=2,2)))","v":285},{"$f":"($Y$30*(E32/$E$14)^$Y$32)*$F$14","v":{"v":1.4446655180391863,"d":"1.44"}},{"$f":"(Z32*($W$11^R32))*Watts*CF_Altit","v":{"v":559.0266203345737,"d":"559"}},{"$f":"((G32/Watts)/(IF((237.3*LN((RH*EXP(17.27*(Tl_cool/(Tl_cool+237.3))))))/(17.27-LN((RH*EXP(17.27*(Tl_cool/(Tl_cool+237.3))))))<Tavg_cold,1,IF(1/(1+((2258*((0.622/(($Z$11/(1*611*EXP(17.27*(Tavg_cold/(Tavg_cold+237.3))))))-1)*1000-(0.622/(($Z$11/(RH*611*EXP(17.27*(Tl_cool/(Tl_cool+237.3))))))-1)*1000))/(1005*(Tavg_cold-Tl_cool))))*1.039+((-0.000729*$C32+0.001448)*(Tl_cool-Tavg_cold)+(0.016908*$C32-0.033574))*1.039>1,1,1/(1+((2258*((0.622/(($Z$11/(1*611*EXP(17.27*(Tavg_cold/(Tavg_cold+237.3))))))-1)*1000-(0.622/(($Z$11/(RH*611*EXP(17.27*(Tl_cool/(Tl_cool+237.3))))))-1)*1000))/(1005*(Tavg_cold-Tl_cool))))*1.039+((-0.000729*$C32+0.001448)*(Tl_cool-Tavg_cold)+(0.016908*$C32-0.033574))*1.039))))*Watts","v":{"v":559.0266203345737,"d":"559"}},{"$f":"ROUND(((H32/Watts)/((Tr_cool-Tv_cool)*1.163))*$I$14,IF($X$4=1,0,IF($X$4=2,2)))","v":240},{"$f":"($AA$30*(I32/$I$14)^$AA$32)*$J$14","v":{"v":1.0467168154444026,"d":"1.05"}},{"$f":"L32-8","v":{"v":37,"d":"37.0"}},{"v":45,"d":"45.0"},7.2,{"$f":"AD32*Cubics","v":235},{"$f":"((($D32/Watts)/(((p_atm*0.028964)/(8.31447*(20+273.15)))*(($N32/3600)/Cubics)*(1005+1870*((0.622)/(((p_atm)/($E$12*Pvs_Heat_in))-1)))))+Tl_heat)*Celc1+Celc2","v":{"v":61.444553850468544,"d":"61"}},{"$f":"(Tl_cool-(($G32/Watts)/(1006*$N32*kgss)))*Celc1+Celc2","v":{"v":19.929621559522246,"d":"20"}},1,{"v":0.8539,"d":"0.854"},{"v":0.87,"d":"0.870"},0.95,{"v":0.8539,"d":"0.854"},0.895,{"$f":"(H32-G32)/H32","v":{"v":0,"d":"0.0%"}},3318.024152086716,1.8750009582627225,559.0266203345737,1.8750009582627225,{"v":45,"d":"45.0"},7.2,235,2881,1.8235155847906248,465,{"$f":"AF32","v":1.8235155847906248},{"v":43,"d":"43.0"},6.6,193,{"$f":"AE32","v":2881},{"$f":"AH32","v":1.8235155847906248},465,{"$f":"AM32","v":1.8235155847906248},{"v":43,"d":"43.0"},6.6,193,null,{"$f":"(AG32*((((Tv_cool-Tr_cool)/LN((Tv_cool-Tl_cool)/(Tr_cool-Tl_cool)))/((16-18)/LN((16-27)/(18-27))))^S32))*$G$14","v":0.15551666666666647},{"$f":"((AT32/$G$14)/(IF((237.3*LN((RH*EXP(17.27*(Tl_cool/(Tl_cool+237.3))))))/(17.27-LN((RH*EXP(17.27*(Tl_cool/(Tl_cool+237.3))))))<((Tv_cool+Tr_cool)/2),1,1/(1+((2258*((0.622/((p_atm/(1*611*EXP(17.27*(((Tv_cool+Tr_cool)/2)/(((Tv_cool+Tr_cool)/2)+237.3))))))-1)*1000-(0.622/((p_atm/(RH*611*EXP(17.27*(Tl_cool/(Tl_cool+237.3))))))-1)*1000))/(1005*(((Tv_cool+Tr_cool)/2)-Tl_cool))))+-((-0.000625*$C32+0.00625)*(Tl_cool-(Tv_cool+Tr_cool)/2)-(-0.000625*$C32+0.00625)*10))))*$H$14","v":465},null,2900,1.8,513,2,46.5,11.5,285,2311.3451299999997,1.88069,545.1058453872034,1.939087555945629,{"v":45,"d":"45.0"},7.2,235,3318.024152086716,1.8750009582627225,559.0266203345737,{"$f":"BL32","v":1.8750009582627225},{"v":45,"d":"45.0"},7.2,235,null,5016.714648861442,2,1381.2145170797912,2,{"v":46.544850742514384,"d":"46.5"},27.7,660,7525.071973292163,2,1519.3359687877708,2,{"v":46.544850742514384,"d":"46.5"},27.7,660,null,4515.043183975297,2,1243.0930653718121,2,{"v":46.544850742514384,"d":"46.5"},27.7,660,6772.564775962947,2,1367.4023719089937,2,{"v":46.544850742514384,"d":"46.5"},27.7,660]
[null,{"v":1,"d":"100%"},10,{"$f":"(X33*($T$11^$Q33))*Watts*CF_Altit","v":{"v":3967.1491228664822,"d":"3967"}},{"$f":"ROUND(((D33/Watts)/(($S$9-$S$10)*1.163))*$E$14,IF($X$4=1,0,IF($X$4=2,2)))","v":341},{"$f":"($Y$30*(E33/$E$14)^$Y$32)*$F$14","v":{"v":2.0223100015679076,"d":"2.02"}},{"$f":"(Z33*($W$11^R33))*Watts*CF_Altit","v":{"v":676.5835098571781,"d":"677"}},{"$f":"((G33/Watts)/(IF((237.3*LN((RH*EXP(17.27*(Tl_cool/(Tl_cool+237.3))))))/(17.27-LN((RH*EXP(17.27*(Tl_cool/(Tl_cool+237.3))))))<Tavg_cold,1,IF(1/(1+((2258*((0.622/(($Z$11/(1*611*EXP(17.27*(Tavg_cold/(Tavg_cold+237.3))))))-1)*1000-(0.622/(($Z$11/(RH*611*EXP(17.27*(Tl_cool/(Tl_cool+237.3))))))-1)*1000))/(1005*(Tavg_cold-Tl_cool))))*1.039+((-0.000729*$C33+0.001448)*(Tl_cool-Tavg_cold)+(0.016908*$C33-0.033574))*1.039>1,1,1/(1+((2258*((0.622/(($Z$11/(1*611*EXP(17.27*(Tavg_cold/(Tavg_cold+237.3))))))-1)*1000-(0.622/(($Z$11/(RH*611*EXP(17.27*(Tl_cool/(Tl_cool+237.3))))))-1)*1000))/(1005*(Tavg_cold-Tl_cool))))*1.039+((-0.000729*$C33+0.001448)*(Tl_cool-Tavg_cold)+(0.016908*$C33-0.033574))*1.039))))*Watts","v":{"v":676.5835098571781,"d":"677"}},{"$f":"ROUND(((H33/Watts)/((Tr_cool-Tv_cool)*1.163))*$I$14,IF($X$4=1,0,IF($X$4=2,2)))","v":291},{"$f":"($AA$30*(I33/$I$14)^$AA$32)*$J$14","v":{"v":1.5022166024091557,"d":"1.50"}},{"$f":"L33-8","v":{"v":40,"d":"40.0"}},{"v":48,"d":"48.0"},10.6,{"$f":"AD33*Cubics","v":273},{"$f":"((($D33/Watts)/(((p_atm*0.028964)/(8.31447*(20+273.15)))*(($N33/3600)/Cubics)*(1005+1870*((0.622)/(((p_atm)/($E$12*Pvs_Heat_in))-1)))))+Tl_heat)*Celc1+Celc2","v":{"v":62.65516897988076,"d":"63"}},{"$f":"(Tl_cool-(($G33/Watts)/(1006*$N33*kgss)))*Celc1+Celc2","v":{"v":19.633913834464146,"d":"20"}},1,{"v":0.7711,"d":"0.771"},{"v":0.91,"d":"0.910"},{"v":0.98,"d":"0.980"},{"v":0.7711,"d":"0.771"},{"v":0.9111,"d":"0.911"},{"$f":"(H33-G33)/H33","v":{"v":0,"d":"0.0%"}},3967.1491228664822,0,676.5835098571781,0,{"v":48,"d":"48.0"},10.6,273,3479,null,598,null,{"v":47,"d":"47.0"},10.1,239,{"$f":"AE33","v":3479},null,598,null,{"v":47,"d":"47.0"},10.1,239,null,{"$f":"(AG33*((((Tv_cool-Tr_cool)/LN((Tv_cool-Tl_cool)/(Tr_cool-Tl_cool)))/((16-18)/LN((16-27)/(18-27))))^S33))*$G$14","v":0.19999777777777752},{"$f":"((AT33/$G$14)/(IF((237.3*LN((RH*EXP(17.27*(Tl_cool/(Tl_cool+237.3))))))/(17.27-LN((RH*EXP(17.27*(Tl_cool/(Tl_cool+237.3))))))<((Tv_cool+Tr_cool)/2),1,1/(1+((2258*((0.622/((p_atm/(1*611*EXP(17.27*(((Tv_cool+Tr_cool)/2)/(((Tv_cool+Tr_cool)/2)+237.3))))))-1)*1000-(0.622/((p_atm/(RH*611*EXP(17.27*(Tl_cool/(Tl_cool+237.3))))))-1)*1000))/(1005*(((Tv_cool+Tr_cool)/2)-Tl_cool))))+-((-0.000625*$C33+0.00625)*(Tl_cool-(Tv_cool+Tr_cool)/2)-(-0.000625*$C33+0.00625)*10))))*$H$14","v":598},null,3394,null,645,null,49.6,17.5,349,2623.8121499999993,null,666.2471450053699,null,{"v":48,"d":"48.0"},10.6,273,3967.1491228664822,null,676.5835098571781,null,{"v":48,"d":"48.0"},10.6,273,null,5810.452169858482,null,1713.5688397870406,null,{"v":51.540571811172136,"d":"51.5"},38.9,752,8715.678254787723,null,1884.925723765745,null,{"v":51.540571811172136,"d":"51.5"},38.9,752,null,5229.406952872634,null,1542.2119558083366,null,{"v":51.540571811172136,"d":"51.5"},38.9,752,7844.110429308951,null,1696.4331513891705,null,{"v":51.540571811172136,"d":"51.5"},38.9,752]
[null,{"$f":"IF($S$7=1,NL!A33,IF(cal!$S$7=2,EN!A33,IF(cal!$S$7=3,DE!A33,IF(cal!$S$7=4,FR!A33,IF(cal!$S$7=5,NR!A33,IF(cal!$S$7=6,SP!A33,IF(cal!$S$7=7,SW!A33,IF(cal!$S$7=8,TS!A33,IF(cal!$S$7=9,ExtraTaal1!A33,IF(cal!$S$7=10,ExtraTaal2!A33,IF(cal!$S$7=11,ExtraTaal3!A33,)))))))))))","v":"Clima Canal height 13 cm width 32 cm length 140 cm (Type 4)"},{"$f":"IF($S$7=1,NL!B33,IF(cal!$S$7=2,EN!B33,IF(cal!$S$7=3,DE!B33,IF(cal!$S$7=4,FR!B33,IF(cal!$S$7=5,NR!B33,IF(cal!$S$7=6,SP!B33,IF(cal!$S$7=7,SW!B33,IF(cal!$S$7=8,TS!B33,IF(cal!$S$7=9,ExtraTaal1!B33,IF(cal!$S$7=10,ExtraTaal2!B33,IF(cal!$S$7=11,ExtraTaal3!B33,)))))))))))","v":0},{"$f":"IF($S$7=1,NL!C33,IF(cal!$S$7=2,EN!C33,IF(cal!$S$7=3,DE!C33,IF(cal!$S$7=4,FR!C33,IF(cal!$S$7=5,NR!C33,IF(cal!$S$7=6,SP!C33,IF(cal!$S$7=7,SW!C33,IF(cal!$S$7=8,TS!C33,IF(cal!$S$7=9,ExtraTaal1!C33,IF(cal!$S$7=10,ExtraTaal2!C33,IF(cal!$S$7=11,ExtraTaal3!C33,)))))))))))","v":0},{"$f":"IF($S$7=1,NL!D33,IF(cal!$S$7=2,EN!D33,IF(cal!$S$7=3,DE!D33,IF(cal!$S$7=4,FR!D33,IF(cal!$S$7=5,NR!D33,IF(cal!$S$7=6,SP!D33,IF(cal!$S$7=7,SW!D33,IF(cal!$S$7=8,TS!D33,IF(cal!$S$7=9,ExtraTaal1!D33,IF(cal!$S$7=10,ExtraTaal2!D33,IF(cal!$S$7=11,ExtraTaal3!D33,)))))))))))","v":0},{"$f":"IF($S$7=1,NL!E33,IF(cal!$S$7=2,EN!E33,IF(cal!$S$7=3,DE!E33,IF(cal!$S$7=4,FR!E33,IF(cal!$S$7=5,NR!E33,IF(cal!$S$7=6,SP!E33,IF(cal!$S$7=7,SW!E33,IF(cal!$S$7=8,TS!E33,IF(cal!$S$7=9,ExtraTaal1!E33,IF(cal!$S$7=10,ExtraTaal2!E33,IF(cal!$S$7=11,ExtraTaal3!E33,)))))))))))","v":0},{"$f":"IF($S$7=1,NL!F33,IF(cal!$S$7=2,EN!F33,IF(cal!$S$7=3,DE!F33,IF(cal!$S$7=4,FR!F33,IF(cal!$S$7=5,NR!F33,IF(cal!$S$7=6,SP!F33,IF(cal!$S$7=7,SW!F33,IF(cal!$S$7=8,TS!F33,IF(cal!$S$7=9,ExtraTaal1!F33,IF(cal!$S$7=10,ExtraTaal2!F33,IF(cal!$S$7=11,ExtraTaal3!F33,)))))))))))","v":0},{"$f":"IF($S$7=1,NL!G33,IF(cal!$S$7=2,EN!G33,IF(cal!$S$7=3,DE!G33,IF(cal!$S$7=4,FR!G33,IF(cal!$S$7=5,NR!G33,IF(cal!$S$7=6,SP!G33,IF(cal!$S$7=7,SW!G33,IF(cal!$S$7=8,TS!G33,IF(cal!$S$7=9,ExtraTaal1!G33,IF(cal!$S$7=10,ExtraTaal2!G33,IF(cal!$S$7=11,ExtraTaal3!G33,)))))))))))","v":0},{"$f":"IF($S$7=1,NL!H33,IF(cal!$S$7=2,EN!H33,IF(cal!$S$7=3,DE!H33,IF(cal!$S$7=4,FR!H33,IF(cal!$S$7=5,NR!H33,IF(cal!$S$7=6,SP!H33,IF(cal!$S$7=7,SW!H33,IF(cal!$S$7=8,TS!H33,IF(cal!$S$7=9,ExtraTaal1!H33,IF(cal!$S$7=10,ExtraTaal2!H33,IF(cal!$S$7=11,ExtraTaal3!H33,)))))))))))","v":0},{"$f":"IF($S$7=1,NL!I33,IF(cal!$S$7=2,EN!I33,IF(cal!$S$7=3,DE!I33,IF(cal!$S$7=4,FR!I33,IF(cal!$S$7=5,NR!I33,IF(cal!$S$7=6,SP!I33,IF(cal!$S$7=7,SW!I33,IF(cal!$S$7=8,TS!I33,IF(cal!$S$7=9,ExtraTaal1!I33,IF(cal!$S$7=10,ExtraTaal2!I33,IF(cal!$S$7=11,ExtraTaal3!I33,)))))))))))","v":0},{"$f":"IF($S$7=1,NL!J33,IF(cal!$S$7=2,EN!J33,IF(cal!$S$7=3,DE!J33,IF(cal!$S$7=4,FR!J33,IF(cal!$S$7=5,NR!J33,IF(cal!$S$7=6,SP!J33,IF(cal!$S$7=7,SW!J33,IF(cal!$S$7=8,TS!J33,IF(cal!$S$7=9,ExtraTaal1!J33,IF(cal!$S$7=10,ExtraTaal2!J33,IF(cal!$S$7=11,ExtraTaal3!J33,)))))))))))","v":0},{"$f":"IF($S$7=1,NL!K33,IF(cal!$S$7=2,EN!K33,IF(cal!$S$7=3,DE!K33,IF(cal!$S$7=4,FR!K33,IF(cal!$S$7=5,NR!K33,IF(cal!$S$7=6,SP!K33,IF(cal!$S$7=7,SW!K33,IF(cal!$S$7=8,TS!K33,IF(cal!$S$7=9,ExtraTaal1!K33,IF(cal!$S$7=10,ExtraTaal2!K33,IF(cal!$S$7=11,ExtraTaal3!K33,)))))))))))","v":0},{"$f":"IF($S$7=1,NL!L33,IF(cal!$S$7=2,EN!L33,IF(cal!$S$7=3,DE!L33,IF(cal!$S$7=4,FR!L33,IF(cal!$S$7=5,NR!L33,IF(cal!$S$7=6,SP!L33,IF(cal!$S$7=7,SW!L33,IF(cal!$S$7=8,TS!L33,IF(cal!$S$7=9,ExtraTaal1!L33,IF(cal!$S$7=10,ExtraTaal2!L33,IF(cal!$S$7=11,ExtraTaal3!L33,)))))))))))","v":0},{"$f":"IF($S$7=1,NL!M33,IF(cal!$S$7=2,EN!M33,IF(cal!$S$7=3,DE!M33,IF(cal!$S$7=4,FR!M33,IF(cal!$S$7=5,NR!M33,IF(cal!$S$7=6,SP!M33,IF(cal!$S$7=7,SW!M33,IF(cal!$S$7=8,TS!M33,IF(cal!$S$7=9,ExtraTaal1!M33,IF(cal!$S$7=10,ExtraTaal2!M33,IF(cal!$S$7=11,ExtraTaal3!M33,)))))))))))","v":0},{"$f":"IF($S$7=1,NL!N33,IF(cal!$S$7=2,EN!N33,IF(cal!$S$7=3,DE!N33,IF(cal!$S$7=4,FR!N33,IF(cal!$S$7=5,NR!N33,IF(cal!$S$7=6,SP!N33,IF(cal!$S$7=7,SW!N33,IF(cal!$S$7=8,TS!N33,IF(cal!$S$7=9,ExtraTaal1!N33,IF(cal!$S$7=10,ExtraTaal2!N33,IF(cal!$S$7=11,ExtraTaal3!N33,)))))))))))","v":0},{"$f":"IF($S$7=1,NL!O33,IF(cal!$S$7=2,EN!O33,IF(cal!$S$7=3,DE!O33,IF(cal!$S$7=4,FR!O33,IF(cal!$S$7=5,NR!O33,IF(cal!$S$7=6,SP!O33,IF(cal!$S$7=7,SW!O33,IF(cal!$S$7=8,TS!O33,IF(cal!$S$7=9,ExtraTaal1!O33,IF(cal!$S$7=10,ExtraTaal2!O33,IF(cal!$S$7=11,ExtraTaal3!O33,)))))))))))","v":0},"n-value","n-value","n-value","n-value","n-value","n-value",null,"H",13,"B",32,"L",120,0,"H",{"$f":"AF28","v":8},"B",{"$f":"AH28","v":18},"L",{"$f":"144*IF($X$4=1,1,IF($X$4=2,1/2.54))","v":144},null,"H",{"$f":"AM28","v":10},"B",{"$f":"AO28","v":18},"L",{"$f":"AJ34","v":144},{"$nulls":5},"H",{"$f":"AX22","v":13},"B",{"$f":"AZ22","v":27},"L",{"$f":"IF($X$4=1,160.8,160.8/2.54)","v":160.8},null,"H",{"$f":"BE22","v":13},"B",{"$f":"BG22","v":32},"L",{"$f":"IF($X$4=1,120,120/2.54)","v":120},null,"H",{"$f":"BL22","v":13},"B",{"$f":"BN22","v":32},"L",{"$f":"IF($X$4=1,120,120/2.54)","v":120},null,null,"H",{"$f":"BT28","v":19},"B",{"$f":"BV28","v":34},"L",{"$f":"200*IF($X$4=1,1,IF($X$4=2,1/2.54))","v":200},null,"H",{"$f":"CA28","v":19},"B",{"$f":"CC28","v":34},"L",{"$f":"BX34","v":200},null,null,"H",{"$f":"CI28","v":15},"B",{"$f":"CK28","v":32},"L",{"$f":"200*IF($X$4=1,1,IF($X$4=2,1/2.54))","v":200},null,"H",{"$f":"CP28","v":15},"B",{"$f":"CR28","v":32},"L",{"$f":"CM34","v":200}]
[null,{"v":0.2,"d":"20%"},2,{"$f":"(X35*($T$11^$Q35))*Watts*CF_Altit","v":{"v":966.35281858659,"d":"966"}},{"$f":"ROUND(((D35/Watts)/(($S$9-$S$10)*1.163))*$E$14,IF($X$4=1,0,IF($X$4=2,2)))","v":83},{"$f":"($Y$36*(E35/$E$14)^$Y$38)*$F$14","v":{"v":0.16127172062869963,"d":"0.16"}},{"$f":"(Z35*($W$11^R35))*Watts*CF_Altit","v":{"v":207.94655204324866,"d":"208"}},{"$f":"((G35/Watts)/(IF((237.3*LN((RH*EXP(17.27*(Tl_cool/(Tl_cool+237.3))))))/(17.27-LN((RH*EXP(17.27*(Tl_cool/(Tl_cool+237.3))))))<Tavg_cold,1,IF(1/(1+((2258*((0.622/(($Z$11/(1*611*EXP(17.27*(Tavg_cold/(Tavg_cold+237.3))))))-1)*1000-(0.622/(($Z$11/(RH*611*EXP(17.27*(Tl_cool/(Tl_cool+237.3))))))-1)*1000))/(1005*(Tavg_cold-Tl_cool))))*1.039+((-0.000729*$C35+0.001448)*(Tl_cool-Tavg_cold)+(0.016908*$C35-0.033574))*1.039>1,1,1/(1+((2258*((0.622/(($Z$11/(1*611*EXP(17.27*(Tavg_cold/(Tavg_cold+237.3))))))-1)*1000-(0.622/(($Z$11/(RH*611*EXP(17.27*(Tl_cool/(Tl_cool+237.3))))))-1)*1000))/(1005*(Tavg_cold-Tl_cool))))*1.039+((-0.000729*$C35+0.001448)*(Tl_cool-Tavg_cold)+(0.016908*$C35-0.033574))*1.039))))*Watts","v":{"v":207.94655204324866,"d":"208"}},{"$f":"ROUND(((H35/Watts)/((Tr_cool-Tv_cool)*1.163))*$I$14,IF($X$4=1,0,IF($X$4=2,2)))","v":89},{"$f":"($AA$36*(I35/$I$14)^$AA$38)*$J$14","v":{"v":0.18365358149059038,"d":"0.18"}},{"$f":"L35-8","v":21.5},{"$f":"AB35","v":29.5},{"v":1.992,"d":"2.0"},{"$f":"AD35*Cubics","v":79},{"$f":"((($D35/Watts)/(((p_atm*0.028964)/(8.31447*(20+273.15)))*(($N35/3600)/Cubics)*(1005+1870*((0.622)/(((p_atm)/($E$12*Pvs_Heat_in))-1)))))+Tl_heat)*Celc1+Celc2","v":{"v":55.905784050632334,"d":"56"}},{"$f":"(Tl_cool-(($G35/Watts)/(1006*$N35*kgss)))*Celc1+Celc2","v":{"v":19.176471561357953,"d":"19"}},1,{"v":0.7807,"d":"0.781"},{"v":0.6,"d":"0.600"},{"v":1.16,"d":"1.160"},{"v":0.7807,"d":"0.781"},{"v":0.8766,"d":"0.877"},{"$f":"(H35-G35)/H35","v":{"v":0,"d":"0.0%"}},966.35281858659,"a",207.94655204324866,"a",29.5,{"v":1.992,"d":"2.0"},79,1219,"a",132,"a",{"v":26,"d":"26.0"},1.2,84,{"$f":"AE35","v":1219},"a",132,"a",{"$f":"AI35","v":{"v":26,"d":"26.0"}},1.2,84,null,{"$f":"(AG35*((((Tv_cool-Tr_cool)/LN((Tv_cool-Tl_cool)/(Tr_cool-Tl_cool)))/((16-18)/LN((16-27)/(18-27))))^S35))*$G$14","v":0.04414666666666661},{"$f":"((AT35/$G$14)/(IF((237.3*LN((RH*EXP(17.27*(Tl_cool/(Tl_cool+237.3))))))/(17.27-LN((RH*EXP(17.27*(Tl_cool/(Tl_cool+237.3))))))<((Tv_cool+Tr_cool)/2),1,1/(1+((2258*((0.622/((p_atm/(1*611*EXP(17.27*(((Tv_cool+Tr_cool)/2)/(((Tv_cool+Tr_cool)/2)+237.3))))))-1)*1000-(0.622/((p_atm/(RH*611*EXP(17.27*(Tl_cool/(Tl_cool+237.3))))))-1)*1000))/(1005*(((Tv_cool+Tr_cool)/2)-Tl_cool))))+-((-0.000625*$C35+0.00625)*(Tl_cool-(Tv_cool+Tr_cool)/2)-(-0.000625*$C35+0.00625)*10))))*$H$14","v":132},null,1367,"a",156,"a",30.1,{"v":2,"d":"2.0"},104,829.0122299999999,"a",199.65770316445665,"a",29.5,{"v":1.992,"d":"2.0"},79,966.35281858659,"a",207.94655204324866,"a",{"$f":"BH35","v":29.5},{"v":1.992,"d":"2.0"},79,null,2996.832006186971,"a",538.3437515538249,"a",{"v":30.520451931056087,"d":"30.5"},6.1,276,4495.248009280457,"a",592.1781267092075,"a",{"v":30.520451931056087,"d":"30.5"},6.1,276,null,{"$f":"BS35*0.9","v":2697.148805568274},"a",{"$f":"BU35*0.9","v":484.5093763984424},"a",{"v":30.520451931056087,"d":"30.5"},6.1,276,{"$f":"BZ35*0.9","v":4045.7232083524113},"a",{"$f":"CB35*0.9","v":532.9603140382868},"a",{"v":30.520451931056087,"d":"30.5"},6.1,276]
[null,{"v":0.4,"d":"40%"},4,{"$f":"(X36*($T$11^$Q36))*Watts*CF_Altit","v":{"v":2137.2546444146683,"d":"2137"}},{"$f":"ROUND(((D36/Watts)/(($S$9-$S$10)*1.163))*$E$14,IF($X$4=1,0,IF($X$4=2,2)))","v":184},{"$f":"($Y$36*(E36/$E$14)^$Y$38)*$F$14","v":{"v":0.7101173764124832,"d":"0.71"}},{"$f":"(Z36*($W$11^R36))*Watts*CF_Altit","v":{"v":377.5787678721562,"d":"378"}},{"$f":"((G36/Watts)/(IF((237.3*LN((RH*EXP(17.27*(Tl_cool/(Tl_cool+237.3))))))/(17.27-LN((RH*EXP(17.27*(Tl_cool/(Tl_cool+237.3))))))<Tavg_cold,1,IF(1/(1+((2258*((0.622/(($Z$11/(1*611*EXP(17.27*(Tavg_cold/(Tavg_cold+237.3))))))-1)*1000-(0.622/(($Z$11/(RH*611*EXP(17.27*(Tl_cool/(Tl_cool+237.3))))))-1)*1000))/(1005*(Tavg_cold-Tl_cool))))*1.039+((-0.000729*$C36+0.001448)*(Tl_cool-Tavg_cold)+(0.016908*$C36-0.033574))*1.039>1,1,1/(1+((2258*((0.622/(($Z$11/(1*611*EXP(17.27*(Tavg_cold/(Tavg_cold+237.3))))))-1)*1000-(0.622/(($Z$11/(RH*611*EXP(17.27*(Tl_cool/(Tl_cool+237.3))))))-1)*1000))/(1005*(Tavg_cold-Tl_cool))))*1.039+((-0.000729*$C36+0.001448)*(Tl_cool-Tavg_cold)+(0.016908*$C36-0.033574))*1.039))))*Watts","v":{"v":377.5787678721562,"d":"378"}},{"$f":"ROUND(((H36/Watts)/((Tr_cool-Tv_cool)*1.163))*$I$14,IF($X$4=1,0,IF($X$4=2,2)))","v":162},{"$f":"($AA$36*(I36/$I$14)^$AA$38)*$J$14","v":{"v":0.5602160976567919,"d":"0.56"}},{"$f":"L36-8","v":{"v":26,"d":"26.0"}},{"v":34,"d":"34.0"},{"v":3.4320000000000004,"d":"3.4"},{"$f":"AD36*Cubics","v":129},{"$f":"((($D36/Watts)/(((p_atm*0.028964)/(8.31447*(20+273.15)))*(($N36/3600)/Cubics)*(1005+1870*((0.622)/(((p_atm)/($E$12*Pvs_Heat_in))-1)))))+Tl_heat)*Celc1+Celc2","v":{"v":68.63202429722034,"d":"69"}},{"$f":"(Tl_cool-(($G36/Watts)/(1006*$N36*kgss)))*Celc1+Celc2","v":{"v":18.300468043808003,"d":"18"}},1,{"v":0.8587,"d":"0.859"},{"v":0.68,"d":"0.680"},{"v":1.04,"d":"1.040"},{"v":0.8587,"d":"0.859"},{"v":0.8775,"d":"0.878"},{"$f":"(H36-G36)/H36","v":{"v":0,"d":"0.0%"}},2137.2546444146683,4.3073444316382473E-5,377.5787678721562,4.3073444316382473E-5,{"v":34,"d":"34.0"},{"v":3.4320000000000004,"d":"3.4"},129,2188,7.3989525167788965E-4,290,{"$f":"AF36","v":7.3989525167788965E-4},{"v":30,"d":"30.0"},2.5,150,{"$f":"AE36","v":2188},{"$f":"AH36","v":7.3989525167788965E-4},290,{"$f":"AM36","v":7.3989525167788965E-4},{"v":30,"d":"30.0"},2.5,150,null,{"$f":"(AG36*((((Tv_cool-Tr_cool)/LN((Tv_cool-Tl_cool)/(Tr_cool-Tl_cool)))/((16-18)/LN((16-27)/(18-27))))^S36))*$G$14","v":0.09698888888888876},{"$f":"((AT36/$G$14)/(IF((237.3*LN((RH*EXP(17.27*(Tl_cool/(Tl_cool+237.3))))))/(17.27-LN((RH*EXP(17.27*(Tl_cool/(Tl_cool+237.3))))))<((Tv_cool+Tr_cool)/2),1,1/(1+((2258*((0.622/((p_atm/(1*611*EXP(17.27*(((Tv_cool+Tr_cool)/2)/(((Tv_cool+Tr_cool)/2)+237.3))))))-1)*1000-(0.622/((p_atm/(RH*611*EXP(17.27*(Tl_cool/(Tl_cool+237.3))))))-1)*1000))/(1005*(((Tv_cool+Tr_cool)/2)-Tl_cool))))+-((-0.000625*$C36+0.00625)*(Tl_cool-(Tv_cool+Tr_cool)/2)-(-0.000625*$C36+0.00625)*10))))*$H$14","v":290},null,2229,8.8e-05,317,{"v":6.72689e-06,"d":"6.73E-06"},34.9,3.6,156,1653.3317699999996,5.62805e-05,362.5853215648351,1.5022728308696918E-5,{"v":34,"d":"34.0"},{"v":3.4320000000000004,"d":"3.4"},129,2137.2546444146683,4.3073444316382473E-5,377.5787678721562,{"$f":"BL36","v":4.3073444316382473E-5},{"v":34,"d":"34.0"},{"v":3.4320000000000004,"d":"3.4"},129,null,4729.485385717973,4.1508748845793605E-5,1051.800552529383,1.2302938988853249E-4,{"v":34.143327309406075,"d":"34.1"},12.1,513,7094.228078576961,3.7815116499727958E-5,1156.9806077823214,3.7815116499727958E-5,{"v":34.143327309406075,"d":"34.1"},12.1,513,null,{"$f":"BS36*0.9","v":4256.536847146176},4.1508748845793605E-5,{"$f":"BU36*0.9","v":946.6204972764447},1.2302938988853249E-4,{"v":34.143327309406075,"d":"34.1"},12.1,513,{"$f":"BZ36*0.9","v":6384.805270719265},3.7815116499727958E-5,{"$f":"CB36*0.9","v":1041.2825470040893},3.7815116499727958E-5,{"v":34.143327309406075,"d":"34.1"},12.1,513]
[null,{"v":0.6,"d":"60%"},6,{"$f":"(X37*($T$11^$Q37))*Watts*CF_Altit","v":{"v":3186.0571968657455,"d":"3186"}},{"$f":"ROUND(((D37/Watts)/(($S$9-$S$10)*1.163))*$E$14,IF($X$4=1,0,IF($X$4=2,2)))","v":274},{"$f":"($Y$36*(E37/$E$14)^$Y$38)*$F$14","v":{"v":1.4905040937234273,"d":"1.49"}},{"$f":"(Z37*($W$11^R37))*Watts*CF_Altit","v":{"v":539.2383212015659,"d":"539"}},{"$f":"((G37/Watts)/(IF((237.3*LN((RH*EXP(17.27*(Tl_cool/(Tl_cool+237.3))))))/(17.27-LN((RH*EXP(17.27*(Tl_cool/(Tl_cool+237.3))))))<Tavg_cold,1,IF(1/(1+((2258*((0.622/(($Z$11/(1*611*EXP(17.27*(Tavg_cold/(Tavg_cold+237.3))))))-1)*1000-(0.622/(($Z$11/(RH*611*EXP(17.27*(Tl_cool/(Tl_cool+237.3))))))-1)*1000))/(1005*(Tavg_cold-Tl_cool))))*1.039+((-0.000729*$C37+0.001448)*(Tl_cool-Tavg_cold)+(0.016908*$C37-0.033574))*1.039>1,1,1/(1+((2258*((0.622/(($Z$11/(1*611*EXP(17.27*(Tavg_cold/(Tavg_cold+237.3))))))-1)*1000-(0.622/(($Z$11/(RH*611*EXP(17.27*(Tl_cool/(Tl_cool+237.3))))))-1)*1000))/(1005*(Tavg_cold-Tl_cool))))*1.039+((-0.000729*$C37+0.001448)*(Tl_cool-Tavg_cold)+(0.016908*$C37-0.033574))*1.039))))*Watts","v":{"v":539.2383212015659,"d":"539"}},{"$f":"ROUND(((H37/Watts)/((Tr_cool-Tv_cool)*1.163))*$I$14,IF($X$4=1,0,IF($X$4=2,2)))","v":232},{"$f":"($AA$36*(I37/$I$14)^$AA$38)*$J$14","v":{"v":1.093400589676547,"d":"1.09"}},{"$f":"L37-8","v":{"v":31,"d":"31.0"}},{"v":39,"d":"39.0"},6.4,{"$f":"AD37*Cubics","v":218},{"$f":"((($D37/Watts)/(((p_atm*0.028964)/(8.31447*(20+273.15)))*(($N37/3600)/Cubics)*(1005+1870*((0.622)/(((p_atm)/($E$12*Pvs_Heat_in))-1)))))+Tl_heat)*Celc1+Celc2","v":{"v":62.899562447408876,"d":"63"}},{"$f":"(Tl_cool-(($G37/Watts)/(1006*$N37*kgss)))*Celc1+Celc2","v":{"v":19.648054356033178,"d":"20"}},1,{"v":0.8831,"d":"0.883"},{"v":0.79,"d":"0.790"},0.95,{"v":0.8831,"d":"0.883"},0.882,{"$f":"(H37-G37)/H37","v":{"v":0,"d":"0.0%"}},3186.0571968657455,"b",539.2383212015659,"b",{"v":39,"d":"39.0"},6.4,218,3082,"b",458,"b",{"v":40,"d":"40.0"},5.4,196,{"$f":"AE37","v":3082},"b",458,"b",{"v":40,"d":"40.0"},5.4,196,null,{"$f":"(AG37*((((Tv_cool-Tr_cool)/LN((Tv_cool-Tl_cool)/(Tr_cool-Tl_cool)))/((16-18)/LN((16-27)/(18-27))))^S37))*$G$14","v":0.15317555555555537},{"$f":"((AT37/$G$14)/(IF((237.3*LN((RH*EXP(17.27*(Tl_cool/(Tl_cool+237.3))))))/(17.27-LN((RH*EXP(17.27*(Tl_cool/(Tl_cool+237.3))))))<((Tv_cool+Tr_cool)/2),1,1/(1+((2258*((0.622/((p_atm/(1*611*EXP(17.27*(((Tv_cool+Tr_cool)/2)/(((Tv_cool+Tr_cool)/2)+237.3))))))-1)*1000-(0.622/((p_atm/(RH*611*EXP(17.27*(Tl_cool/(Tl_cool+237.3))))))-1)*1000))/(1005*(((Tv_cool+Tr_cool)/2)-Tl_cool))))+-((-0.000625*$C37+0.00625)*(Tl_cool-(Tv_cool+Tr_cool)/2)-(-0.000625*$C37+0.00625)*10))))*$H$14","v":458.00000000000006},null,2967,"b",480,"b",{"v":40,"d":"40.0"},7.2,246,2331.9812699999998,"b",521.2561270871641,"b",{"v":39,"d":"39.0"},6.4,218,3186.0571968657455,"b",539.2383212015659,"b",{"v":39,"d":"39.0"},6.4,218,null,6176.25301122087,"b",1556.2652210509953,"b",{"v":40.123455182150146,"d":"40.1"},21.7,732,9264.379516831304,"b",1711.8917431560951,"b",{"v":40.123455182150146,"d":"40.1"},21.7,732,null,5558.627710098783,"b",1400.6386989458958,"b",{"v":40.123455182150146,"d":"40.1"},21.7,732,8337.941565148174,"b",1540.7025688404856,"b",{"v":40.123455182150146,"d":"40.1"},21.7,732]
[null,{"v":0.8,"d":"80%"},8,{"$f":"(X38*($T$11^$Q38))*Watts*CF_Altit","v":{"v":4112.760475939822,"d":"4113"}},{"$f":"ROUND(((D38/Watts)/(($S$9-$S$10)*1.163))*$E$14,IF($X$4=1,0,IF($X$4=2,2)))","v":354},{"$f":"($Y$36*(E38/$E$14)^$Y$38)*$F$14","v":{"v":2.401525268594161,"d":"2.40"}},{"$f":"(Z38*($W$11^R38))*Watts*CF_Altit","v":{"v":692.9252120314776,"d":"693"}},{"$f":"((G38/Watts)/(IF((237.3*LN((RH*EXP(17.27*(Tl_cool/(Tl_cool+237.3))))))/(17.27-LN((RH*EXP(17.27*(Tl_cool/(Tl_cool+237.3))))))<Tavg_cold,1,IF(1/(1+((2258*((0.622/(($Z$11/(1*611*EXP(17.27*(Tavg_cold/(Tavg_cold+237.3))))))-1)*1000-(0.622/(($Z$11/(RH*611*EXP(17.27*(Tl_cool/(Tl_cool+237.3))))))-1)*1000))/(1005*(Tavg_cold-Tl_cool))))*1.039+((-0.000729*$C38+0.001448)*(Tl_cool-Tavg_cold)+(0.016908*$C38-0.033574))*1.039>1,1,1/(1+((2258*((0.622/(($Z$11/(1*611*EXP(17.27*(Tavg_cold/(Tavg_cold+237.3))))))-1)*1000-(0.622/(($Z$11/(RH*611*EXP(17.27*(Tl_cool/(Tl_cool+237.3))))))-1)*1000))/(1005*(Tavg_cold-Tl_cool))))*1.039+((-0.000729*$C38+0.001448)*(Tl_cool-Tavg_cold)+(0.016908*$C38-0.033574))*1.039))))*Watts","v":{"v":692.9252120314776,"d":"693"}},{"$f":"ROUND(((H38/Watts)/((Tr_cool-Tv_cool)*1.163))*$I$14,IF($X$4=1,0,IF($X$4=2,2)))","v":298},{"$f":"($AA$36*(I38/$I$14)^$AA$38)*$J$14","v":{"v":1.7427407566624442,"d":"1.74"}},{"$f":"L38-8","v":38.5},46.5,12.3,{"$f":"AD38*Cubics","v":285},{"$f":"((($D38/Watts)/(((p_atm*0.028964)/(8.31447*(20+273.15)))*(($N38/3600)/Cubics)*(1005+1870*((0.622)/(((p_atm)/($E$12*Pvs_Heat_in))-1)))))+Tl_heat)*Celc1+Celc2","v":{"v":62.358867991512604,"d":"62"}},{"$f":"(Tl_cool-(($G38/Watts)/(1006*$N38*kgss)))*Celc1+Celc2","v":{"v":19.773640944699228,"d":"20"}},1,{"v":0.8539,"d":"0.854"},{"v":0.87,"d":"0.870"},{"v":0.95,"d":"0.950"},{"v":0.8539,"d":"0.854"},0.895,{"$f":"(H38-G38)/H38","v":{"v":0,"d":"0.0%"}},4112.760475939822,1.862013136789098,692.9252120314776,1.862013136789098,46.5,12.3,285,3929,1.8235155847906248,634,{"$f":"AF38","v":1.8235155847906248},{"v":45,"d":"45.0"},9.1,250,{"$f":"AE38","v":3929},{"$f":"AH38","v":1.8235155847906248},634,{"$f":"AM38","v":1.8235155847906248},{"v":45,"d":"45.0"},9.1,250,null,{"$f":"(AG38*((((Tv_cool-Tr_cool)/LN((Tv_cool-Tl_cool)/(Tr_cool-Tl_cool)))/((16-18)/LN((16-27)/(18-27))))^S38))*$G$14","v":0.2120377777777775},{"$f":"((AT38/$G$14)/(IF((237.3*LN((RH*EXP(17.27*(Tl_cool/(Tl_cool+237.3))))))/(17.27-LN((RH*EXP(17.27*(Tl_cool/(Tl_cool+237.3))))))<((Tv_cool+Tr_cool)/2),1,1/(1+((2258*((0.622/((p_atm/(1*611*EXP(17.27*(((Tv_cool+Tr_cool)/2)/(((Tv_cool+Tr_cool)/2)+237.3))))))-1)*1000-(0.622/((p_atm/(RH*611*EXP(17.27*(Tl_cool/(Tl_cool+237.3))))))-1)*1000))/(1005*(((Tv_cool+Tr_cool)/2)-Tl_cool))))+-((-0.000625*$C38+0.00625)*(Tl_cool-(Tv_cool+Tr_cool)/2)-(-0.000625*$C38+0.00625)*10))))*$H$14","v":634},null,3635,1.8,643,2,{"v":47,"d":"47.0"},{"v":13,"d":"13.0"},336,2864.9607299999993,1.87032,675.6701197314438,1.93414116292526,46.5,12.3,285,4112.760475939822,1.862013136789098,692.9252120314776,{"$f":"BL38","v":1.862013136789098},46.5,12.3,285,null,7463.892526354828,2,2054.9776961431044,2,{"v":48.13283624289413,"d":"48.1"},{"v":37,"d":"37.0"},969,11195.838789532243,2,2260.475465757415,2,{"v":48.13283624289413,"d":"48.1"},{"v":37,"d":"37.0"},969,null,6717.503273719345,2,1849.479926528794,2,{"v":48.13283624289413,"d":"48.1"},{"v":37,"d":"37.0"},969,10076.254910579019,2,2034.4279191816734,2,{"v":48.13283624289413,"d":"48.1"},{"v":37,"d":"37.0"},969]
[null,{"v":1,"d":"100%"},10,{"$f":"(X39*($T$11^$Q39))*Watts*CF_Altit","v":{"v":4917.364481636897,"d":"4917"}},{"$f":"ROUND(((D39/Watts)/(($S$9-$S$10)*1.163))*$E$14,IF($X$4=1,0,IF($X$4=2,2)))","v":423},{"$f":"($Y$36*(E39/$E$14)^$Y$38)*$F$14","v":{"v":3.345722112767969,"d":"3.35"}},{"$f":"(Z39*($W$11^R39))*Watts*CF_Altit","v":{"v":838.6394403618914,"d":"839"}},{"$f":"((G39/Watts)/(IF((237.3*LN((RH*EXP(17.27*(Tl_cool/(Tl_cool+237.3))))))/(17.27-LN((RH*EXP(17.27*(Tl_cool/(Tl_cool+237.3))))))<Tavg_cold,1,IF(1/(1+((2258*((0.622/(($Z$11/(1*611*EXP(17.27*(Tavg_cold/(Tavg_cold+237.3))))))-1)*1000-(0.622/(($Z$11/(RH*611*EXP(17.27*(Tl_cool/(Tl_cool+237.3))))))-1)*1000))/(1005*(Tavg_cold-Tl_cool))))*1.039+((-0.000729*$C39+0.001448)*(Tl_cool-Tavg_cold)+(0.016908*$C39-0.033574))*1.039>1,1,1/(1+((2258*((0.622/(($Z$11/(1*611*EXP(17.27*(Tavg_cold/(Tavg_cold+237.3))))))-1)*1000-(0.622/(($Z$11/(RH*611*EXP(17.27*(Tl_cool/(Tl_cool+237.3))))))-1)*1000))/(1005*(Tavg_cold-Tl_cool))))*1.039+((-0.000729*$C39+0.001448)*(Tl_cool-Tavg_cold)+(0.016908*$C39-0.033574))*1.039))))*Watts","v":{"v":838.6394403618914,"d":"839"}},{"$f":"ROUND(((H39/Watts)/((Tr_cool-Tv_cool)*1.163))*$I$14,IF($X$4=1,0,IF($X$4=2,2)))","v":361},{"$f":"($AA$36*(I39/$I$14)^$AA$38)*$J$14","v":{"v":2.490701075978425,"d":"2.49"}},{"$f":"L39-8","v":41.5},49.5,19.1,{"$f":"AD39*Cubics","v":339},{"$f":"((($D39/Watts)/(((p_atm*0.028964)/(8.31447*(20+273.15)))*(($N39/3600)/Cubics)*(1005+1870*((0.622)/(((p_atm)/($E$12*Pvs_Heat_in))-1)))))+Tl_heat)*Celc1+Celc2","v":{"v":62.5783168922693,"d":"63"}},{"$f":"(Tl_cool-(($G39/Watts)/(1006*$N39*kgss)))*Celc1+Celc2","v":{"v":19.64718535847603,"d":"20"}},1,{"v":0.7711,"d":"0.771"},{"v":0.91,"d":"0.910"},{"v":0.98,"d":"0.980"},{"v":0.7711,"d":"0.771"},{"v":0.9111,"d":"0.911"},{"$f":"(H39-G39)/H39","v":{"v":0,"d":"0.0%"}},4917.364481636897,0,838.6394403618914,0,49.5,19.1,339,4744,null,816,null,{"v":49,"d":"49.0"},14.1,320,{"$f":"AE39","v":4744},null,816,null,{"v":49,"d":"49.0"},14.1,320,null,{"$f":"(AG39*((((Tv_cool-Tr_cool)/LN((Tv_cool-Tl_cool)/(Tr_cool-Tl_cool)))/((16-18)/LN((16-27)/(18-27))))^S39))*$G$14","v":0.2729066666666663},{"$f":"((AT39/$G$14)/(IF((237.3*LN((RH*EXP(17.27*(Tl_cool/(Tl_cool+237.3))))))/(17.27-LN((RH*EXP(17.27*(Tl_cool/(Tl_cool+237.3))))))<((Tv_cool+Tr_cool)/2),1,1/(1+((2258*((0.622/((p_atm/(1*611*EXP(17.27*(((Tv_cool+Tr_cool)/2)/(((Tv_cool+Tr_cool)/2)+237.3))))))-1)*1000-(0.622/((p_atm/(RH*611*EXP(17.27*(Tl_cool/(Tl_cool+237.3))))))-1)*1000))/(1005*(((Tv_cool+Tr_cool)/2)-Tl_cool))))+-((-0.000625*$C39+0.00625)*(Tl_cool-(Tv_cool+Tr_cool)/2)-(-0.000625*$C39+0.00625)*10))))*$H$14","v":816},null,4255,null,808,null,50.1,19.7,404,3252.270149999999,null,825.8272994976741,null,49.5,19.1,339,4917.364481636897,null,838.6394403618914,null,49.5,19.1,339,null,8644.819081984571,null,2549.4560787075484,null,{"v":53.1316080911098,"d":"53.1"},53.8,1103,12967.228622976858,null,2804.4016865783037,null,{"v":53.1316080911098,"d":"53.1"},53.8,1103,null,7780.337173786114,null,2294.5104708367935,null,{"v":53.1316080911098,"d":"53.1"},53.8,1103,11670.505760679172,null,2523.9615179204734,null,{"v":53.1316080911098,"d":"53.1"},53.8,1103]
[null,{"$f":"IF($S$7=1,NL!A39,IF(cal!$S$7=2,EN!A39,IF(cal!$S$7=3,DE!A39,IF(cal!$S$7=4,FR!A39,IF(cal!$S$7=5,NR!A39,IF(cal!$S$7=6,SP!A39,IF(cal!$S$7=7,SW!A39,IF(cal!$S$7=8,TS!A39,IF(cal!$S$7=9,ExtraTaal1!A39,IF(cal!$S$7=10,ExtraTaal2!A39,IF(cal!$S$7=11,ExtraTaal3!A39,)))))))))))","v":"Clima Canal height 13 cm width 32 cm length 170 cm (Type 5)"},{"$f":"IF($S$7=1,NL!B39,IF(cal!$S$7=2,EN!B39,IF(cal!$S$7=3,DE!B39,IF(cal!$S$7=4,FR!B39,IF(cal!$S$7=5,NR!B39,IF(cal!$S$7=6,SP!B39,IF(cal!$S$7=7,SW!B39,IF(cal!$S$7=8,TS!B39,IF(cal!$S$7=9,ExtraTaal1!B39,IF(cal!$S$7=10,ExtraTaal2!B39,IF(cal!$S$7=11,ExtraTaal3!B39,)))))))))))","v":0},{"$f":"IF($S$7=1,NL!C39,IF(cal!$S$7=2,EN!C39,IF(cal!$S$7=3,DE!C39,IF(cal!$S$7=4,FR!C39,IF(cal!$S$7=5,NR!C39,IF(cal!$S$7=6,SP!C39,IF(cal!$S$7=7,SW!C39,IF(cal!$S$7=8,TS!C39,IF(cal!$S$7=9,ExtraTaal1!C39,IF(cal!$S$7=10,ExtraTaal2!C39,IF(cal!$S$7=11,ExtraTaal3!C39,)))))))))))","v":0},{"$f":"IF($S$7=1,NL!D39,IF(cal!$S$7=2,EN!D39,IF(cal!$S$7=3,DE!D39,IF(cal!$S$7=4,FR!D39,IF(cal!$S$7=5,NR!D39,IF(cal!$S$7=6,SP!D39,IF(cal!$S$7=7,SW!D39,IF(cal!$S$7=8,TS!D39,IF(cal!$S$7=9,ExtraTaal1!D39,IF(cal!$S$7=10,ExtraTaal2!D39,IF(cal!$S$7=11,ExtraTaal3!D39,)))))))))))","v":0},{"$f":"IF($S$7=1,NL!E39,IF(cal!$S$7=2,EN!E39,IF(cal!$S$7=3,DE!E39,IF(cal!$S$7=4,FR!E39,IF(cal!$S$7=5,NR!E39,IF(cal!$S$7=6,SP!E39,IF(cal!$S$7=7,SW!E39,IF(cal!$S$7=8,TS!E39,IF(cal!$S$7=9,ExtraTaal1!E39,IF(cal!$S$7=10,ExtraTaal2!E39,IF(cal!$S$7=11,ExtraTaal3!E39,)))))))))))","v":0},{"$f":"IF($S$7=1,NL!F39,IF(cal!$S$7=2,EN!F39,IF(cal!$S$7=3,DE!F39,IF(cal!$S$7=4,FR!F39,IF(cal!$S$7=5,NR!F39,IF(cal!$S$7=6,SP!F39,IF(cal!$S$7=7,SW!F39,IF(cal!$S$7=8,TS!F39,IF(cal!$S$7=9,ExtraTaal1!F39,IF(cal!$S$7=10,ExtraTaal2!F39,IF(cal!$S$7=11,ExtraTaal3!F39,)))))))))))","v":0},{"$f":"IF($S$7=1,NL!G39,IF(cal!$S$7=2,EN!G39,IF(cal!$S$7=3,DE!G39,IF(cal!$S$7=4,FR!G39,IF(cal!$S$7=5,NR!G39,IF(cal!$S$7=6,SP!G39,IF(cal!$S$7=7,SW!G39,IF(cal!$S$7=8,TS!G39,IF(cal!$S$7=9,ExtraTaal1!G39,IF(cal!$S$7=10,ExtraTaal2!G39,IF(cal!$S$7=11,ExtraTaal3!G39,)))))))))))","v":0},{"$f":"IF($S$7=1,NL!H39,IF(cal!$S$7=2,EN!H39,IF(cal!$S$7=3,DE!H39,IF(cal!$S$7=4,FR!H39,IF(cal!$S$7=5,NR!H39,IF(cal!$S$7=6,SP!H39,IF(cal!$S$7=7,SW!H39,IF(cal!$S$7=8,TS!H39,IF(cal!$S$7=9,ExtraTaal1!H39,IF(cal!$S$7=10,ExtraTaal2!H39,IF(cal!$S$7=11,ExtraTaal3!H39,)))))))))))","v":0},{"$f":"IF($S$7=1,NL!I39,IF(cal!$S$7=2,EN!I39,IF(cal!$S$7=3,DE!I39,IF(cal!$S$7=4,FR!I39,IF(cal!$S$7=5,NR!I39,IF(cal!$S$7=6,SP!I39,IF(cal!$S$7=7,SW!I39,IF(cal!$S$7=8,TS!I39,IF(cal!$S$7=9,ExtraTaal1!I39,IF(cal!$S$7=10,ExtraTaal2!I39,IF(cal!$S$7=11,ExtraTaal3!I39,)))))))))))","v":0},{"$f":"IF($S$7=1,NL!J39,IF(cal!$S$7=2,EN!J39,IF(cal!$S$7=3,DE!J39,IF(cal!$S$7=4,FR!J39,IF(cal!$S$7=5,NR!J39,IF(cal!$S$7=6,SP!J39,IF(cal!$S$7=7,SW!J39,IF(cal!$S$7=8,TS!J39,IF(cal!$S$7=9,ExtraTaal1!J39,IF(cal!$S$7=10,ExtraTaal2!J39,IF(cal!$S$7=11,ExtraTaal3!J39,)))))))))))","v":0},{"$f":"IF($S$7=1,NL!K39,IF(cal!$S$7=2,EN!K39,IF(cal!$S$7=3,DE!K39,IF(cal!$S$7=4,FR!K39,IF(cal!$S$7=5,NR!K39,IF(cal!$S$7=6,SP!K39,IF(cal!$S$7=7,SW!K39,IF(cal!$S$7=8,TS!K39,IF(cal!$S$7=9,ExtraTaal1!K39,IF(cal!$S$7=10,ExtraTaal2!K39,IF(cal!$S$7=11,ExtraTaal3!K39,)))))))))))","v":0},{"$f":"IF($S$7=1,NL!L39,IF(cal!$S$7=2,EN!L39,IF(cal!$S$7=3,DE!L39,IF(cal!$S$7=4,FR!L39,IF(cal!$S$7=5,NR!L39,IF(cal!$S$7=6,SP!L39,IF(cal!$S$7=7,SW!L39,IF(cal!$S$7=8,TS!L39,IF(cal!$S$7=9,ExtraTaal1!L39,IF(cal!$S$7=10,ExtraTaal2!L39,IF(cal!$S$7=11,ExtraTaal3!L39,)))))))))))","v":0},{"$f":"IF($S$7=1,NL!M39,IF(cal!$S$7=2,EN!M39,IF(cal!$S$7=3,DE!M39,IF(cal!$S$7=4,FR!M39,IF(cal!$S$7=5,NR!M39,IF(cal!$S$7=6,SP!M39,IF(cal!$S$7=7,SW!M39,IF(cal!$S$7=8,TS!M39,IF(cal!$S$7=9,ExtraTaal1!M39,IF(cal!$S$7=10,ExtraTaal2!M39,IF(cal!$S$7=11,ExtraTaal3!M39,)))))))))))","v":0},{"$f":"IF($S$7=1,NL!N39,IF(cal!$S$7=2,EN!N39,IF(cal!$S$7=3,DE!N39,IF(cal!$S$7=4,FR!N39,IF(cal!$S$7=5,NR!N39,IF(cal!$S$7=6,SP!N39,IF(cal!$S$7=7,SW!N39,IF(cal!$S$7=8,TS!N39,IF(cal!$S$7=9,ExtraTaal1!N39,IF(cal!$S$7=10,ExtraTaal2!N39,IF(cal!$S$7=11,ExtraTaal3!N39,)))))))))))","v":0},{"$f":"IF($S$7=1,NL!O39,IF(cal!$S$7=2,EN!O39,IF(cal!$S$7=3,DE!O39,IF(cal!$S$7=4,FR!O39,IF(cal!$S$7=5,NR!O39,IF(cal!$S$7=6,SP!O39,IF(cal!$S$7=7,SW!O39,IF(cal!$S$7=8,TS!O39,IF(cal!$S$7=9,ExtraTaal1!O39,IF(cal!$S$7=10,ExtraTaal2!O39,IF(cal!$S$7=11,ExtraTaal3!O39,)))))))))))","v":0},"n-value","n-value","n-value","n-value","n-value","n-value",null,"H",13,"B",32,"L",140,0,"H",{"$f":"AF34","v":8},"B",{"$f":"AH34","v":18},"L",{"$f":"180*IF($X$4=1,1,IF($X$4=2,1/2.54))","v":180},null,"H",{"$f":"AM34","v":10},"B",{"$f":"AO34","v":18},"L",{"$f":"AJ40","v":180},{"$nulls":5},"H",{"$f":"AX22","v":13},"B",{"$f":"AZ22","v":27},"L",{"$f":"IF($X$4=1,180.3,180.3/2.54)","v":180.3},null,"H",{"$f":"BE22","v":13},"B",{"$f":"BG22","v":32},"L",{"$f":"IF($X$4=1,140,140/2.54)","v":140},null,"H",{"$f":"BL22","v":13},"B",{"$f":"BN22","v":32},"L",{"$f":"IF($X$4=1,140,140/2.54)","v":140},null,null,"H",{"$f":"BT34","v":19},"B",{"$f":"BV34","v":34},"L",{"$f":"280*IF($X$4=1,1,IF($X$4=2,1/2.54))","v":280},null,"H",{"$f":"CA34","v":19},"B",{"$f":"CC34","v":34},"L",{"$f":"BX40","v":280},null,null,"H",{"$f":"CI34","v":15},"B",{"$f":"CK34","v":32},"L",{"$f":"280*IF($X$4=1,1,IF($X$4=2,1/2.54))","v":280},null,"H",{"$f":"CP34","v":15},"B",{"$f":"CR34","v":32},"L",{"$f":"CM40","v":280}]
[null,{"v":0.2,"d":"20%"},2,{"$f":"(X41*($T$11^$Q41))*Watts*CF_Altit","v":{"v":1246.4550848435726,"d":"1246"}},{"$f":"ROUND(((D41/Watts)/(($S$9-$S$10)*1.163))*$E$14,IF($X$4=1,0,IF($X$4=2,2)))","v":107},{"$f":"($Y$42*(E41/$E$14)^$Y$44)*$F$14","v":{"v":0.30178323793610806,"d":"0.30"}},{"$f":"(Z41*($W$11^R41))*Watts*CF_Altit","v":{"v":268.2209149543352,"d":"268"}},{"$f":"((G41/Watts)/(IF((237.3*LN((RH*EXP(17.27*(Tl_cool/(Tl_cool+237.3))))))/(17.27-LN((RH*EXP(17.27*(Tl_cool/(Tl_cool+237.3))))))<Tavg_cold,1,IF(1/(1+((2258*((0.622/(($Z$11/(1*611*EXP(17.27*(Tavg_cold/(Tavg_cold+237.3))))))-1)*1000-(0.622/(($Z$11/(RH*611*EXP(17.27*(Tl_cool/(Tl_cool+237.3))))))-1)*1000))/(1005*(Tavg_cold-Tl_cool))))*1.039+((-0.000729*$C41+0.001448)*(Tl_cool-Tavg_cold)+(0.016908*$C41-0.033574))*1.039>1,1,1/(1+((2258*((0.622/(($Z$11/(1*611*EXP(17.27*(Tavg_cold/(Tavg_cold+237.3))))))-1)*1000-(0.622/(($Z$11/(RH*611*EXP(17.27*(Tl_cool/(Tl_cool+237.3))))))-1)*1000))/(1005*(Tavg_cold-Tl_cool))))*1.039+((-0.000729*$C41+0.001448)*(Tl_cool-Tavg_cold)+(0.016908*$C41-0.033574))*1.039))))*Watts","v":{"v":268.2209149543352,"d":"268"}},{"$f":"ROUND(((H41/Watts)/((Tr_cool-Tv_cool)*1.163))*$I$14,IF($X$4=1,0,IF($X$4=2,2)))","v":115},{"$f":"($AA$42*(I41/$I$14)^$AA$44)*$J$14","v":{"v":0.34476285752532837,"d":"0.34"}},{"$f":"L41-8","v":{"v":22,"d":"22.0"}},{"$f":"AB41","v":{"v":30,"d":"30.0"}},{"v":2.384,"d":"2.4"},{"$f":"AD41*Cubics","v":84},{"$f":"((($D41/Watts)/(((p_atm*0.028964)/(8.31447*(20+273.15)))*(($N41/3600)/Cubics)*(1005+1870*((0.622)/(((p_atm)/($E$12*Pvs_Heat_in))-1)))))+Tl_heat)*Celc1+Celc2","v":{"v":63.55651615941959,"d":"64"}},{"$f":"(Tl_cool-(($G41/Watts)/(1006*$N41*kgss)))*Celc1+Celc2","v":{"v":17.509449887492714,"d":"18"}},1,{"v":0.7807,"d":"0.781"},0,0,{"v":0.7807,"d":"0.781"},0,{"$f":"(H41-G41)/H41","v":{"v":0,"d":"0.0%"}},1246.4550848435726,"a",268.2209149543352,"a",{"v":30,"d":"30.0"},{"v":2.384,"d":"2.4"},84,{"$nulls":25},1069.3056299999998,"a",257.52950118313976,"a",{"v":30,"d":"30.0"},{"v":2.384,"d":"2.4"},84,1246.4550848435726,"a",268.2209149543352,"a",{"$f":"BH41","v":{"v":30,"d":"30.0"}},{"v":2.384,"d":"2.4"},84]
[null,{"v":0.4,"d":"40%"},4,{"$f":"(X42*($T$11^$Q42))*Watts*CF_Altit","v":{"v":2756.748744245007,"d":"2757"}},{"$f":"ROUND(((D42/Watts)/(($S$9-$S$10)*1.163))*$E$14,IF($X$4=1,0,IF($X$4=2,2)))","v":237},{"$f":"($Y$42*(E42/$E$14)^$Y$44)*$F$14","v":{"v":1.3105519923123687,"d":"1.31"}},{"$f":"(Z42*($W$11^R42))*Watts*CF_Altit","v":{"v":487.02188899452034,"d":"487"}},{"$f":"((G42/Watts)/(IF((237.3*LN((RH*EXP(17.27*(Tl_cool/(Tl_cool+237.3))))))/(17.27-LN((RH*EXP(17.27*(Tl_cool/(Tl_cool+237.3))))))<Tavg_cold,1,IF(1/(1+((2258*((0.622/(($Z$11/(1*611*EXP(17.27*(Tavg_cold/(Tavg_cold+237.3))))))-1)*1000-(0.622/(($Z$11/(RH*611*EXP(17.27*(Tl_cool/(Tl_cool+237.3))))))-1)*1000))/(1005*(Tavg_cold-Tl_cool))))*1.039+((-0.000729*$C42+0.001448)*(Tl_cool-Tavg_cold)+(0.016908*$C42-0.033574))*1.039>1,1,1/(1+((2258*((0.622/(($Z$11/(1*611*EXP(17.27*(Tavg_cold/(Tavg_cold+237.3))))))-1)*1000-(0.622/(($Z$11/(RH*611*EXP(17.27*(Tl_cool/(Tl_cool+237.3))))))-1)*1000))/(1005*(Tavg_cold-Tl_cool))))*1.039+((-0.000729*$C42+0.001448)*(Tl_cool-Tavg_cold)+(0.016908*$C42-0.033574))*1.039))))*Watts","v":{"v":487.02188899452034,"d":"487"}},{"$f":"ROUND(((H42/Watts)/((Tr_cool-Tv_cool)*1.163))*$I$14,IF($X$4=1,0,IF($X$4=2,2)))","v":209},{"$f":"($AA$42*(I42/$I$14)^$AA$44)*$J$14","v":{"v":1.0390218472959192,"d":"1.04"}},{"$f":"L42-8","v":{"v":27,"d":"27.0"}},{"v":35,"d":"35.0"},{"v":4.032,"d":"4.0"},{"$f":"AD42*Cubics","v":158},{"$f":"((($D42/Watts)/(((p_atm*0.028964)/(8.31447*(20+273.15)))*(($N42/3600)/Cubics)*(1005+1870*((0.622)/(((p_atm)/($E$12*Pvs_Heat_in))-1)))))+Tl_heat)*Celc1+Celc2","v":{"v":71.21484782208647,"d":"71"}},{"$f":"(Tl_cool-(($G42/Watts)/(1006*$N42*kgss)))*Celc1+Celc2","v":{"v":17.838440067048218,"d":"18"}},1,{"v":0.8587,"d":"0.859"},0,0,{"v":0.8587,"d":"0.859"},0,{"$f":"(H42-G42)/H42","v":{"v":0,"d":"0.0%"}},2756.748744245007,5.3973746074995627E-5,487.02188899452034,5.3973746074995627E-5,{"v":35,"d":"35.0"},{"v":4.032,"d":"4.0"},158,{"$nulls":25},2132.5583699999997,6.89335e-05,467.68251622130913,1.6396787877446146E-5,{"v":35,"d":"35.0"},{"v":4.032,"d":"4.0"},158,2756.748744245007,5.3973746074995627E-5,487.02188899452034,{"$f":"BL42","v":5.3973746074995627E-5},{"v":35,"d":"35.0"},{"v":4.032,"d":"4.0"},158]
[null,{"v":0.6,"d":"60%"},6,{"$f":"(X43*($T$11^$Q43))*Watts*CF_Altit","v":{"v":4109.552036536976,"d":"4110"}},{"$f":"ROUND(((D43/Watts)/(($S$9-$S$10)*1.163))*$E$14,IF($X$4=1,0,IF($X$4=2,2)))","v":353},{"$f":"($Y$42*(E43/$E$14)^$Y$44)*$F$14","v":{"v":2.7350747723074424,"d":"2.74"}},{"$f":"(Z43*($W$11^R43))*Watts*CF_Altit","v":{"v":695.5392838686865,"d":"696"}},{"$f":"((G43/Watts)/(IF((237.3*LN((RH*EXP(17.27*(Tl_cool/(Tl_cool+237.3))))))/(17.27-LN((RH*EXP(17.27*(Tl_cool/(Tl_cool+237.3))))))<Tavg_cold,1,IF(1/(1+((2258*((0.622/(($Z$11/(1*611*EXP(17.27*(Tavg_cold/(Tavg_cold+237.3))))))-1)*1000-(0.622/(($Z$11/(RH*611*EXP(17.27*(Tl_cool/(Tl_cool+237.3))))))-1)*1000))/(1005*(Tavg_cold-Tl_cool))))*1.039+((-0.000729*$C43+0.001448)*(Tl_cool-Tavg_cold)+(0.016908*$C43-0.033574))*1.039>1,1,1/(1+((2258*((0.622/(($Z$11/(1*611*EXP(17.27*(Tavg_cold/(Tavg_cold+237.3))))))-1)*1000-(0.622/(($Z$11/(RH*611*EXP(17.27*(Tl_cool/(Tl_cool+237.3))))))-1)*1000))/(1005*(Tavg_cold-Tl_cool))))*1.039+((-0.000729*$C43+0.001448)*(Tl_cool-Tavg_cold)+(0.016908*$C43-0.033574))*1.039))))*Watts","v":{"v":695.5392838686865,"d":"696"}},{"$f":"ROUND(((H43/Watts)/((Tr_cool-Tv_cool)*1.163))*$I$14,IF($X$4=1,0,IF($X$4=2,2)))","v":299},{"$f":"($AA$42*(I43/$I$14)^$AA$44)*$J$14","v":{"v":2.0128943688264105,"d":"2.01"}},{"$f":"L43-8","v":{"v":32,"d":"32.0"}},{"v":40,"d":"40.0"},7.4,{"$f":"AD43*Cubics","v":259},{"$f":"((($D43/Watts)/(((p_atm*0.028964)/(8.31447*(20+273.15)))*(($N43/3600)/Cubics)*(1005+1870*((0.622)/(((p_atm)/($E$12*Pvs_Heat_in))-1)))))+Tl_heat)*Celc1+Celc2","v":{"v":66.57474738988455,"d":"67"}},{"$f":"(Tl_cool-(($G43/Watts)/(1006*$N43*kgss)))*Celc1+Celc2","v":{"v":19.018216698324416,"d":"19"}},1,{"v":0.8831,"d":"0.883"},0,0,{"v":0.8831,"d":"0.883"},0,{"$f":"(H43-G43)/H43","v":{"v":0,"d":"0.0%"}},4109.552036536976,"b",695.5392838686865,"b",{"v":40,"d":"40.0"},7.4,259,{"$nulls":25},3007.9178699999998,"b",672.3448595761973,"b",{"v":40,"d":"40.0"},7.4,259,4109.552036536976,"b",695.5392838686865,"b",{"v":40,"d":"40.0"},7.4,259]
[null,{"v":0.8,"d":"80%"},8,{"$f":"(X44*($T$11^$Q44))*Watts*CF_Altit","v":{"v":5304.864961719481,"d":"5305"}},{"$f":"ROUND(((D44/Watts)/(($S$9-$S$10)*1.163))*$E$14,IF($X$4=1,0,IF($X$4=2,2)))","v":456},{"$f":"($Y$42*(E44/$E$14)^$Y$44)*$F$14","v":{"v":4.3882947063228155,"d":"4.39"}},{"$f":"(Z44*($W$11^R44))*Watts*CF_Altit","v":{"v":893.7730995768335,"d":"894"}},{"$f":"((G44/Watts)/(IF((237.3*LN((RH*EXP(17.27*(Tl_cool/(Tl_cool+237.3))))))/(17.27-LN((RH*EXP(17.27*(Tl_cool/(Tl_cool+237.3))))))<Tavg_cold,1,IF(1/(1+((2258*((0.622/(($Z$11/(1*611*EXP(17.27*(Tavg_cold/(Tavg_cold+237.3))))))-1)*1000-(0.622/(($Z$11/(RH*611*EXP(17.27*(Tl_cool/(Tl_cool+237.3))))))-1)*1000))/(1005*(Tavg_cold-Tl_cool))))*1.039+((-0.000729*$C44+0.001448)*(Tl_cool-Tavg_cold)+(0.016908*$C44-0.033574))*1.039>1,1,1/(1+((2258*((0.622/(($Z$11/(1*611*EXP(17.27*(Tavg_cold/(Tavg_cold+237.3))))))-1)*1000-(0.622/(($Z$11/(RH*611*EXP(17.27*(Tl_cool/(Tl_cool+237.3))))))-1)*1000))/(1005*(Tavg_cold-Tl_cool))))*1.039+((-0.000729*$C44+0.001448)*(Tl_cool-Tavg_cold)+(0.016908*$C44-0.033574))*1.039))))*Watts","v":{"v":893.7730995768335,"d":"894"}},{"$f":"ROUND(((H44/Watts)/((Tr_cool-Tv_cool)*1.163))*$I$14,IF($X$4=1,0,IF($X$4=2,2)))","v":384},{"$f":"($AA$42*(I44/$I$14)^$AA$44)*$J$14","v":{"v":3.1950335051176335,"d":"3.20"}},{"$f":"L44-8","v":{"v":39,"d":"39.0"}},{"v":47,"d":"47.0"},{"v":13.100000000000001,"d":"13.1"},{"$f":"AD44*Cubics","v":352},{"$f":"((($D44/Watts)/(((p_atm*0.028964)/(8.31447*(20+273.15)))*(($N44/3600)/Cubics)*(1005+1870*((0.622)/(((p_atm)/($E$12*Pvs_Heat_in))-1)))))+Tl_heat)*Celc1+Celc2","v":{"v":64.23718241949592,"d":"64"}},{"$f":"(Tl_cool-(($G44/Watts)/(1006*$N44*kgss)))*Celc1+Celc2","v":{"v":19.45320333342786,"d":"19"}},1,{"v":0.8539,"d":"0.854"},0,0,{"v":0.8539,"d":"0.854"},0,{"$f":"(H44-G44)/H44","v":{"v":0,"d":"0.0%"}},5304.864961719481,1.8466258544050462,893.7730995768335,1.8466258544050462,{"v":47,"d":"47.0"},{"v":13.100000000000001,"d":"13.1"},352,{"$nulls":25},3695.3841299999995,1.85702,871.5165312478043,1.9273120813486124,{"v":47,"d":"47.0"},{"v":13.100000000000001,"d":"13.1"},352,5304.864961719481,1.8466258544050462,893.7730995768335,{"$f":"BL44","v":1.8466258544050462},{"v":47,"d":"47.0"},{"v":13.100000000000001,"d":"13.1"},352]
[null,{"v":1,"d":"100%"},10,{"$f":"(X45*($T$11^$Q45))*Watts*CF_Altit","v":{"v":6342.68751979252,"d":"6343"}},{"$f":"ROUND(((D45/Watts)/(($S$9-$S$10)*1.163))*$E$14,IF($X$4=1,0,IF($X$4=2,2)))","v":545},{"$f":"($Y$42*(E45/$E$14)^$Y$44)*$F$14","v":{"v":6.0993434733731355,"d":"6.10"}},{"$f":"(Z45*($W$11^R45))*Watts*CF_Altit","v":{"v":1081.7233361189615,"d":"1082"}},{"$f":"((G45/Watts)/(IF((237.3*LN((RH*EXP(17.27*(Tl_cool/(Tl_cool+237.3))))))/(17.27-LN((RH*EXP(17.27*(Tl_cool/(Tl_cool+237.3))))))<Tavg_cold,1,IF(1/(1+((2258*((0.622/(($Z$11/(1*611*EXP(17.27*(Tavg_cold/(Tavg_cold+237.3))))))-1)*1000-(0.622/(($Z$11/(RH*611*EXP(17.27*(Tl_cool/(Tl_cool+237.3))))))-1)*1000))/(1005*(Tavg_cold-Tl_cool))))*1.039+((-0.000729*$C45+0.001448)*(Tl_cool-Tavg_cold)+(0.016908*$C45-0.033574))*1.039>1,1,1/(1+((2258*((0.622/(($Z$11/(1*611*EXP(17.27*(Tavg_cold/(Tavg_cold+237.3))))))-1)*1000-(0.622/(($Z$11/(RH*611*EXP(17.27*(Tl_cool/(Tl_cool+237.3))))))-1)*1000))/(1005*(Tavg_cold-Tl_cool))))*1.039+((-0.000729*$C45+0.001448)*(Tl_cool-Tavg_cold)+(0.016908*$C45-0.033574))*1.039))))*Watts","v":{"v":1081.7233361189615,"d":"1082"}},{"$f":"ROUND(((H45/Watts)/((Tr_cool-Tv_cool)*1.163))*$I$14,IF($X$4=1,0,IF($X$4=2,2)))","v":465},{"$f":"($AA$42*(I45/$I$14)^$AA$44)*$J$14","v":{"v":4.549567886525208,"d":"4.55"}},{"$f":"L45-8","v":{"v":42,"d":"42.0"}},{"v":50,"d":"50.0"},19.4,{"$f":"AD45*Cubics","v":410},{"$f":"((($D45/Watts)/(((p_atm*0.028964)/(8.31447*(20+273.15)))*(($N45/3600)/Cubics)*(1005+1870*((0.622)/(((p_atm)/($E$12*Pvs_Heat_in))-1)))))+Tl_heat)*Celc1+Celc2","v":{"v":65.40934602179772,"d":"65"}},{"$f":"(Tl_cool-(($G45/Watts)/(1006*$N45*kgss)))*Celc1+Celc2","v":{"v":19.158297258769185,"d":"19"}},1,{"v":0.7711,"d":"0.771"},0,0,{"v":0.7711,"d":"0.771"},0,{"$f":"(H45-G45)/H45","v":{"v":0,"d":"0.0%"}},6342.68751979252,0,1081.7233361189615,0,{"v":50,"d":"50.0"},19.4,410,{"$nulls":25},4194.957149999998,null,1065.1975312361303,null,{"v":50,"d":"50.0"},19.4,410,6342.68751979252,null,1081.7233361189615,null,{"v":50,"d":"50.0"},19.4,410]
[null,{"$f":"IF($S$7=1,NL!A45,IF(cal!$S$7=2,EN!A45,IF(cal!$S$7=3,DE!A45,IF(cal!$S$7=4,FR!A45,IF(cal!$S$7=5,NR!A45,IF(cal!$S$7=6,SP!A45,IF(cal!$S$7=7,SW!A45,IF(cal!$S$7=8,TS!A45,IF(cal!$S$7=9,ExtraTaal1!A45,IF(cal!$S$7=10,ExtraTaal2!A45,IF(cal!$S$7=11,ExtraTaal3!A45,)))))))))))","v":"Clima Canal height 13 cm width 32 cm length 200 cm (Type 6)"},{"$f":"IF($S$7=1,NL!B45,IF(cal!$S$7=2,EN!B45,IF(cal!$S$7=3,DE!B45,IF(cal!$S$7=4,FR!B45,IF(cal!$S$7=5,NR!B45,IF(cal!$S$7=6,SP!B45,IF(cal!$S$7=7,SW!B45,IF(cal!$S$7=8,TS!B45,IF(cal!$S$7=9,ExtraTaal1!B45,IF(cal!$S$7=10,ExtraTaal2!B45,IF(cal!$S$7=11,ExtraTaal3!B45,)))))))))))","v":0},{"$f":"IF($S$7=1,NL!C45,IF(cal!$S$7=2,EN!C45,IF(cal!$S$7=3,DE!C45,IF(cal!$S$7=4,FR!C45,IF(cal!$S$7=5,NR!C45,IF(cal!$S$7=6,SP!C45,IF(cal!$S$7=7,SW!C45,IF(cal!$S$7=8,TS!C45,IF(cal!$S$7=9,ExtraTaal1!C45,IF(cal!$S$7=10,ExtraTaal2!C45,IF(cal!$S$7=11,ExtraTaal3!C45,)))))))))))","v":0},{"$f":"IF($S$7=1,NL!D45,IF(cal!$S$7=2,EN!D45,IF(cal!$S$7=3,DE!D45,IF(cal!$S$7=4,FR!D45,IF(cal!$S$7=5,NR!D45,IF(cal!$S$7=6,SP!D45,IF(cal!$S$7=7,SW!D45,IF(cal!$S$7=8,TS!D45,IF(cal!$S$7=9,ExtraTaal1!D45,IF(cal!$S$7=10,ExtraTaal2!D45,IF(cal!$S$7=11,ExtraTaal3!D45,)))))))))))","v":0},{"$f":"IF($S$7=1,NL!E45,IF(cal!$S$7=2,EN!E45,IF(cal!$S$7=3,DE!E45,IF(cal!$S$7=4,FR!E45,IF(cal!$S$7=5,NR!E45,IF(cal!$S$7=6,SP!E45,IF(cal!$S$7=7,SW!E45,IF(cal!$S$7=8,TS!E45,IF(cal!$S$7=9,ExtraTaal1!E45,IF(cal!$S$7=10,ExtraTaal2!E45,IF(cal!$S$7=11,ExtraTaal3!E45,)))))))))))","v":0},{"$f":"IF($S$7=1,NL!F45,IF(cal!$S$7=2,EN!F45,IF(cal!$S$7=3,DE!F45,IF(cal!$S$7=4,FR!F45,IF(cal!$S$7=5,NR!F45,IF(cal!$S$7=6,SP!F45,IF(cal!$S$7=7,SW!F45,IF(cal!$S$7=8,TS!F45,IF(cal!$S$7=9,ExtraTaal1!F45,IF(cal!$S$7=10,ExtraTaal2!F45,IF(cal!$S$7=11,ExtraTaal3!F45,)))))))))))","v":0},{"$f":"IF($S$7=1,NL!G45,IF(cal!$S$7=2,EN!G45,IF(cal!$S$7=3,DE!G45,IF(cal!$S$7=4,FR!G45,IF(cal!$S$7=5,NR!G45,IF(cal!$S$7=6,SP!G45,IF(cal!$S$7=7,SW!G45,IF(cal!$S$7=8,TS!G45,IF(cal!$S$7=9,ExtraTaal1!G45,IF(cal!$S$7=10,ExtraTaal2!G45,IF(cal!$S$7=11,ExtraTaal3!G45,)))))))))))","v":0},{"$f":"IF($S$7=1,NL!H45,IF(cal!$S$7=2,EN!H45,IF(cal!$S$7=3,DE!H45,IF(cal!$S$7=4,FR!H45,IF(cal!$S$7=5,NR!H45,IF(cal!$S$7=6,SP!H45,IF(cal!$S$7=7,SW!H45,IF(cal!$S$7=8,TS!H45,IF(cal!$S$7=9,ExtraTaal1!H45,IF(cal!$S$7=10,ExtraTaal2!H45,IF(cal!$S$7=11,ExtraTaal3!H45,)))))))))))","v":0},{"$f":"IF($S$7=1,NL!I45,IF(cal!$S$7=2,EN!I45,IF(cal!$S$7=3,DE!I45,IF(cal!$S$7=4,FR!I45,IF(cal!$S$7=5,NR!I45,IF(cal!$S$7=6,SP!I45,IF(cal!$S$7=7,SW!I45,IF(cal!$S$7=8,TS!I45,IF(cal!$S$7=9,ExtraTaal1!I45,IF(cal!$S$7=10,ExtraTaal2!I45,IF(cal!$S$7=11,ExtraTaal3!I45,)))))))))))","v":0},{"$f":"IF($S$7=1,NL!J45,IF(cal!$S$7=2,EN!J45,IF(cal!$S$7=3,DE!J45,IF(cal!$S$7=4,FR!J45,IF(cal!$S$7=5,NR!J45,IF(cal!$S$7=6,SP!J45,IF(cal!$S$7=7,SW!J45,IF(cal!$S$7=8,TS!J45,IF(cal!$S$7=9,ExtraTaal1!J45,IF(cal!$S$7=10,ExtraTaal2!J45,IF(cal!$S$7=11,ExtraTaal3!J45,)))))))))))","v":0},{"$f":"IF($S$7=1,NL!K45,IF(cal!$S$7=2,EN!K45,IF(cal!$S$7=3,DE!K45,IF(cal!$S$7=4,FR!K45,IF(cal!$S$7=5,NR!K45,IF(cal!$S$7=6,SP!K45,IF(cal!$S$7=7,SW!K45,IF(cal!$S$7=8,TS!K45,IF(cal!$S$7=9,ExtraTaal1!K45,IF(cal!$S$7=10,ExtraTaal2!K45,IF(cal!$S$7=11,ExtraTaal3!K45,)))))))))))","v":0},{"$f":"IF($S$7=1,NL!L45,IF(cal!$S$7=2,EN!L45,IF(cal!$S$7=3,DE!L45,IF(cal!$S$7=4,FR!L45,IF(cal!$S$7=5,NR!L45,IF(cal!$S$7=6,SP!L45,IF(cal!$S$7=7,SW!L45,IF(cal!$S$7=8,TS!L45,IF(cal!$S$7=9,ExtraTaal1!L45,IF(cal!$S$7=10,ExtraTaal2!L45,IF(cal!$S$7=11,ExtraTaal3!L45,)))))))))))","v":0},{"$f":"IF($S$7=1,NL!M45,IF(cal!$S$7=2,EN!M45,IF(cal!$S$7=3,DE!M45,IF(cal!$S$7=4,FR!M45,IF(cal!$S$7=5,NR!M45,IF(cal!$S$7=6,SP!M45,IF(cal!$S$7=7,SW!M45,IF(cal!$S$7=8,TS!M45,IF(cal!$S$7=9,ExtraTaal1!M45,IF(cal!$S$7=10,ExtraTaal2!M45,IF(cal!$S$7=11,ExtraTaal3!M45,)))))))))))","v":0},{"$f":"IF($S$7=1,NL!N45,IF(cal!$S$7=2,EN!N45,IF(cal!$S$7=3,DE!N45,IF(cal!$S$7=4,FR!N45,IF(cal!$S$7=5,NR!N45,IF(cal!$S$7=6,SP!N45,IF(cal!$S$7=7,SW!N45,IF(cal!$S$7=8,TS!N45,IF(cal!$S$7=9,ExtraTaal1!N45,IF(cal!$S$7=10,ExtraTaal2!N45,IF(cal!$S$7=11,ExtraTaal3!N45,)))))))))))","v":0},{"$f":"IF($S$7=1,NL!O45,IF(cal!$S$7=2,EN!O45,IF(cal!$S$7=3,DE!O45,IF(cal!$S$7=4,FR!O45,IF(cal!$S$7=5,NR!O45,IF(cal!$S$7=6,SP!O45,IF(cal!$S$7=7,SW!O45,IF(cal!$S$7=8,TS!O45,IF(cal!$S$7=9,ExtraTaal1!O45,IF(cal!$S$7=10,ExtraTaal2!O45,IF(cal!$S$7=11,ExtraTaal3!O45,)))))))))))","v":0},"n-value","n-value","n-value","n-value","n-value","n-value",null,"H",13,"B",32,"L",170,0,{"$nulls":25},"H",{"$f":"BE22","v":13},"B",{"$f":"BG22","v":32},"L",{"$f":"IF($X$4=1,170,170/2.54)","v":170},null,"H",{"$f":"BL22","v":13},"B",{"$f":"BN22","v":32},"L",{"$f":"IF($X$4=1,170,170/2.54)","v":170}]
[null,{"v":0.2,"d":"20%"},2,{"$f":"(X47*($T$11^$Q47))*Watts*CF_Altit","v":{"v":1526.5573511005555,"d":"1527"}},{"$f":"ROUND(((D47/Watts)/(($S$9-$S$10)*1.163))*$E$14,IF($X$4=1,0,IF($X$4=2,2)))","v":131},{"$f":"($Y$48*(E47/$E$14)^$Y$50)*$F$14","v":{"v":0.49942474242827456,"d":"0.50"}},{"$f":"(Z47*($W$11^R47))*Watts*CF_Altit","v":{"v":328.4952778654218,"d":"328"}},{"$f":"((G47/Watts)/(IF((237.3*LN((RH*EXP(17.27*(Tl_cool/(Tl_cool+237.3))))))/(17.27-LN((RH*EXP(17.27*(Tl_cool/(Tl_cool+237.3))))))<Tavg_cold,1,IF(1/(1+((2258*((0.622/(($Z$11/(1*611*EXP(17.27*(Tavg_cold/(Tavg_cold+237.3))))))-1)*1000-(0.622/(($Z$11/(RH*611*EXP(17.27*(Tl_cool/(Tl_cool+237.3))))))-1)*1000))/(1005*(Tavg_cold-Tl_cool))))*1.039+((-0.000729*$C47+0.001448)*(Tl_cool-Tavg_cold)+(0.016908*$C47-0.033574))*1.039>1,1,1/(1+((2258*((0.622/(($Z$11/(1*611*EXP(17.27*(Tavg_cold/(Tavg_cold+237.3))))))-1)*1000-(0.622/(($Z$11/(RH*611*EXP(17.27*(Tl_cool/(Tl_cool+237.3))))))-1)*1000))/(1005*(Tavg_cold-Tl_cool))))*1.039+((-0.000729*$C47+0.001448)*(Tl_cool-Tavg_cold)+(0.016908*$C47-0.033574))*1.039))))*Watts","v":{"v":328.4952778654218,"d":"328"}},{"$f":"ROUND(((H47/Watts)/((Tr_cool-Tv_cool)*1.163))*$I$14,IF($X$4=1,0,IF($X$4=2,2)))","v":141},{"$f":"($AA$48*(I47/$I$14)^$AA$50)*$J$14","v":{"v":0.5716074272307419,"d":"0.57"}},{"$f":"L47-8","v":{"v":23,"d":"23.0"}},{"$f":"AB47","v":{"v":31,"d":"31.0"}},{"v":2.408,"d":"2.4"},{"$f":"AD47*Cubics","v":93},{"$f":"((($D47/Watts)/(((p_atm*0.028964)/(8.31447*(20+273.15)))*(($N47/3600)/Cubics)*(1005+1870*((0.622)/(((p_atm)/($E$12*Pvs_Heat_in))-1)))))+Tl_heat)*Celc1+Celc2","v":{"v":68.18212661056491,"d":"68"}},{"$f":"(Tl_cool-(($G47/Watts)/(1006*$N47*kgss)))*Celc1+Celc2","v":{"v":16.50157341668277,"d":"17"}},1,{"v":0.7807,"d":"0.781"},0,0,{"v":0.7807,"d":"0.781"},0,{"$f":"(H47-G47)/H47","v":{"v":0,"d":"0.0%"}},1526.5573511005555,"a",328.4952778654218,"a",{"v":31,"d":"31.0"},{"v":2.408,"d":"2.4"},93,{"$nulls":25},1309.5990299999999,"a",315.40129920182284,"a",{"v":31,"d":"31.0"},{"v":2.408,"d":"2.4"},93,1526.5573511005555,"a",328.4952778654218,"a",{"$f":"BH47","v":{"v":31,"d":"31.0"}},{"v":2.408,"d":"2.4"},93]
[null,{"v":0.4,"d":"40%"},4,{"$f":"(X48*($T$11^$Q48))*Watts*CF_Altit","v":{"v":3376.2428440753456,"d":"3376"}},{"$f":"ROUND(((D48/Watts)/(($S$9-$S$10)*1.163))*$E$14,IF($X$4=1,0,IF($X$4=2,2)))","v":290},{"$f":"($Y$48*(E48/$E$14)^$Y$50)*$F$14","v":{"v":2.146920988745705,"d":"2.15"}},{"$f":"(Z48*($W$11^R48))*Watts*CF_Altit","v":{"v":596.4650101168845,"d":"596"}},{"$f":"((G48/Watts)/(IF((237.3*LN((RH*EXP(17.27*(Tl_cool/(Tl_cool+237.3))))))/(17.27-LN((RH*EXP(17.27*(Tl_cool/(Tl_cool+237.3))))))<Tavg_cold,1,IF(1/(1+((2258*((0.622/(($Z$11/(1*611*EXP(17.27*(Tavg_cold/(Tavg_cold+237.3))))))-1)*1000-(0.622/(($Z$11/(RH*611*EXP(17.27*(Tl_cool/(Tl_cool+237.3))))))-1)*1000))/(1005*(Tavg_cold-Tl_cool))))*1.039+((-0.000729*$C48+0.001448)*(Tl_cool-Tavg_cold)+(0.016908*$C48-0.033574))*1.039>1,1,1/(1+((2258*((0.622/(($Z$11/(1*611*EXP(17.27*(Tavg_cold/(Tavg_cold+237.3))))))-1)*1000-(0.622/(($Z$11/(RH*611*EXP(17.27*(Tl_cool/(Tl_cool+237.3))))))-1)*1000))/(1005*(Tavg_cold-Tl_cool))))*1.039+((-0.000729*$C48+0.001448)*(Tl_cool-Tavg_cold)+(0.016908*$C48-0.033574))*1.039))))*Watts","v":{"v":596.4650101168845,"d":"596"}},{"$f":"ROUND(((H48/Watts)/((Tr_cool-Tv_cool)*1.163))*$I$14,IF($X$4=1,0,IF($X$4=2,2)))","v":256},{"$f":"($AA$48*(I48/$I$14)^$AA$50)*$J$14","v":{"v":1.7077725518332227,"d":"1.71"}},{"$f":"L48-8","v":28.5},36.5,4.2,{"$f":"AD48*Cubics","v":199},{"$f":"((($D48/Watts)/(((p_atm*0.028964)/(8.31447*(20+273.15)))*(($N48/3600)/Cubics)*(1005+1870*((0.622)/(((p_atm)/($E$12*Pvs_Heat_in))-1)))))+Tl_heat)*Celc1+Celc2","v":{"v":69.80080792682362,"d":"70"}},{"$f":"(Tl_cool-(($G48/Watts)/(1006*$N48*kgss)))*Celc1+Celc2","v":{"v":18.09139036952766,"d":"18"}},1,{"v":0.8587,"d":"0.859"},0,0,{"v":0.8587,"d":"0.859"},0,{"$f":"(H48-G48)/H48","v":{"v":0,"d":"0.0%"}},3376.2428440753456,6.50191045437081e-05,596.4650101168845,6.50191045437081e-05,36.5,4.2,199,{"$nulls":25},2611.7849699999997,{"$f":" 0.0000825244","v":8.25244e-05},572.779710877783,1.7821330446923193E-5,36.5,4.2,199,3376.2428440753456,6.50191045437081e-05,596.4650101168845,{"$f":"BL48","v":6.50191045437081e-05},36.5,4.2,199]
[null,{"v":0.6,"d":"60%"},6,{"$f":"(X49*($T$11^$Q49))*Watts*CF_Altit","v":{"v":5033.046876208206,"d":"5033"}},{"$f":"ROUND(((D49/Watts)/(($S$9-$S$10)*1.163))*$E$14,IF($X$4=1,0,IF($X$4=2,2)))","v":433},{"$f":"($Y$48*(E49/$E$14)^$Y$50)*$F$14","v":{"v":4.480128288391389,"d":"4.48"}},{"$f":"(Z49*($W$11^R49))*Watts*CF_Altit","v":{"v":851.8402465358071,"d":"852"}},{"$f":"((G49/Watts)/(IF((237.3*LN((RH*EXP(17.27*(Tl_cool/(Tl_cool+237.3))))))/(17.27-LN((RH*EXP(17.27*(Tl_cool/(Tl_cool+237.3))))))<Tavg_cold,1,IF(1/(1+((2258*((0.622/(($Z$11/(1*611*EXP(17.27*(Tavg_cold/(Tavg_cold+237.3))))))-1)*1000-(0.622/(($Z$11/(RH*611*EXP(17.27*(Tl_cool/(Tl_cool+237.3))))))-1)*1000))/(1005*(Tavg_cold-Tl_cool))))*1.039+((-0.000729*$C49+0.001448)*(Tl_cool-Tavg_cold)+(0.016908*$C49-0.033574))*1.039>1,1,1/(1+((2258*((0.622/(($Z$11/(1*611*EXP(17.27*(Tavg_cold/(Tavg_cold+237.3))))))-1)*1000-(0.622/(($Z$11/(RH*611*EXP(17.27*(Tl_cool/(Tl_cool+237.3))))))-1)*1000))/(1005*(Tavg_cold-Tl_cool))))*1.039+((-0.000729*$C49+0.001448)*(Tl_cool-Tavg_cold)+(0.016908*$C49-0.033574))*1.039))))*Watts","v":{"v":851.8402465358071,"d":"852"}},{"$f":"ROUND(((H49/Watts)/((Tr_cool-Tv_cool)*1.163))*$I$14,IF($X$4=1,0,IF($X$4=2,2)))","v":366},{"$f":"($AA$48*(I49/$I$14)^$AA$50)*$J$14","v":{"v":3.2909009123245703,"d":"3.29"}},{"$f":"L49-8","v":32.5},40.5,7.4,{"$f":"AD49*Cubics","v":307},{"$f":"((($D49/Watts)/(((p_atm*0.028964)/(8.31447*(20+273.15)))*(($N49/3600)/Cubics)*(1005+1870*((0.622)/(((p_atm)/($E$12*Pvs_Heat_in))-1)))))+Tl_heat)*Celc1+Celc2","v":{"v":68.12252291343671,"d":"68"}},{"$f":"(Tl_cool-(($G49/Watts)/(1006*$N49*kgss)))*Celc1+Celc2","v":{"v":18.752965472693212,"d":"19"}},1,{"v":0.8831,"d":"0.883"},0,0,{"v":0.8831,"d":"0.883"},0,{"$f":"(H49-G49)/H49","v":{"v":0,"d":"0.0%"}},5033.046876208206,"b",851.8402465358071,"b",40.5,7.4,307,{"$nulls":25},3683.8544699999998,"b",823.4335920652304,"b",40.5,7.4,307,5033.046876208206,"b",851.8402465358071,"b",40.5,7.4,307]
[null,{"v":0.8,"d":"80%"},8,{"$f":"(X50*($T$11^$Q50))*Watts*CF_Altit","v":{"v":6496.969447499138,"d":"6497"}},{"$f":"ROUND(((D50/Watts)/(($S$9-$S$10)*1.163))*$E$14,IF($X$4=1,0,IF($X$4=2,2)))","v":559},{"$f":"($Y$48*(E50/$E$14)^$Y$50)*$F$14","v":{"v":7.158931462328529,"d":"7.16"}},{"$f":"(Z50*($W$11^R50))*Watts*CF_Altit","v":{"v":1094.6209871221893,"d":"1095"}},{"$f":"((G50/Watts)/(IF((237.3*LN((RH*EXP(17.27*(Tl_cool/(Tl_cool+237.3))))))/(17.27-LN((RH*EXP(17.27*(Tl_cool/(Tl_cool+237.3))))))<Tavg_cold,1,IF(1/(1+((2258*((0.622/(($Z$11/(1*611*EXP(17.27*(Tavg_cold/(Tavg_cold+237.3))))))-1)*1000-(0.622/(($Z$11/(RH*611*EXP(17.27*(Tl_cool/(Tl_cool+237.3))))))-1)*1000))/(1005*(Tavg_cold-Tl_cool))))*1.039+((-0.000729*$C50+0.001448)*(Tl_cool-Tavg_cold)+(0.016908*$C50-0.033574))*1.039>1,1,1/(1+((2258*((0.622/(($Z$11/(1*611*EXP(17.27*(Tavg_cold/(Tavg_cold+237.3))))))-1)*1000-(0.622/(($Z$11/(RH*611*EXP(17.27*(Tl_cool/(Tl_cool+237.3))))))-1)*1000))/(1005*(Tavg_cold-Tl_cool))))*1.039+((-0.000729*$C50+0.001448)*(Tl_cool-Tavg_cold)+(0.016908*$C50-0.033574))*1.039))))*Watts","v":{"v":1094.6209871221893,"d":"1095"}},{"$f":"ROUND(((H50/Watts)/((Tr_cool-Tv_cool)*1.163))*$I$14,IF($X$4=1,0,IF($X$4=2,2)))","v":471},{"$f":"($AA$48*(I50/$I$14)^$AA$50)*$J$14","v":{"v":5.227964155640283,"d":"5.23"}},{"$f":"L50-8","v":39.5},47.5,{"v":13.600000000000001,"d":"13.6"},{"$f":"AD50*Cubics","v":403},{"$f":"((($D50/Watts)/(((p_atm*0.028964)/(8.31447*(20+273.15)))*(($N50/3600)/Cubics)*(1005+1870*((0.622)/(((p_atm)/($E$12*Pvs_Heat_in))-1)))))+Tl_heat)*Celc1+Celc2","v":{"v":67.32183386040705,"d":"67"}},{"$f":"(Tl_cool-(($G50/Watts)/(1006*$N50*kgss)))*Celc1+Celc2","v":{"v":18.926966445394378,"d":"19"}},1,{"v":0.8539,"d":"0.854"},0,0,{"v":0.8539,"d":"0.854"},0,{"$f":"(H50-G50)/H50","v":{"v":0,"d":"0.0%"}},6496.969447499138,1.8351115788823005,1094.6209871221893,1.8351115788823005,47.5,{"v":13.600000000000001,"d":"13.6"},403,{"$nulls":25},4525.807529999999,1.84541,1067.362942764165,1.9208636901745513,47.5,{"v":13.600000000000001,"d":"13.6"},403,6496.969447499138,1.8351115788823005,1094.6209871221893,{"$f":"BL50","v":1.8351115788823005},47.5,{"v":13.600000000000001,"d":"13.6"},403]
[null,{"v":1,"d":"100%"},10,{"$f":"(X51*($T$11^$Q51))*Watts*CF_Altit","v":{"v":7768.010557948142,"d":"7768"}},{"$f":"ROUND(((D51/Watts)/(($S$9-$S$10)*1.163))*$E$14,IF($X$4=1,0,IF($X$4=2,2)))","v":668},{"$f":"($Y$48*(E51/$E$14)^$Y$50)*$F$14","v":{"v":9.927067571733335,"d":"9.93"}},{"$f":"(Z51*($W$11^R51))*Watts*CF_Altit","v":{"v":1324.8072318760314,"d":"1325"}},{"$f":"((G51/Watts)/(IF((237.3*LN((RH*EXP(17.27*(Tl_cool/(Tl_cool+237.3))))))/(17.27-LN((RH*EXP(17.27*(Tl_cool/(Tl_cool+237.3))))))<Tavg_cold,1,IF(1/(1+((2258*((0.622/(($Z$11/(1*611*EXP(17.27*(Tavg_cold/(Tavg_cold+237.3))))))-1)*1000-(0.622/(($Z$11/(RH*611*EXP(17.27*(Tl_cool/(Tl_cool+237.3))))))-1)*1000))/(1005*(Tavg_cold-Tl_cool))))*1.039+((-0.000729*$C51+0.001448)*(Tl_cool-Tavg_cold)+(0.016908*$C51-0.033574))*1.039>1,1,1/(1+((2258*((0.622/(($Z$11/(1*611*EXP(17.27*(Tavg_cold/(Tavg_cold+237.3))))))-1)*1000-(0.622/(($Z$11/(RH*611*EXP(17.27*(Tl_cool/(Tl_cool+237.3))))))-1)*1000))/(1005*(Tavg_cold-Tl_cool))))*1.039+((-0.000729*$C51+0.001448)*(Tl_cool-Tavg_cold)+(0.016908*$C51-0.033574))*1.039))))*Watts","v":{"v":1324.8072318760314,"d":"1325"}},{"$f":"ROUND(((H51/Watts)/((Tr_cool-Tv_cool)*1.163))*$I$14,IF($X$4=1,0,IF($X$4=2,2)))","v":570},{"$f":"($AA$48*(I51/$I$14)^$AA$50)*$J$14","v":{"v":7.419571794935854,"d":"7.42"}},{"$f":"L51-8","v":42.5},50.5,20.9,{"$f":"AD51*Cubics","v":475},{"$f":"((($D51/Watts)/(((p_atm*0.028964)/(8.31447*(20+273.15)))*(($N51/3600)/Cubics)*(1005+1870*((0.622)/(((p_atm)/($E$12*Pvs_Heat_in))-1)))))+Tl_heat)*Celc1+Celc2","v":{"v":68.0033985503049,"d":"68"}},{"$f":"(Tl_cool-(($G51/Watts)/(1006*$N51*kgss)))*Celc1+Celc2","v":{"v":18.710332454036546,"d":"19"}},1,{"v":0.7711,"d":"0.771"},0,0,{"v":0.7711,"d":"0.771"},0,{"$f":"(H51-G51)/H51","v":{"v":0,"d":"0.0%"}},7768.010557948142,0,1324.8072318760314,0,50.5,20.9,475,{"$nulls":25},5137.644149999998,null,1304.5677629745867,null,50.5,20.9,475,7768.010557948142,null,1324.8072318760314,null,50.5,20.9,475]
[null,{"$f":"IF($S$7=1,NL!A51,IF(cal!$S$7=2,EN!A51,IF(cal!$S$7=3,DE!A51,IF(cal!$S$7=4,FR!A51,IF(cal!$S$7=5,NR!A51,IF(cal!$S$7=6,SP!A51,IF(cal!$S$7=7,SW!A51,IF(cal!$S$7=8,TS!A51,IF(cal!$S$7=9,ExtraTaal1!A51,IF(cal!$S$7=10,ExtraTaal2!A51,IF(cal!$S$7=11,ExtraTaal3!A51,)))))))))))","v":"Clima Canal height 13 cm width 32 cm length 230 cm (Type 7)"},{"$f":"IF($S$7=1,NL!B51,IF(cal!$S$7=2,EN!B51,IF(cal!$S$7=3,DE!B51,IF(cal!$S$7=4,FR!B51,IF(cal!$S$7=5,NR!B51,IF(cal!$S$7=6,SP!B51,IF(cal!$S$7=7,SW!B51,IF(cal!$S$7=8,TS!B51,IF(cal!$S$7=9,ExtraTaal1!B51,IF(cal!$S$7=10,ExtraTaal2!B51,IF(cal!$S$7=11,ExtraTaal3!B51,)))))))))))","v":0},{"$f":"IF($S$7=1,NL!C51,IF(cal!$S$7=2,EN!C51,IF(cal!$S$7=3,DE!C51,IF(cal!$S$7=4,FR!C51,IF(cal!$S$7=5,NR!C51,IF(cal!$S$7=6,SP!C51,IF(cal!$S$7=7,SW!C51,IF(cal!$S$7=8,TS!C51,IF(cal!$S$7=9,ExtraTaal1!C51,IF(cal!$S$7=10,ExtraTaal2!C51,IF(cal!$S$7=11,ExtraTaal3!C51,)))))))))))","v":0},{"$f":"IF($S$7=1,NL!D51,IF(cal!$S$7=2,EN!D51,IF(cal!$S$7=3,DE!D51,IF(cal!$S$7=4,FR!D51,IF(cal!$S$7=5,NR!D51,IF(cal!$S$7=6,SP!D51,IF(cal!$S$7=7,SW!D51,IF(cal!$S$7=8,TS!D51,IF(cal!$S$7=9,ExtraTaal1!D51,IF(cal!$S$7=10,ExtraTaal2!D51,IF(cal!$S$7=11,ExtraTaal3!D51,)))))))))))","v":0},{"$f":"IF($S$7=1,NL!E51,IF(cal!$S$7=2,EN!E51,IF(cal!$S$7=3,DE!E51,IF(cal!$S$7=4,FR!E51,IF(cal!$S$7=5,NR!E51,IF(cal!$S$7=6,SP!E51,IF(cal!$S$7=7,SW!E51,IF(cal!$S$7=8,TS!E51,IF(cal!$S$7=9,ExtraTaal1!E51,IF(cal!$S$7=10,ExtraTaal2!E51,IF(cal!$S$7=11,ExtraTaal3!E51,)))))))))))","v":0},{"$f":"IF($S$7=1,NL!F51,IF(cal!$S$7=2,EN!F51,IF(cal!$S$7=3,DE!F51,IF(cal!$S$7=4,FR!F51,IF(cal!$S$7=5,NR!F51,IF(cal!$S$7=6,SP!F51,IF(cal!$S$7=7,SW!F51,IF(cal!$S$7=8,TS!F51,IF(cal!$S$7=9,ExtraTaal1!F51,IF(cal!$S$7=10,ExtraTaal2!F51,IF(cal!$S$7=11,ExtraTaal3!F51,)))))))))))","v":0},{"$f":"IF($S$7=1,NL!G51,IF(cal!$S$7=2,EN!G51,IF(cal!$S$7=3,DE!G51,IF(cal!$S$7=4,FR!G51,IF(cal!$S$7=5,NR!G51,IF(cal!$S$7=6,SP!G51,IF(cal!$S$7=7,SW!G51,IF(cal!$S$7=8,TS!G51,IF(cal!$S$7=9,ExtraTaal1!G51,IF(cal!$S$7=10,ExtraTaal2!G51,IF(cal!$S$7=11,ExtraTaal3!G51,)))))))))))","v":0},{"$f":"IF($S$7=1,NL!H51,IF(cal!$S$7=2,EN!H51,IF(cal!$S$7=3,DE!H51,IF(cal!$S$7=4,FR!H51,IF(cal!$S$7=5,NR!H51,IF(cal!$S$7=6,SP!H51,IF(cal!$S$7=7,SW!H51,IF(cal!$S$7=8,TS!H51,IF(cal!$S$7=9,ExtraTaal1!H51,IF(cal!$S$7=10,ExtraTaal2!H51,IF(cal!$S$7=11,ExtraTaal3!H51,)))))))))))","v":0},{"$f":"IF($S$7=1,NL!I51,IF(cal!$S$7=2,EN!I51,IF(cal!$S$7=3,DE!I51,IF(cal!$S$7=4,FR!I51,IF(cal!$S$7=5,NR!I51,IF(cal!$S$7=6,SP!I51,IF(cal!$S$7=7,SW!I51,IF(cal!$S$7=8,TS!I51,IF(cal!$S$7=9,ExtraTaal1!I51,IF(cal!$S$7=10,ExtraTaal2!I51,IF(cal!$S$7=11,ExtraTaal3!I51,)))))))))))","v":0},{"$f":"IF($S$7=1,NL!J51,IF(cal!$S$7=2,EN!J51,IF(cal!$S$7=3,DE!J51,IF(cal!$S$7=4,FR!J51,IF(cal!$S$7=5,NR!J51,IF(cal!$S$7=6,SP!J51,IF(cal!$S$7=7,SW!J51,IF(cal!$S$7=8,TS!J51,IF(cal!$S$7=9,ExtraTaal1!J51,IF(cal!$S$7=10,ExtraTaal2!J51,IF(cal!$S$7=11,ExtraTaal3!J51,)))))))))))","v":0},{"$f":"IF($S$7=1,NL!K51,IF(cal!$S$7=2,EN!K51,IF(cal!$S$7=3,DE!K51,IF(cal!$S$7=4,FR!K51,IF(cal!$S$7=5,NR!K51,IF(cal!$S$7=6,SP!K51,IF(cal!$S$7=7,SW!K51,IF(cal!$S$7=8,TS!K51,IF(cal!$S$7=9,ExtraTaal1!K51,IF(cal!$S$7=10,ExtraTaal2!K51,IF(cal!$S$7=11,ExtraTaal3!K51,)))))))))))","v":0},{"$f":"IF($S$7=1,NL!L51,IF(cal!$S$7=2,EN!L51,IF(cal!$S$7=3,DE!L51,IF(cal!$S$7=4,FR!L51,IF(cal!$S$7=5,NR!L51,IF(cal!$S$7=6,SP!L51,IF(cal!$S$7=7,SW!L51,IF(cal!$S$7=8,TS!L51,IF(cal!$S$7=9,ExtraTaal1!L51,IF(cal!$S$7=10,ExtraTaal2!L51,IF(cal!$S$7=11,ExtraTaal3!L51,)))))))))))","v":0},{"$f":"IF($S$7=1,NL!M51,IF(cal!$S$7=2,EN!M51,IF(cal!$S$7=3,DE!M51,IF(cal!$S$7=4,FR!M51,IF(cal!$S$7=5,NR!M51,IF(cal!$S$7=6,SP!M51,IF(cal!$S$7=7,SW!M51,IF(cal!$S$7=8,TS!M51,IF(cal!$S$7=9,ExtraTaal1!M51,IF(cal!$S$7=10,ExtraTaal2!M51,IF(cal!$S$7=11,ExtraTaal3!M51,)))))))))))","v":0},{"$f":"IF($S$7=1,NL!N51,IF(cal!$S$7=2,EN!N51,IF(cal!$S$7=3,DE!N51,IF(cal!$S$7=4,FR!N51,IF(cal!$S$7=5,NR!N51,IF(cal!$S$7=6,SP!N51,IF(cal!$S$7=7,SW!N51,IF(cal!$S$7=8,TS!N51,IF(cal!$S$7=9,ExtraTaal1!N51,IF(cal!$S$7=10,ExtraTaal2!N51,IF(cal!$S$7=11,ExtraTaal3!N51,)))))))))))","v":0},{"$f":"IF($S$7=1,NL!O51,IF(cal!$S$7=2,EN!O51,IF(cal!$S$7=3,DE!O51,IF(cal!$S$7=4,FR!O51,IF(cal!$S$7=5,NR!O51,IF(cal!$S$7=6,SP!O51,IF(cal!$S$7=7,SW!O51,IF(cal!$S$7=8,TS!O51,IF(cal!$S$7=9,ExtraTaal1!O51,IF(cal!$S$7=10,ExtraTaal2!O51,IF(cal!$S$7=11,ExtraTaal3!O51,)))))))))))","v":0},"n-value","n-value","n-value","n-value","n-value","n-value",null,"H",13,"B",32,"L",200,0,{"$nulls":25},"H",{"$f":"BE22","v":13},"B",{"$f":"BG22","v":32},"L",{"$f":"IF($X$4=1,200,200/2.54)","v":200},null,"H",{"$f":"BL22","v":13},"B",{"$f":"BN22","v":32},"L",{"$f":"IF($X$4=1,200,200/2.54)","v":200}]
[null,{"v":0.2,"d":"20%"},2,{"$f":"(X53*($T$11^$Q53))*Watts*CF_Altit","v":{"v":1806.659617357538,"d":"1807"}},{"$f":"ROUND(((D53/Watts)/(($S$9-$S$10)*1.163))*$E$14,IF($X$4=1,0,IF($X$4=2,2)))","v":155},{"$f":"($Y$54*(E53/$E$14)^$Y$56)*$F$14","v":{"v":0.7625572810769893,"d":"0.76"}},{"$f":"(Z53*($W$11^R53))*Watts*CF_Altit","v":{"v":388.7696407765084,"d":"389"}},{"$f":"((G53/Watts)/(IF((237.3*LN((RH*EXP(17.27*(Tl_cool/(Tl_cool+237.3))))))/(17.27-LN((RH*EXP(17.27*(Tl_cool/(Tl_cool+237.3))))))<Tavg_cold,1,IF(1/(1+((2258*((0.622/(($Z$11/(1*611*EXP(17.27*(Tavg_cold/(Tavg_cold+237.3))))))-1)*1000-(0.622/(($Z$11/(RH*611*EXP(17.27*(Tl_cool/(Tl_cool+237.3))))))-1)*1000))/(1005*(Tavg_cold-Tl_cool))))*1.039+((-0.000729*$C53+0.001448)*(Tl_cool-Tavg_cold)+(0.016908*$C53-0.033574))*1.039>1,1,1/(1+((2258*((0.622/(($Z$11/(1*611*EXP(17.27*(Tavg_cold/(Tavg_cold+237.3))))))-1)*1000-(0.622/(($Z$11/(RH*611*EXP(17.27*(Tl_cool/(Tl_cool+237.3))))))-1)*1000))/(1005*(Tavg_cold-Tl_cool))))*1.039+((-0.000729*$C53+0.001448)*(Tl_cool-Tavg_cold)+(0.016908*$C53-0.033574))*1.039))))*Watts","v":{"v":388.7696407765084,"d":"389"}},{"$f":"ROUND(((H53/Watts)/((Tr_cool-Tv_cool)*1.163))*$I$14,IF($X$4=1,0,IF($X$4=2,2)))","v":167},{"$f":"($AA$54*(I53/$I$14)^$AA$56)*$J$14","v":{"v":0.8737480669025174,"d":"0.87"}},{"$f":"L53-8","v":{"v":23,"d":"23.0"}},{"$f":"AB53","v":{"v":31,"d":"31.0"}},2.8,{"$f":"AD53*Cubics","v":98},{"$f":"((($D53/Watts)/(((p_atm*0.028964)/(8.31447*(20+273.15)))*(($N53/3600)/Cubics)*(1005+1870*((0.622)/(((p_atm)/($E$12*Pvs_Heat_in))-1)))))+Tl_heat)*Celc1+Celc2","v":{"v":74.1135529813656,"d":"74"}},{"$f":"(Tl_cool-(($G53/Watts)/(1006*$N53*kgss)))*Celc1+Celc2","v":{"v":15.209172091363337,"d":"15"}},1,{"v":0.7807,"d":"0.781"},0,0,{"v":0.7807,"d":"0.781"},0,{"$f":"(H53-G53)/H53","v":{"v":0,"d":"0.0%"}},1806.659617357538,"a",388.7696407765084,"a",{"v":31,"d":"31.0"},2.8,98,{"$nulls":25},1549.8924299999999,"a",373.2730972205059,"a",{"v":31,"d":"31.0"},2.8,98,1806.659617357538,"a",388.7696407765084,"a",{"$f":"BH53","v":{"v":31,"d":"31.0"}},2.8,98]
[null,{"v":0.4,"d":"40%"},4,{"$f":"(X54*($T$11^$Q54))*Watts*CF_Altit","v":{"v":3995.7369439056843,"d":"3996"}},{"$f":"ROUND(((D54/Watts)/(($S$9-$S$10)*1.163))*$E$14,IF($X$4=1,0,IF($X$4=2,2)))","v":344},{"$f":"($Y$54*(E54/$E$14)^$Y$56)*$F$14","v":{"v":3.2678319097682533,"d":"3.27"}},{"$f":"(Z54*($W$11^R54))*Watts*CF_Altit","v":{"v":705.9081312392486,"d":"706"}},{"$f":"((G54/Watts)/(IF((237.3*LN((RH*EXP(17.27*(Tl_cool/(Tl_cool+237.3))))))/(17.27-LN((RH*EXP(17.27*(Tl_cool/(Tl_cool+237.3))))))<Tavg_cold,1,IF(1/(1+((2258*((0.622/(($Z$11/(1*611*EXP(17.27*(Tavg_cold/(Tavg_cold+237.3))))))-1)*1000-(0.622/(($Z$11/(RH*611*EXP(17.27*(Tl_cool/(Tl_cool+237.3))))))-1)*1000))/(1005*(Tavg_cold-Tl_cool))))*1.039+((-0.000729*$C54+0.001448)*(Tl_cool-Tavg_cold)+(0.016908*$C54-0.033574))*1.039>1,1,1/(1+((2258*((0.622/(($Z$11/(1*611*EXP(17.27*(Tavg_cold/(Tavg_cold+237.3))))))-1)*1000-(0.622/(($Z$11/(RH*611*EXP(17.27*(Tl_cool/(Tl_cool+237.3))))))-1)*1000))/(1005*(Tavg_cold-Tl_cool))))*1.039+((-0.000729*$C54+0.001448)*(Tl_cool-Tavg_cold)+(0.016908*$C54-0.033574))*1.039))))*Watts","v":{"v":705.9081312392486,"d":"706"}},{"$f":"ROUND(((H54/Watts)/((Tr_cool-Tv_cool)*1.163))*$I$14,IF($X$4=1,0,IF($X$4=2,2)))","v":303},{"$f":"($AA$54*(I54/$I$14)^$AA$56)*$J$14","v":{"v":2.592111626359494,"d":"2.59"}},{"$f":"L54-8","v":{"v":29,"d":"29.0"}},{"v":37,"d":"37.0"},4.8,{"$f":"AD54*Cubics","v":228},{"$f":"((($D54/Watts)/(((p_atm*0.028964)/(8.31447*(20+273.15)))*(($N54/3600)/Cubics)*(1005+1870*((0.622)/(((p_atm)/($E$12*Pvs_Heat_in))-1)))))+Tl_heat)*Celc1+Celc2","v":{"v":71.44199824116728,"d":"71"}},{"$f":"(Tl_cool-(($G54/Watts)/(1006*$N54*kgss)))*Celc1+Celc2","v":{"v":17.797806300343815,"d":"18"}},1,{"v":0.8587,"d":"0.859"},0,0,{"v":0.8587,"d":"0.859"},0,{"$f":"(H54-G54)/H54","v":{"v":0,"d":"0.0%"}},3995.7369439056843,7.6583688224419073E-5,705.9081312392486,7.6583688224419073E-5,{"v":37,"d":"37.0"},4.8,228,{"$nulls":25},3091.0115699999997,9.55869e-05,677.876905534257,1.92696346332305E-5,{"v":37,"d":"37.0"},4.8,228,3995.7369439056843,7.6583688224419073E-5,705.9081312392486,{"$f":"BL54","v":7.6583688224419073E-5},{"v":37,"d":"37.0"},4.8,228]
[null,{"v":0.6,"d":"60%"},6,{"$f":"(X55*($T$11^$Q55))*Watts*CF_Altit","v":{"v":5956.541715879437,"d":"5957"}},{"$f":"ROUND(((D55/Watts)/(($S$9-$S$10)*1.163))*$E$14,IF($X$4=1,0,IF($X$4=2,2)))","v":512},{"$f":"($Y$54*(E55/$E$14)^$Y$56)*$F$14","v":{"v":6.753358447805807,"d":"6.75"}},{"$f":"(Z55*($W$11^R55))*Watts*CF_Altit","v":{"v":1008.1412092029277,"d":"1008"}},{"$f":"((G55/Watts)/(IF((237.3*LN((RH*EXP(17.27*(Tl_cool/(Tl_cool+237.3))))))/(17.27-LN((RH*EXP(17.27*(Tl_cool/(Tl_cool+237.3))))))<Tavg_cold,1,IF(1/(1+((2258*((0.622/(($Z$11/(1*611*EXP(17.27*(Tavg_cold/(Tavg_cold+237.3))))))-1)*1000-(0.622/(($Z$11/(RH*611*EXP(17.27*(Tl_cool/(Tl_cool+237.3))))))-1)*1000))/(1005*(Tavg_cold-Tl_cool))))*1.039+((-0.000729*$C55+0.001448)*(Tl_cool-Tavg_cold)+(0.016908*$C55-0.033574))*1.039>1,1,1/(1+((2258*((0.622/(($Z$11/(1*611*EXP(17.27*(Tavg_cold/(Tavg_cold+237.3))))))-1)*1000-(0.622/(($Z$11/(RH*611*EXP(17.27*(Tl_cool/(Tl_cool+237.3))))))-1)*1000))/(1005*(Tavg_cold-Tl_cool))))*1.039+((-0.000729*$C55+0.001448)*(Tl_cool-Tavg_cold)+(0.016908*$C55-0.033574))*1.039))))*Watts","v":{"v":1008.1412092029277,"d":"1008"}},{"$f":"ROUND(((H55/Watts)/((Tr_cool-Tv_cool)*1.163))*$I$14,IF($X$4=1,0,IF($X$4=2,2)))","v":433},{"$f":"($AA$54*(I55/$I$14)^$AA$56)*$J$14","v":{"v":4.973551128640903,"d":"4.97"}},{"$f":"L55-8","v":{"v":33,"d":"33.0"}},{"v":41,"d":"41.0"},8.4,{"$f":"AD55*Cubics","v":348},{"$f":"((($D55/Watts)/(((p_atm*0.028964)/(8.31447*(20+273.15)))*(($N55/3600)/Cubics)*(1005+1870*((0.622)/(((p_atm)/($E$12*Pvs_Heat_in))-1)))))+Tl_heat)*Celc1+Celc2","v":{"v":70.24244107721275,"d":"70"}},{"$f":"(Tl_cool-(($G55/Watts)/(1006*$N55*kgss)))*Celc1+Celc2","v":{"v":18.389662860251747,"d":"18"}},1,{"v":0.8831,"d":"0.883"},0,0,{"v":0.8831,"d":"0.883"},0,{"$f":"(H55-G55)/H55","v":{"v":0,"d":"0.0%"}},5956.541715879437,"b",1008.1412092029277,"b",{"v":41,"d":"41.0"},8.4,348,{"$nulls":25},4359.79107,"b",974.5223245542636,"b",{"v":41,"d":"41.0"},8.4,348,5956.541715879437,"b",1008.1412092029277,"b",{"v":41,"d":"41.0"},8.4,348]
[null,{"v":0.8,"d":"80%"},8,{"$f":"(X56*($T$11^$Q56))*Watts*CF_Altit","v":{"v":7689.073933278797,"d":"7689"}},{"$f":"ROUND(((D56/Watts)/(($S$9-$S$10)*1.163))*$E$14,IF($X$4=1,0,IF($X$4=2,2)))","v":661},{"$f":"($Y$54*(E56/$E$14)^$Y$56)*$F$14","v":{"v":10.764883466888408,"d":"10.76"}},{"$f":"(Z56*($W$11^R56))*Watts*CF_Altit","v":{"v":1295.4688746675452,"d":"1295"}},{"$f":"((G56/Watts)/(IF((237.3*LN((RH*EXP(17.27*(Tl_cool/(Tl_cool+237.3))))))/(17.27-LN((RH*EXP(17.27*(Tl_cool/(Tl_cool+237.3))))))<Tavg_cold,1,IF(1/(1+((2258*((0.622/(($Z$11/(1*611*EXP(17.27*(Tavg_cold/(Tavg_cold+237.3))))))-1)*1000-(0.622/(($Z$11/(RH*611*EXP(17.27*(Tl_cool/(Tl_cool+237.3))))))-1)*1000))/(1005*(Tavg_cold-Tl_cool))))*1.039+((-0.000729*$C56+0.001448)*(Tl_cool-Tavg_cold)+(0.016908*$C56-0.033574))*1.039>1,1,1/(1+((2258*((0.622/(($Z$11/(1*611*EXP(17.27*(Tavg_cold/(Tavg_cold+237.3))))))-1)*1000-(0.622/(($Z$11/(RH*611*EXP(17.27*(Tl_cool/(Tl_cool+237.3))))))-1)*1000))/(1005*(Tavg_cold-Tl_cool))))*1.039+((-0.000729*$C56+0.001448)*(Tl_cool-Tavg_cold)+(0.016908*$C56-0.033574))*1.039))))*Watts","v":{"v":1295.4688746675452,"d":"1295"}},{"$f":"ROUND(((H56/Watts)/((Tr_cool-Tv_cool)*1.163))*$I$14,IF($X$4=1,0,IF($X$4=2,2)))","v":557},{"$f":"($AA$54*(I56/$I$14)^$AA$56)*$J$14","v":{"v":7.875912748834125,"d":"7.88"}},{"$f":"L56-8","v":{"v":40,"d":"40.0"}},{"v":48,"d":"48.0"},14.4,{"$f":"AD56*Cubics","v":470},{"$f":"((($D56/Watts)/(((p_atm*0.028964)/(8.31447*(20+273.15)))*(($N56/3600)/Cubics)*(1005+1870*((0.622)/(((p_atm)/($E$12*Pvs_Heat_in))-1)))))+Tl_heat)*Celc1+Celc2","v":{"v":68.0210848506926,"d":"68"}},{"$f":"(Tl_cool-(($G56/Watts)/(1006*$N56*kgss)))*Celc1+Celc2","v":{"v":18.80767528004524,"d":"19"}},1,{"v":0.8539,"d":"0.854"},0,0,{"v":0.8539,"d":"0.854"},0,{"$f":"(H56-G56)/H56","v":{"v":0,"d":"0.0%"}},7689.073933278797,1.8253564962973818,1295.4688746675452,1.8253564962973818,{"v":48,"d":"48.0"},14.4,470,{"$nulls":25},5356.230929999999,1.83729,1263.2093542805255,1.9149559385396036,{"v":48,"d":"48.0"},14.4,470,7689.073933278797,1.8253564962973818,1295.4688746675452,{"$f":"BL56","v":1.8253564962973818},{"v":48,"d":"48.0"},14.4,470]
[null,{"v":1,"d":"100%"},10,{"$f":"(X57*($T$11^$Q57))*Watts*CF_Altit","v":{"v":9193.333596103765,"d":"9193"}},{"$f":"ROUND(((D57/Watts)/(($S$9-$S$10)*1.163))*$E$14,IF($X$4=1,0,IF($X$4=2,2)))","v":790},{"$f":"($Y$54*(E57/$E$14)^$Y$56)*$F$14","v":{"v":14.905231059418846,"d":"14.91"}},{"$f":"(Z57*($W$11^R57))*Watts*CF_Altit","v":{"v":1567.8911276331014,"d":"1568"}},{"$f":"((G57/Watts)/(IF((237.3*LN((RH*EXP(17.27*(Tl_cool/(Tl_cool+237.3))))))/(17.27-LN((RH*EXP(17.27*(Tl_cool/(Tl_cool+237.3))))))<Tavg_cold,1,IF(1/(1+((2258*((0.622/(($Z$11/(1*611*EXP(17.27*(Tavg_cold/(Tavg_cold+237.3))))))-1)*1000-(0.622/(($Z$11/(RH*611*EXP(17.27*(Tl_cool/(Tl_cool+237.3))))))-1)*1000))/(1005*(Tavg_cold-Tl_cool))))*1.039+((-0.000729*$C57+0.001448)*(Tl_cool-Tavg_cold)+(0.016908*$C57-0.033574))*1.039>1,1,1/(1+((2258*((0.622/(($Z$11/(1*611*EXP(17.27*(Tavg_cold/(Tavg_cold+237.3))))))-1)*1000-(0.622/(($Z$11/(RH*611*EXP(17.27*(Tl_cool/(Tl_cool+237.3))))))-1)*1000))/(1005*(Tavg_cold-Tl_cool))))*1.039+((-0.000729*$C57+0.001448)*(Tl_cool-Tavg_cold)+(0.016908*$C57-0.033574))*1.039))))*Watts","v":{"v":1567.8911276331014,"d":"1568"}},{"$f":"ROUND(((H57/Watts)/((Tr_cool-Tv_cool)*1.163))*$I$14,IF($X$4=1,0,IF($X$4=2,2)))","v":674},{"$f":"($AA$54*(I57/$I$14)^$AA$56)*$J$14","v":{"v":11.154471439461101,"d":"11.15"}},{"$f":"L57-8","v":{"v":43,"d":"43.0"}},{"v":51,"d":"51.0"},21.2,{"$f":"AD57*Cubics","v":546},{"$f":"((($D57/Watts)/(((p_atm*0.028964)/(8.31447*(20+273.15)))*(($N57/3600)/Cubics)*(1005+1870*((0.622)/(((p_atm)/($E$12*Pvs_Heat_in))-1)))))+Tl_heat)*Celc1+Celc2","v":{"v":69.4238035784846,"d":"69"}},{"$f":"(Tl_cool-(($G57/Watts)/(1006*$N57*kgss)))*Celc1+Celc2","v":{"v":18.465043874064747,"d":"18"}},1,{"v":0.7711,"d":"0.771"},0,0,{"v":0.7711,"d":"0.771"},0,{"$f":"(H57-G57)/H57","v":{"v":0,"d":"0.0%"}},9193.333596103765,0,1567.8911276331014,0,{"v":51,"d":"51.0"},21.2,546,{"$nulls":25},6080.331149999998,null,1543.937994713043,null,{"v":51,"d":"51.0"},21.2,546,9193.333596103765,null,1567.8911276331014,null,{"v":51,"d":"51.0"},21.2,546]
[null,{"$f":"IF($S$7=1,NL!A57,IF(cal!$S$7=2,EN!A57,IF(cal!$S$7=3,DE!A57,IF(cal!$S$7=4,FR!A57,IF(cal!$S$7=5,NR!A57,IF(cal!$S$7=6,SP!A57,IF(cal!$S$7=7,SW!A57,IF(cal!$S$7=8,TS!A57,IF(cal!$S$7=9,ExtraTaal1!A57,IF(cal!$S$7=10,ExtraTaal2!A57,IF(cal!$S$7=11,ExtraTaal3!A57,)))))))))))","v":"Clima Canal height 13 cm width 32 cm length 280 cm (Type 8)"},{"$f":"IF($S$7=1,NL!B57,IF(cal!$S$7=2,EN!B57,IF(cal!$S$7=3,DE!B57,IF(cal!$S$7=4,FR!B57,IF(cal!$S$7=5,NR!B57,IF(cal!$S$7=6,SP!B57,IF(cal!$S$7=7,SW!B57,IF(cal!$S$7=8,TS!B57,IF(cal!$S$7=9,ExtraTaal1!B57,IF(cal!$S$7=10,ExtraTaal2!B57,IF(cal!$S$7=11,ExtraTaal3!B57,)))))))))))","v":0},{"$f":"IF($S$7=1,NL!C57,IF(cal!$S$7=2,EN!C57,IF(cal!$S$7=3,DE!C57,IF(cal!$S$7=4,FR!C57,IF(cal!$S$7=5,NR!C57,IF(cal!$S$7=6,SP!C57,IF(cal!$S$7=7,SW!C57,IF(cal!$S$7=8,TS!C57,IF(cal!$S$7=9,ExtraTaal1!C57,IF(cal!$S$7=10,ExtraTaal2!C57,IF(cal!$S$7=11,ExtraTaal3!C57,)))))))))))","v":0},{"$f":"IF($S$7=1,NL!D57,IF(cal!$S$7=2,EN!D57,IF(cal!$S$7=3,DE!D57,IF(cal!$S$7=4,FR!D57,IF(cal!$S$7=5,NR!D57,IF(cal!$S$7=6,SP!D57,IF(cal!$S$7=7,SW!D57,IF(cal!$S$7=8,TS!D57,IF(cal!$S$7=9,ExtraTaal1!D57,IF(cal!$S$7=10,ExtraTaal2!D57,IF(cal!$S$7=11,ExtraTaal3!D57,)))))))))))","v":0},{"$f":"IF($S$7=1,NL!E57,IF(cal!$S$7=2,EN!E57,IF(cal!$S$7=3,DE!E57,IF(cal!$S$7=4,FR!E57,IF(cal!$S$7=5,NR!E57,IF(cal!$S$7=6,SP!E57,IF(cal!$S$7=7,SW!E57,IF(cal!$S$7=8,TS!E57,IF(cal!$S$7=9,ExtraTaal1!E57,IF(cal!$S$7=10,ExtraTaal2!E57,IF(cal!$S$7=11,ExtraTaal3!E57,)))))))))))","v":0},{"$f":"IF($S$7=1,NL!F57,IF(cal!$S$7=2,EN!F57,IF(cal!$S$7=3,DE!F57,IF(cal!$S$7=4,FR!F57,IF(cal!$S$7=5,NR!F57,IF(cal!$S$7=6,SP!F57,IF(cal!$S$7=7,SW!F57,IF(cal!$S$7=8,TS!F57,IF(cal!$S$7=9,ExtraTaal1!F57,IF(cal!$S$7=10,ExtraTaal2!F57,IF(cal!$S$7=11,ExtraTaal3!F57,)))))))))))","v":0},{"$f":"IF($S$7=1,NL!G57,IF(cal!$S$7=2,EN!G57,IF(cal!$S$7=3,DE!G57,IF(cal!$S$7=4,FR!G57,IF(cal!$S$7=5,NR!G57,IF(cal!$S$7=6,SP!G57,IF(cal!$S$7=7,SW!G57,IF(cal!$S$7=8,TS!G57,IF(cal!$S$7=9,ExtraTaal1!G57,IF(cal!$S$7=10,ExtraTaal2!G57,IF(cal!$S$7=11,ExtraTaal3!G57,)))))))))))","v":0},{"$f":"IF($S$7=1,NL!H57,IF(cal!$S$7=2,EN!H57,IF(cal!$S$7=3,DE!H57,IF(cal!$S$7=4,FR!H57,IF(cal!$S$7=5,NR!H57,IF(cal!$S$7=6,SP!H57,IF(cal!$S$7=7,SW!H57,IF(cal!$S$7=8,TS!H57,IF(cal!$S$7=9,ExtraTaal1!H57,IF(cal!$S$7=10,ExtraTaal2!H57,IF(cal!$S$7=11,ExtraTaal3!H57,)))))))))))","v":0},{"$f":"IF($S$7=1,NL!I57,IF(cal!$S$7=2,EN!I57,IF(cal!$S$7=3,DE!I57,IF(cal!$S$7=4,FR!I57,IF(cal!$S$7=5,NR!I57,IF(cal!$S$7=6,SP!I57,IF(cal!$S$7=7,SW!I57,IF(cal!$S$7=8,TS!I57,IF(cal!$S$7=9,ExtraTaal1!I57,IF(cal!$S$7=10,ExtraTaal2!I57,IF(cal!$S$7=11,ExtraTaal3!I57,)))))))))))","v":0},{"$f":"IF($S$7=1,NL!J57,IF(cal!$S$7=2,EN!J57,IF(cal!$S$7=3,DE!J57,IF(cal!$S$7=4,FR!J57,IF(cal!$S$7=5,NR!J57,IF(cal!$S$7=6,SP!J57,IF(cal!$S$7=7,SW!J57,IF(cal!$S$7=8,TS!J57,IF(cal!$S$7=9,ExtraTaal1!J57,IF(cal!$S$7=10,ExtraTaal2!J57,IF(cal!$S$7=11,ExtraTaal3!J57,)))))))))))","v":0},{"$f":"IF($S$7=1,NL!K57,IF(cal!$S$7=2,EN!K57,IF(cal!$S$7=3,DE!K57,IF(cal!$S$7=4,FR!K57,IF(cal!$S$7=5,NR!K57,IF(cal!$S$7=6,SP!K57,IF(cal!$S$7=7,SW!K57,IF(cal!$S$7=8,TS!K57,IF(cal!$S$7=9,ExtraTaal1!K57,IF(cal!$S$7=10,ExtraTaal2!K57,IF(cal!$S$7=11,ExtraTaal3!K57,)))))))))))","v":0},{"$f":"IF($S$7=1,NL!L57,IF(cal!$S$7=2,EN!L57,IF(cal!$S$7=3,DE!L57,IF(cal!$S$7=4,FR!L57,IF(cal!$S$7=5,NR!L57,IF(cal!$S$7=6,SP!L57,IF(cal!$S$7=7,SW!L57,IF(cal!$S$7=8,TS!L57,IF(cal!$S$7=9,ExtraTaal1!L57,IF(cal!$S$7=10,ExtraTaal2!L57,IF(cal!$S$7=11,ExtraTaal3!L57,)))))))))))","v":0},{"$f":"IF($S$7=1,NL!M57,IF(cal!$S$7=2,EN!M57,IF(cal!$S$7=3,DE!M57,IF(cal!$S$7=4,FR!M57,IF(cal!$S$7=5,NR!M57,IF(cal!$S$7=6,SP!M57,IF(cal!$S$7=7,SW!M57,IF(cal!$S$7=8,TS!M57,IF(cal!$S$7=9,ExtraTaal1!M57,IF(cal!$S$7=10,ExtraTaal2!M57,IF(cal!$S$7=11,ExtraTaal3!M57,)))))))))))","v":0},{"$f":"IF($S$7=1,NL!N57,IF(cal!$S$7=2,EN!N57,IF(cal!$S$7=3,DE!N57,IF(cal!$S$7=4,FR!N57,IF(cal!$S$7=5,NR!N57,IF(cal!$S$7=6,SP!N57,IF(cal!$S$7=7,SW!N57,IF(cal!$S$7=8,TS!N57,IF(cal!$S$7=9,ExtraTaal1!N57,IF(cal!$S$7=10,ExtraTaal2!N57,IF(cal!$S$7=11,ExtraTaal3!N57,)))))))))))","v":0},{"$f":"IF($S$7=1,NL!O57,IF(cal!$S$7=2,EN!O57,IF(cal!$S$7=3,DE!O57,IF(cal!$S$7=4,FR!O57,IF(cal!$S$7=5,NR!O57,IF(cal!$S$7=6,SP!O57,IF(cal!$S$7=7,SW!O57,IF(cal!$S$7=8,TS!O57,IF(cal!$S$7=9,ExtraTaal1!O57,IF(cal!$S$7=10,ExtraTaal2!O57,IF(cal!$S$7=11,ExtraTaal3!O57,)))))))))))","v":0},"n-value","n-value","n-value","n-value","n-value","n-value",null,"H",13,"B",32,"L",230,0,{"$nulls":25},"H",{"$f":"BE22","v":13},"B",{"$f":"BG22","v":32},"L",{"$f":"IF($X$4=1,230,230/2.54)","v":230},null,"H",{"$f":"BL22","v":13},"B",{"$f":"BN22","v":32},"L",{"$f":"IF($X$4=1,230,230/2.54)","v":230}]
[null,{"v":0.2,"d":"20%"},2,{"$f":"(X59*($T$11^$Q59))*Watts*CF_Altit","v":{"v":2273.4967277858427,"d":"2273"}},{"$f":"ROUND(((D59/Watts)/(($S$9-$S$10)*1.163))*$E$14,IF($X$4=1,0,IF($X$4=2,2)))","v":195},{"$f":"($Y$66*(E59/$E$14)^$Y$68)*$F$14","v":{"v":1.4135103689709119,"d":"1.41"}},{"$f":"(Z59*($W$11^R59))*Watts*CF_Altit","v":{"v":489.22691229498605,"d":"489"}},{"$f":"((G59/Watts)/(IF((237.3*LN((RH*EXP(17.27*(Tl_cool/(Tl_cool+237.3))))))/(17.27-LN((RH*EXP(17.27*(Tl_cool/(Tl_cool+237.3))))))<Tavg_cold,1,IF(1/(1+((2258*((0.622/(($Z$11/(1*611*EXP(17.27*(Tavg_cold/(Tavg_cold+237.3))))))-1)*1000-(0.622/(($Z$11/(RH*611*EXP(17.27*(Tl_cool/(Tl_cool+237.3))))))-1)*1000))/(1005*(Tavg_cold-Tl_cool))))*1.039+((-0.000729*$C59+0.001448)*(Tl_cool-Tavg_cold)+(0.016908*$C59-0.033574))*1.039>1,1,1/(1+((2258*((0.622/(($Z$11/(1*611*EXP(17.27*(Tavg_cold/(Tavg_cold+237.3))))))-1)*1000-(0.622/(($Z$11/(RH*611*EXP(17.27*(Tl_cool/(Tl_cool+237.3))))))-1)*1000))/(1005*(Tavg_cold-Tl_cool))))*1.039+((-0.000729*$C59+0.001448)*(Tl_cool-Tavg_cold)+(0.016908*$C59-0.033574))*1.039))))*Watts","v":{"v":489.22691229498605,"d":"489"}},{"$f":"ROUND(((H59/Watts)/((Tr_cool-Tv_cool)*1.163))*$I$14,IF($X$4=1,0,IF($X$4=2,2)))","v":210},{"$f":"($AA$60*(I59/$I$14)^$AA$62)*$J$14","v":{"v":1.562994220505905,"d":"1.56"}},{"$f":"L59-8","v":{"v":24,"d":"24.0"}},{"$f":"AB59","v":{"v":32,"d":"32.0"}},{"v":3.784,"d":"3.8"},{"$f":"AD59*Cubics","v":133},{"$f":"((($D59/Watts)/(((p_atm*0.028964)/(8.31447*(20+273.15)))*(($N59/3600)/Cubics)*(1005+1870*((0.622)/(((p_atm)/($E$12*Pvs_Heat_in))-1)))))+Tl_heat)*Celc1+Celc2","v":{"v":70.17628236460637,"d":"70"}},{"$f":"(Tl_cool-(($G59/Watts)/(1006*$N59*kgss)))*Celc1+Celc2","v":{"v":16.06706586684554,"d":"16"}},1,{"v":0.7807,"d":"0.781"},0,0,{"v":0.7807,"d":"0.781"},0,{"$f":"(H59-G59)/H59","v":{"v":0,"d":"0.0%"}},2273.4967277858427,"a",489.22691229498605,"a",{"v":32,"d":"32.0"},{"v":3.784,"d":"3.8"},133,{"$nulls":25},1950.38143,"a",469.72609391831105,"a",{"v":32,"d":"32.0"},{"v":3.784,"d":"3.8"},133,2273.4967277858427,"a",489.22691229498605,"a",{"$f":"BH59","v":{"v":32,"d":"32.0"}},{"v":3.784,"d":"3.8"},133]
[null,{"v":0.4,"d":"40%"},4,{"$f":"(X60*($T$11^$Q60))*Watts*CF_Altit","v":{"v":5028.227110289582,"d":"5028"}},{"$f":"ROUND(((D60/Watts)/(($S$9-$S$10)*1.163))*$E$14,IF($X$4=1,0,IF($X$4=2,2)))","v":432},{"$f":"($Y$66*(E60/$E$14)^$Y$68)*$F$14","v":{"v":5.96608930605324,"d":"5.97"}},{"$f":"(Z60*($W$11^R60))*Watts*CF_Altit","v":{"v":888.3133331098555,"d":"888"}},{"$f":"((G60/Watts)/(IF((237.3*LN((RH*EXP(17.27*(Tl_cool/(Tl_cool+237.3))))))/(17.27-LN((RH*EXP(17.27*(Tl_cool/(Tl_cool+237.3))))))<Tavg_cold,1,IF(1/(1+((2258*((0.622/(($Z$11/(1*611*EXP(17.27*(Tavg_cold/(Tavg_cold+237.3))))))-1)*1000-(0.622/(($Z$11/(RH*611*EXP(17.27*(Tl_cool/(Tl_cool+237.3))))))-1)*1000))/(1005*(Tavg_cold-Tl_cool))))*1.039+((-0.000729*$C60+0.001448)*(Tl_cool-Tavg_cold)+(0.016908*$C60-0.033574))*1.039>1,1,1/(1+((2258*((0.622/(($Z$11/(1*611*EXP(17.27*(Tavg_cold/(Tavg_cold+237.3))))))-1)*1000-(0.622/(($Z$11/(RH*611*EXP(17.27*(Tl_cool/(Tl_cool+237.3))))))-1)*1000))/(1005*(Tavg_cold-Tl_cool))))*1.039+((-0.000729*$C60+0.001448)*(Tl_cool-Tavg_cold)+(0.016908*$C60-0.033574))*1.039))))*Watts","v":{"v":888.3133331098555,"d":"888"}},{"$f":"ROUND(((H60/Watts)/((Tr_cool-Tv_cool)*1.163))*$I$14,IF($X$4=1,0,IF($X$4=2,2)))","v":382},{"$f":"($AA$60*(I60/$I$14)^$AA$62)*$J$14","v":{"v":4.621296697129691,"d":"4.62"}},{"$f":"L60-8","v":29.5},37.5,{"v":6.432,"d":"6.4"},{"$f":"AD60*Cubics","v":272},{"$f":"((($D60/Watts)/(((p_atm*0.028964)/(8.31447*(20+273.15)))*(($N60/3600)/Cubics)*(1005+1870*((0.622)/(((p_atm)/($E$12*Pvs_Heat_in))-1)))))+Tl_heat)*Celc1+Celc2","v":{"v":74.2627462067397,"d":"74"}},{"$f":"(Tl_cool-(($G60/Watts)/(1006*$N60*kgss)))*Celc1+Celc2","v":{"v":17.293217247729288,"d":"17"}},1,{"v":0.8587,"d":"0.859"},0,0,{"v":0.8587,"d":"0.859"},0,{"$f":"(H60-G60)/H60","v":{"v":0,"d":"0.0%"}},5028.227110289582,9.69109392164955e-05,888.3133331098555,9.69109392164955e-05,37.5,{"v":6.432,"d":"6.4"},272,{"$nulls":25},3889.7225699999995,1.18103E-4,853.0388966283804,2.1811428519254933E-5,37.5,{"v":6.432,"d":"6.4"},272,5028.227110289582,9.69109392164955e-05,888.3133331098555,{"$f":"BL60","v":9.69109392164955e-05},37.5,{"v":6.432,"d":"6.4"},272]
[null,{"v":0.6,"d":"60%"},6,{"$f":"(X61*($T$11^$Q61))*Watts*CF_Altit","v":{"v":7495.699781998155,"d":"7496"}},{"$f":"ROUND(((D61/Watts)/(($S$9-$S$10)*1.163))*$E$14,IF($X$4=1,0,IF($X$4=2,2)))","v":645},{"$f":"($Y$66*(E61/$E$14)^$Y$68)*$F$14","v":{"v":12.326269528637294,"d":"12.33"}},{"$f":"(Z61*($W$11^R61))*Watts*CF_Altit","v":{"v":1268.6428136481286,"d":"1269"}},{"$f":"((G61/Watts)/(IF((237.3*LN((RH*EXP(17.27*(Tl_cool/(Tl_cool+237.3))))))/(17.27-LN((RH*EXP(17.27*(Tl_cool/(Tl_cool+237.3))))))<Tavg_cold,1,IF(1/(1+((2258*((0.622/(($Z$11/(1*611*EXP(17.27*(Tavg_cold/(Tavg_cold+237.3))))))-1)*1000-(0.622/(($Z$11/(RH*611*EXP(17.27*(Tl_cool/(Tl_cool+237.3))))))-1)*1000))/(1005*(Tavg_cold-Tl_cool))))*1.039+((-0.000729*$C61+0.001448)*(Tl_cool-Tavg_cold)+(0.016908*$C61-0.033574))*1.039>1,1,1/(1+((2258*((0.622/(($Z$11/(1*611*EXP(17.27*(Tavg_cold/(Tavg_cold+237.3))))))-1)*1000-(0.622/(($Z$11/(RH*611*EXP(17.27*(Tl_cool/(Tl_cool+237.3))))))-1)*1000))/(1005*(Tavg_cold-Tl_cool))))*1.039+((-0.000729*$C61+0.001448)*(Tl_cool-Tavg_cold)+(0.016908*$C61-0.033574))*1.039))))*Watts","v":{"v":1268.6428136481286,"d":"1269"}},{"$f":"ROUND(((H61/Watts)/((Tr_cool-Tv_cool)*1.163))*$I$14,IF($X$4=1,0,IF($X$4=2,2)))","v":545},{"$f":"($AA$60*(I61/$I$14)^$AA$62)*$J$14","v":{"v":8.798266347816686,"d":"8.80"}},{"$f":"L61-8","v":{"v":34,"d":"34.0"}},{"v":42,"d":"42.0"},{"v":11.600000000000001,"d":"11.6"},{"$f":"AD61*Cubics","v":433},{"$f":"((($D61/Watts)/(((p_atm*0.028964)/(8.31447*(20+273.15)))*(($N61/3600)/Cubics)*(1005+1870*((0.622)/(((p_atm)/($E$12*Pvs_Heat_in))-1)))))+Tl_heat)*Celc1+Celc2","v":{"v":70.81361299987293,"d":"71"}},{"$f":"(Tl_cool-(($G61/Watts)/(1006*$N61*kgss)))*Celc1+Celc2","v":{"v":18.291777830913617,"d":"18"}},1,{"v":0.8831,"d":"0.883"},0,0,{"v":0.8831,"d":"0.883"},0,{"$f":"(H61-G61)/H61","v":{"v":0,"d":"0.0%"}},7495.699781998155,"b",1268.6428136481286,"b",{"v":42,"d":"42.0"},{"v":11.600000000000001,"d":"11.6"},433,{"$nulls":25},5486.35207,"b",1226.336878702652,"b",{"v":42,"d":"42.0"},{"v":11.600000000000001,"d":"11.6"},433,7495.699781998155,"b",1268.6428136481286,"b",{"v":42,"d":"42.0"},{"v":11.600000000000001,"d":"11.6"},433]
[null,{"v":0.8,"d":"80%"},8,{"$f":"(X62*($T$11^$Q62))*Watts*CF_Altit","v":{"v":9675.914742911562,"d":"9676"}},{"$f":"ROUND(((D62/Watts)/(($S$9-$S$10)*1.163))*$E$14,IF($X$4=1,0,IF($X$4=2,2)))","v":832},{"$f":"($Y$66*(E62/$E$14)^$Y$68)*$F$14","v":{"v":19.543066305604253,"d":"19.54"}},{"$f":"(Z62*($W$11^R62))*Watts*CF_Altit","v":{"v":1630.215353909805,"d":"1630"}},{"$f":"((G62/Watts)/(IF((237.3*LN((RH*EXP(17.27*(Tl_cool/(Tl_cool+237.3))))))/(17.27-LN((RH*EXP(17.27*(Tl_cool/(Tl_cool+237.3))))))<Tavg_cold,1,IF(1/(1+((2258*((0.622/(($Z$11/(1*611*EXP(17.27*(Tavg_cold/(Tavg_cold+237.3))))))-1)*1000-(0.622/(($Z$11/(RH*611*EXP(17.27*(Tl_cool/(Tl_cool+237.3))))))-1)*1000))/(1005*(Tavg_cold-Tl_cool))))*1.039+((-0.000729*$C62+0.001448)*(Tl_cool-Tavg_cold)+(0.016908*$C62-0.033574))*1.039>1,1,1/(1+((2258*((0.622/(($Z$11/(1*611*EXP(17.27*(Tavg_cold/(Tavg_cold+237.3))))))-1)*1000-(0.622/(($Z$11/(RH*611*EXP(17.27*(Tl_cool/(Tl_cool+237.3))))))-1)*1000))/(1005*(Tavg_cold-Tl_cool))))*1.039+((-0.000729*$C62+0.001448)*(Tl_cool-Tavg_cold)+(0.016908*$C62-0.033574))*1.039))))*Watts","v":{"v":1630.215353909805,"d":"1630"}},{"$f":"ROUND(((H62/Watts)/((Tr_cool-Tv_cool)*1.163))*$I$14,IF($X$4=1,0,IF($X$4=2,2)))","v":701},{"$f":"($AA$60*(I62/$I$14)^$AA$62)*$J$14","v":{"v":13.882723091543138,"d":"13.88"}},{"$f":"L62-8","v":{"v":41,"d":"41.0"}},{"v":49,"d":"49.0"},20.3,{"$f":"AD62*Cubics","v":587},{"$f":"((($D62/Watts)/(((p_atm*0.028964)/(8.31447*(20+273.15)))*(($N62/3600)/Cubics)*(1005+1870*((0.622)/(((p_atm)/($E$12*Pvs_Heat_in))-1)))))+Tl_heat)*Celc1+Celc2","v":{"v":68.3848857523475,"d":"68"}},{"$f":"(Tl_cool-(($G62/Watts)/(1006*$N62*kgss)))*Celc1+Celc2","v":{"v":18.745611394378436,"d":"19"}},1,{"v":0.8539,"d":"0.854"},0,0,{"v":0.8539,"d":"0.854"},0,{"$f":"(H62-G62)/H62","v":{"v":0,"d":"0.0%"}},9675.914742911562,1.8118808069056789,1630.215353909805,1.8118808069056789,{"v":49,"d":"49.0"},20.3,587,{"$nulls":25},6740.269929999999,1.82623,1589.6200401411263,1.9055926159320533,{"v":49,"d":"49.0"},20.3,587,9675.914742911562,1.8118808069056789,1630.215353909805,{"$f":"BL62","v":1.8118808069056789},{"v":49,"d":"49.0"},20.3,587]
[null,{"v":1,"d":"100%"},10,{"$f":"(X63*($T$11^$Q63))*Watts*CF_Altit","v":{"v":11568.871993029803,"d":"11569"}},{"$f":"ROUND(((D63/Watts)/(($S$9-$S$10)*1.163))*$E$14,IF($X$4=1,0,IF($X$4=2,2)))","v":995},{"$f":"($Y$66*(E63/$E$14)^$Y$68)*$F$14","v":{"v":27.018299401107992,"d":"27.02"}},{"$f":"(Z63*($W$11^R63))*Watts*CF_Altit","v":{"v":1973.0309538948848,"d":"1973"}},{"$f":"((G63/Watts)/(IF((237.3*LN((RH*EXP(17.27*(Tl_cool/(Tl_cool+237.3))))))/(17.27-LN((RH*EXP(17.27*(Tl_cool/(Tl_cool+237.3))))))<Tavg_cold,1,IF(1/(1+((2258*((0.622/(($Z$11/(1*611*EXP(17.27*(Tavg_cold/(Tavg_cold+237.3))))))-1)*1000-(0.622/(($Z$11/(RH*611*EXP(17.27*(Tl_cool/(Tl_cool+237.3))))))-1)*1000))/(1005*(Tavg_cold-Tl_cool))))*1.039+((-0.000729*$C63+0.001448)*(Tl_cool-Tavg_cold)+(0.016908*$C63-0.033574))*1.039>1,1,1/(1+((2258*((0.622/(($Z$11/(1*611*EXP(17.27*(Tavg_cold/(Tavg_cold+237.3))))))-1)*1000-(0.622/(($Z$11/(RH*611*EXP(17.27*(Tl_cool/(Tl_cool+237.3))))))-1)*1000))/(1005*(Tavg_cold-Tl_cool))))*1.039+((-0.000729*$C63+0.001448)*(Tl_cool-Tavg_cold)+(0.016908*$C63-0.033574))*1.039))))*Watts","v":{"v":1973.0309538948848,"d":"1973"}},{"$f":"ROUND(((H63/Watts)/((Tr_cool-Tv_cool)*1.163))*$I$14,IF($X$4=1,0,IF($X$4=2,2)))","v":848},{"$f":"($AA$60*(I63/$I$14)^$AA$62)*$J$14","v":{"v":19.600946455549366,"d":"19.60"}},{"$f":"L63-8","v":{"v":44,"d":"44.0"}},{"v":52,"d":"52.0"},{"v":30,"d":"30.0"},{"$f":"AD63*Cubics","v":683},{"$f":"((($D63/Watts)/(((p_atm*0.028964)/(8.31447*(20+273.15)))*(($N63/3600)/Cubics)*(1005+1870*((0.622)/(((p_atm)/($E$12*Pvs_Heat_in))-1)))))+Tl_heat)*Celc1+Celc2","v":{"v":69.71942531666502,"d":"70"}},{"$f":"(Tl_cool-(($G63/Watts)/(1006*$N63*kgss)))*Celc1+Celc2","v":{"v":18.413993198427534,"d":"18"}},1,{"v":0.7711,"d":"0.771"},0,0,{"v":0.7711,"d":"0.771"},0,{"$f":"(H63-G63)/H63","v":{"v":0,"d":"0.0%"}},11568.871993029803,0,1973.0309538948848,0,{"v":52,"d":"52.0"},{"v":30,"d":"30.0"},683,{"$nulls":25},7651.476149999998,null,1942.8883809438034,null,{"v":52,"d":"52.0"},{"v":30,"d":"30.0"},683,11568.871993029803,null,1973.0309538948848,null,{"v":52,"d":"52.0"},{"v":30,"d":"30.0"},683]
[null,{"$f":"IF($S$7=1,NL!A63,IF(cal!$S$7=2,EN!A63,IF(cal!$S$7=3,DE!A63,IF(cal!$S$7=4,FR!A63,IF(cal!$S$7=5,NR!A63,IF(cal!$S$7=6,SP!A63,IF(cal!$S$7=7,SW!A63,IF(cal!$S$7=8,TS!A63,IF(cal!$S$7=9,ExtraTaal1!A63,IF(cal!$S$7=10,ExtraTaal2!A63,IF(cal!$S$7=11,ExtraTaal3!A63,)))))))))))","v":"Clima Canal height 13 cm width 32 cm length 300 cm (Type 9)"},{"$f":"IF($S$7=1,NL!B63,IF(cal!$S$7=2,EN!B63,IF(cal!$S$7=3,DE!B63,IF(cal!$S$7=4,FR!B63,IF(cal!$S$7=5,NR!B63,IF(cal!$S$7=6,SP!B63,IF(cal!$S$7=7,SW!B63,IF(cal!$S$7=8,TS!B63,IF(cal!$S$7=9,ExtraTaal1!B63,IF(cal!$S$7=10,ExtraTaal2!B63,IF(cal!$S$7=11,ExtraTaal3!B63,)))))))))))","v":0},{"$f":"IF($S$7=1,NL!C63,IF(cal!$S$7=2,EN!C63,IF(cal!$S$7=3,DE!C63,IF(cal!$S$7=4,FR!C63,IF(cal!$S$7=5,NR!C63,IF(cal!$S$7=6,SP!C63,IF(cal!$S$7=7,SW!C63,IF(cal!$S$7=8,TS!C63,IF(cal!$S$7=9,ExtraTaal1!C63,IF(cal!$S$7=10,ExtraTaal2!C63,IF(cal!$S$7=11,ExtraTaal3!C63,)))))))))))","v":0},{"$f":"IF($S$7=1,NL!D63,IF(cal!$S$7=2,EN!D63,IF(cal!$S$7=3,DE!D63,IF(cal!$S$7=4,FR!D63,IF(cal!$S$7=5,NR!D63,IF(cal!$S$7=6,SP!D63,IF(cal!$S$7=7,SW!D63,IF(cal!$S$7=8,TS!D63,IF(cal!$S$7=9,ExtraTaal1!D63,IF(cal!$S$7=10,ExtraTaal2!D63,IF(cal!$S$7=11,ExtraTaal3!D63,)))))))))))","v":0},{"$f":"IF($S$7=1,NL!E63,IF(cal!$S$7=2,EN!E63,IF(cal!$S$7=3,DE!E63,IF(cal!$S$7=4,FR!E63,IF(cal!$S$7=5,NR!E63,IF(cal!$S$7=6,SP!E63,IF(cal!$S$7=7,SW!E63,IF(cal!$S$7=8,TS!E63,IF(cal!$S$7=9,ExtraTaal1!E63,IF(cal!$S$7=10,ExtraTaal2!E63,IF(cal!$S$7=11,ExtraTaal3!E63,)))))))))))","v":0},{"$f":"IF($S$7=1,NL!F63,IF(cal!$S$7=2,EN!F63,IF(cal!$S$7=3,DE!F63,IF(cal!$S$7=4,FR!F63,IF(cal!$S$7=5,NR!F63,IF(cal!$S$7=6,SP!F63,IF(cal!$S$7=7,SW!F63,IF(cal!$S$7=8,TS!F63,IF(cal!$S$7=9,ExtraTaal1!F63,IF(cal!$S$7=10,ExtraTaal2!F63,IF(cal!$S$7=11,ExtraTaal3!F63,)))))))))))","v":0},{"$f":"IF($S$7=1,NL!G63,IF(cal!$S$7=2,EN!G63,IF(cal!$S$7=3,DE!G63,IF(cal!$S$7=4,FR!G63,IF(cal!$S$7=5,NR!G63,IF(cal!$S$7=6,SP!G63,IF(cal!$S$7=7,SW!G63,IF(cal!$S$7=8,TS!G63,IF(cal!$S$7=9,ExtraTaal1!G63,IF(cal!$S$7=10,ExtraTaal2!G63,IF(cal!$S$7=11,ExtraTaal3!G63,)))))))))))","v":0},{"$f":"IF($S$7=1,NL!H63,IF(cal!$S$7=2,EN!H63,IF(cal!$S$7=3,DE!H63,IF(cal!$S$7=4,FR!H63,IF(cal!$S$7=5,NR!H63,IF(cal!$S$7=6,SP!H63,IF(cal!$S$7=7,SW!H63,IF(cal!$S$7=8,TS!H63,IF(cal!$S$7=9,ExtraTaal1!H63,IF(cal!$S$7=10,ExtraTaal2!H63,IF(cal!$S$7=11,ExtraTaal3!H63,)))))))))))","v":0},{"$f":"IF($S$7=1,NL!I63,IF(cal!$S$7=2,EN!I63,IF(cal!$S$7=3,DE!I63,IF(cal!$S$7=4,FR!I63,IF(cal!$S$7=5,NR!I63,IF(cal!$S$7=6,SP!I63,IF(cal!$S$7=7,SW!I63,IF(cal!$S$7=8,TS!I63,IF(cal!$S$7=9,ExtraTaal1!I63,IF(cal!$S$7=10,ExtraTaal2!I63,IF(cal!$S$7=11,ExtraTaal3!I63,)))))))))))","v":0},{"$f":"IF($S$7=1,NL!J63,IF(cal!$S$7=2,EN!J63,IF(cal!$S$7=3,DE!J63,IF(cal!$S$7=4,FR!J63,IF(cal!$S$7=5,NR!J63,IF(cal!$S$7=6,SP!J63,IF(cal!$S$7=7,SW!J63,IF(cal!$S$7=8,TS!J63,IF(cal!$S$7=9,ExtraTaal1!J63,IF(cal!$S$7=10,ExtraTaal2!J63,IF(cal!$S$7=11,ExtraTaal3!J63,)))))))))))","v":0},{"$f":"IF($S$7=1,NL!K63,IF(cal!$S$7=2,EN!K63,IF(cal!$S$7=3,DE!K63,IF(cal!$S$7=4,FR!K63,IF(cal!$S$7=5,NR!K63,IF(cal!$S$7=6,SP!K63,IF(cal!$S$7=7,SW!K63,IF(cal!$S$7=8,TS!K63,IF(cal!$S$7=9,ExtraTaal1!K63,IF(cal!$S$7=10,ExtraTaal2!K63,IF(cal!$S$7=11,ExtraTaal3!K63,)))))))))))","v":0},{"$f":"IF($S$7=1,NL!L63,IF(cal!$S$7=2,EN!L63,IF(cal!$S$7=3,DE!L63,IF(cal!$S$7=4,FR!L63,IF(cal!$S$7=5,NR!L63,IF(cal!$S$7=6,SP!L63,IF(cal!$S$7=7,SW!L63,IF(cal!$S$7=8,TS!L63,IF(cal!$S$7=9,ExtraTaal1!L63,IF(cal!$S$7=10,ExtraTaal2!L63,IF(cal!$S$7=11,ExtraTaal3!L63,)))))))))))","v":0},{"$f":"IF($S$7=1,NL!M63,IF(cal!$S$7=2,EN!M63,IF(cal!$S$7=3,DE!M63,IF(cal!$S$7=4,FR!M63,IF(cal!$S$7=5,NR!M63,IF(cal!$S$7=6,SP!M63,IF(cal!$S$7=7,SW!M63,IF(cal!$S$7=8,TS!M63,IF(cal!$S$7=9,ExtraTaal1!M63,IF(cal!$S$7=10,ExtraTaal2!M63,IF(cal!$S$7=11,ExtraTaal3!M63,)))))))))))","v":0},{"$f":"IF($S$7=1,NL!N63,IF(cal!$S$7=2,EN!N63,IF(cal!$S$7=3,DE!N63,IF(cal!$S$7=4,FR!N63,IF(cal!$S$7=5,NR!N63,IF(cal!$S$7=6,SP!N63,IF(cal!$S$7=7,SW!N63,IF(cal!$S$7=8,TS!N63,IF(cal!$S$7=9,ExtraTaal1!N63,IF(cal!$S$7=10,ExtraTaal2!N63,IF(cal!$S$7=11,ExtraTaal3!N63,)))))))))))","v":0},{"$f":"IF($S$7=1,NL!O63,IF(cal!$S$7=2,EN!O63,IF(cal!$S$7=3,DE!O63,IF(cal!$S$7=4,FR!O63,IF(cal!$S$7=5,NR!O63,IF(cal!$S$7=6,SP!O63,IF(cal!$S$7=7,SW!O63,IF(cal!$S$7=8,TS!O63,IF(cal!$S$7=9,ExtraTaal1!O63,IF(cal!$S$7=10,ExtraTaal2!O63,IF(cal!$S$7=11,ExtraTaal3!O63,)))))))))))","v":0},"n-value","n-value","n-value","n-value","n-value","n-value",null,"H",13,"B",32,"L",280,0,{"$nulls":25},"H",{"$f":"BE22","v":13},"B",{"$f":"BG22","v":32},"L",{"$f":"IF($X$4=1,280,280/2.54)","v":280},null,"H",{"$f":"BL22","v":13},"B",{"$f":"BN22","v":32},"L",{"$f":"IF($X$4=1,280,280/2.54)","v":280}]
[null,{"v":0.2,"d":"20%"},2,{"$f":"(X65*($T$11^$Q65))*Watts*CF_Altit","v":{"v":2460.2200000000003,"d":"2460"}},{"$f":"ROUND(((D65/Watts)/(($S$9-$S$10)*1.163))*$E$14,IF($X$4=1,0,IF($X$4=2,2)))","v":212},{"$f":"($Y$66*(E65/$E$14)^$Y$68)*$F$14","v":{"v":1.6444387112676684,"d":"1.64"}},{"$f":"(Z65*($W$11^R65))*Watts*CF_Altit","v":{"v":529.396,"d":"529"}},{"$f":"((G65/Watts)/(IF((237.3*LN((RH*EXP(17.27*(Tl_cool/(Tl_cool+237.3))))))/(17.27-LN((RH*EXP(17.27*(Tl_cool/(Tl_cool+237.3))))))<Tavg_cold,1,IF(1/(1+((2258*((0.622/(($Z$11/(1*611*EXP(17.27*(Tavg_cold/(Tavg_cold+237.3))))))-1)*1000-(0.622/(($Z$11/(RH*611*EXP(17.27*(Tl_cool/(Tl_cool+237.3))))))-1)*1000))/(1005*(Tavg_cold-Tl_cool))))*1.039+((-0.000729*$C65+0.001448)*(Tl_cool-Tavg_cold)+(0.016908*$C65-0.033574))*1.039>1,1,1/(1+((2258*((0.622/(($Z$11/(1*611*EXP(17.27*(Tavg_cold/(Tavg_cold+237.3))))))-1)*1000-(0.622/(($Z$11/(RH*611*EXP(17.27*(Tl_cool/(Tl_cool+237.3))))))-1)*1000))/(1005*(Tavg_cold-Tl_cool))))*1.039+((-0.000729*$C65+0.001448)*(Tl_cool-Tavg_cold)+(0.016908*$C65-0.033574))*1.039))))*Watts","v":{"v":529.396,"d":"529"}},{"$f":"ROUND(((H65/Watts)/((Tr_cool-Tv_cool)*1.163))*$I$14,IF($X$4=1,0,IF($X$4=2,2)))","v":228},{"$f":"($AA$66*(I65/$I$14)^$AA$68)*$J$14","v":{"v":1.87595988904386,"d":"1.88"}},{"$f":"L65-8","v":{"v":25,"d":"25.0"}},{"$f":"AB65","v":{"v":33,"d":"33.0"}},4.8,{"$f":"AD65*Cubics","v":142},{"$f":"((($D65/Watts)/(((p_atm*0.028964)/(8.31447*(20+273.15)))*(($N65/3600)/Cubics)*(1005+1870*((0.622)/(((p_atm)/($E$12*Pvs_Heat_in))-1)))))+Tl_heat)*Celc1+Celc2","v":{"v":70.85590515490642,"d":"71"}},{"$f":"(Tl_cool-(($G65/Watts)/(1006*$N65*kgss)))*Celc1+Celc2","v":{"v":15.919219696560225,"d":"16"}},1,{"v":0.7807,"d":"0.781"},0,0,{"v":0.7807,"d":"0.781"},0,{"$f":"(H65-G65)/H65","v":{"v":0,"d":"0.0%"}},2460.2200000000003,"a",529.396,"a",{"v":33,"d":"33.0"},4.8,142,{"$nulls":25},2110.58,"a",508.319,"a",{"v":33,"d":"33.0"},4.8,142,2460.2200000000003,"a",529.396,"a",{"$f":"BH65","v":{"v":33,"d":"33.0"}},4.8,142]
[null,{"v":0.4,"d":"40%"},4,{"$f":"(X66*($T$11^$Q66))*Watts*CF_Altit","v":{"v":5441.28,"d":"5441"}},{"$f":"ROUND(((D66/Watts)/(($S$9-$S$10)*1.163))*$E$14,IF($X$4=1,0,IF($X$4=2,2)))","v":468},{"$f":"($Y$66*(E66/$E$14)^$Y$68)*$F$14","v":{"v":6.896393348559132,"d":"6.90"}},{"$f":"(Z66*($W$11^R66))*Watts*CF_Altit","v":{"v":961.2700000000001,"d":"961"}},{"$f":"((G66/Watts)/(IF((237.3*LN((RH*EXP(17.27*(Tl_cool/(Tl_cool+237.3))))))/(17.27-LN((RH*EXP(17.27*(Tl_cool/(Tl_cool+237.3))))))<Tavg_cold,1,IF(1/(1+((2258*((0.622/(($Z$11/(1*611*EXP(17.27*(Tavg_cold/(Tavg_cold+237.3))))))-1)*1000-(0.622/(($Z$11/(RH*611*EXP(17.27*(Tl_cool/(Tl_cool+237.3))))))-1)*1000))/(1005*(Tavg_cold-Tl_cool))))*1.039+((-0.000729*$C66+0.001448)*(Tl_cool-Tavg_cold)+(0.016908*$C66-0.033574))*1.039>1,1,1/(1+((2258*((0.622/(($Z$11/(1*611*EXP(17.27*(Tavg_cold/(Tavg_cold+237.3))))))-1)*1000-(0.622/(($Z$11/(RH*611*EXP(17.27*(Tl_cool/(Tl_cool+237.3))))))-1)*1000))/(1005*(Tavg_cold-Tl_cool))))*1.039+((-0.000729*$C66+0.001448)*(Tl_cool-Tavg_cold)+(0.016908*$C66-0.033574))*1.039))))*Watts","v":{"v":961.2700000000001,"d":"961"}},{"$f":"ROUND(((H66/Watts)/((Tr_cool-Tv_cool)*1.163))*$I$14,IF($X$4=1,0,IF($X$4=2,2)))","v":413},{"$f":"($AA$66*(I66/$I$14)^$AA$68)*$J$14","v":{"v":5.499542141797976,"d":"5.50"}},{"$f":"L66-8","v":{"v":31,"d":"31.0"}},{"v":39,"d":"39.0"},{"v":8,"d":"8.0"},{"$f":"AD66*Cubics","v":313},{"$f":"((($D66/Watts)/(((p_atm*0.028964)/(8.31447*(20+273.15)))*(($N66/3600)/Cubics)*(1005+1870*((0.622)/(((p_atm)/($E$12*Pvs_Heat_in))-1)))))+Tl_heat)*Celc1+Celc2","v":{"v":71.02846744475806,"d":"71"}},{"$f":"(Tl_cool-(($G66/Watts)/(1006*$N66*kgss)))*Celc1+Celc2","v":{"v":17.871927426239996,"d":"18"}},1,{"v":0.8587,"d":"0.859"},0,0,{"v":0.8587,"d":"0.859"},0,{"$f":"(H66-G66)/H66","v":{"v":0,"d":"0.0%"}},5441.28,0.000101039,961.2700000000001,0.000101039,{"v":39,"d":"39.0"},{"v":8,"d":"8.0"},313,{"$nulls":25},4209.139999999999,0.000123339,923.09,2.4628161336117e-05,{"v":39,"d":"39.0"},{"v":8,"d":"8.0"},313,5441.28,0.000101039,961.2700000000001,{"$f":"BL66","v":0.000101039},{"v":39,"d":"39.0"},{"v":8,"d":"8.0"},313]
[null,{"v":0.6,"d":"60%"},6,{"$f":"(X67*($T$11^$Q67))*Watts*CF_Altit","v":{"v":8111.299999999999,"d":"8111"}},{"$f":"ROUND(((D67/Watts)/(($S$9-$S$10)*1.163))*$E$14,IF($X$4=1,0,IF($X$4=2,2)))","v":697},{"$f":"($Y$66*(E67/$E$14)^$Y$68)*$F$14","v":{"v":14.183792323153156,"d":"14.18"}},{"$f":"(Z67*($W$11^R67))*Watts*CF_Altit","v":{"v":1372.83,"d":"1373"}},{"$f":"((G67/Watts)/(IF((237.3*LN((RH*EXP(17.27*(Tl_cool/(Tl_cool+237.3))))))/(17.27-LN((RH*EXP(17.27*(Tl_cool/(Tl_cool+237.3))))))<Tavg_cold,1,IF(1/(1+((2258*((0.622/(($Z$11/(1*611*EXP(17.27*(Tavg_cold/(Tavg_cold+237.3))))))-1)*1000-(0.622/(($Z$11/(RH*611*EXP(17.27*(Tl_cool/(Tl_cool+237.3))))))-1)*1000))/(1005*(Tavg_cold-Tl_cool))))*1.039+((-0.000729*$C67+0.001448)*(Tl_cool-Tavg_cold)+(0.016908*$C67-0.033574))*1.039>1,1,1/(1+((2258*((0.622/(($Z$11/(1*611*EXP(17.27*(Tavg_cold/(Tavg_cold+237.3))))))-1)*1000-(0.622/(($Z$11/(RH*611*EXP(17.27*(Tl_cool/(Tl_cool+237.3))))))-1)*1000))/(1005*(Tavg_cold-Tl_cool))))*1.039+((-0.000729*$C67+0.001448)*(Tl_cool-Tavg_cold)+(0.016908*$C67-0.033574))*1.039))))*Watts","v":{"v":1372.83,"d":"1373"}},{"$f":"ROUND(((H67/Watts)/((Tr_cool-Tv_cool)*1.163))*$I$14,IF($X$4=1,0,IF($X$4=2,2)))","v":590},{"$f":"($AA$66*(I67/$I$14)^$AA$68)*$J$14","v":{"v":10.489538845374183,"d":"10.49"}},{"$f":"L67-8","v":{"v":35,"d":"35.0"}},{"v":43,"d":"43.0"},14.8,{"$f":"AD67*Cubics","v":481},{"$f":"((($D67/Watts)/(((p_atm*0.028964)/(8.31447*(20+273.15)))*(($N67/3600)/Cubics)*(1005+1870*((0.622)/(((p_atm)/($E$12*Pvs_Heat_in))-1)))))+Tl_heat)*Celc1+Celc2","v":{"v":69.49954148125127,"d":"69"}},{"$f":"(Tl_cool-(($G67/Watts)/(1006*$N67*kgss)))*Celc1+Celc2","v":{"v":18.51699510014734,"d":"19"}},1,{"v":0.8831,"d":"0.883"},0,0,{"v":0.8831,"d":"0.883"},0,{"$f":"(H67-G67)/H67","v":{"v":0,"d":"0.0%"}},8111.299999999999,"b",1372.83,"b",{"v":43,"d":"43.0"},14.8,481,{"$nulls":25},5936.909999999999,"b",1327.07,"b",{"v":43,"d":"43.0"},14.8,481,8111.299999999999,"b",1372.83,"b",{"v":43,"d":"43.0"},14.8,481]
[null,{"v":0.8,"d":"80%"},8,{"$f":"(X68*($T$11^$Q68))*Watts*CF_Altit","v":{"v":10470.7,"d":"10471"}},{"$f":"ROUND(((D68/Watts)/(($S$9-$S$10)*1.163))*$E$14,IF($X$4=1,0,IF($X$4=2,2)))","v":900},{"$f":"($Y$66*(E68/$E$14)^$Y$68)*$F$14","v":{"v":22.52999270464744,"d":"22.53"}},{"$f":"(Z68*($W$11^R68))*Watts*CF_Altit","v":{"v":1764.1099999999997,"d":"1764"}},{"$f":"((G68/Watts)/(IF((237.3*LN((RH*EXP(17.27*(Tl_cool/(Tl_cool+237.3))))))/(17.27-LN((RH*EXP(17.27*(Tl_cool/(Tl_cool+237.3))))))<Tavg_cold,1,IF(1/(1+((2258*((0.622/(($Z$11/(1*611*EXP(17.27*(Tavg_cold/(Tavg_cold+237.3))))))-1)*1000-(0.622/(($Z$11/(RH*611*EXP(17.27*(Tl_cool/(Tl_cool+237.3))))))-1)*1000))/(1005*(Tavg_cold-Tl_cool))))*1.039+((-0.000729*$C68+0.001448)*(Tl_cool-Tavg_cold)+(0.016908*$C68-0.033574))*1.039>1,1,1/(1+((2258*((0.622/(($Z$11/(1*611*EXP(17.27*(Tavg_cold/(Tavg_cold+237.3))))))-1)*1000-(0.622/(($Z$11/(RH*611*EXP(17.27*(Tl_cool/(Tl_cool+237.3))))))-1)*1000))/(1005*(Tavg_cold-Tl_cool))))*1.039+((-0.000729*$C68+0.001448)*(Tl_cool-Tavg_cold)+(0.016908*$C68-0.033574))*1.039))))*Watts","v":{"v":1764.1099999999997,"d":"1764"}},{"$f":"ROUND(((H68/Watts)/((Tr_cool-Tv_cool)*1.163))*$I$14,IF($X$4=1,0,IF($X$4=2,2)))","v":758},{"$f":"($AA$66*(I68/$I$14)^$AA$68)*$J$14","v":{"v":16.510330960991837,"d":"16.51"}},{"$f":"L68-8","v":{"v":42,"d":"42.0"}},{"v":50,"d":"50.0"},26.2,{"$f":"AD68*Cubics","v":638},{"$f":"((($D68/Watts)/(((p_atm*0.028964)/(8.31447*(20+273.15)))*(($N68/3600)/Cubics)*(1005+1870*((0.622)/(((p_atm)/($E$12*Pvs_Heat_in))-1)))))+Tl_heat)*Celc1+Celc2","v":{"v":68.17379121342307,"d":"68"}},{"$f":"(Tl_cool-(($G68/Watts)/(1006*$N68*kgss)))*Celc1+Celc2","v":{"v":18.781680593078434,"d":"19"}},1,{"v":0.8539,"d":"0.854"},0,0,{"v":0.8539,"d":"0.854"},0,{"$f":"(H68-G68)/H68","v":{"v":0,"d":"0.0%"}},10470.7,1.81037,1764.1099999999997,1.81037,{"v":50,"d":"50.0"},26.2,638,{"$nulls":25},7294.000000000001,1.82411,1720.18,1.8911334099329,{"v":50,"d":"50.0"},26.2,638,10470.7,1.81037,1764.1099999999997,{"$f":"BL68","v":1.81037},{"v":50,"d":"50.0"},26.2,638]
[null,{"v":1,"d":"100%"},10,{"$f":"(X69*($T$11^$Q69))*Watts*CF_Altit","v":{"v":12519.2,"d":"12519"}},{"$f":"ROUND(((D69/Watts)/(($S$9-$S$10)*1.163))*$E$14,IF($X$4=1,0,IF($X$4=2,2)))","v":1076},{"$f":"($Y$66*(E69/$E$14)^$Y$68)*$F$14","v":{"v":31.13085301525779,"d":"31.13"}},{"$f":"(Z69*($W$11^R69))*Watts*CF_Altit","v":{"v":2135.09,"d":"2135"}},{"$f":"((G69/Watts)/(IF((237.3*LN((RH*EXP(17.27*(Tl_cool/(Tl_cool+237.3))))))/(17.27-LN((RH*EXP(17.27*(Tl_cool/(Tl_cool+237.3))))))<Tavg_cold,1,IF(1/(1+((2258*((0.622/(($Z$11/(1*611*EXP(17.27*(Tavg_cold/(Tavg_cold+237.3))))))-1)*1000-(0.622/(($Z$11/(RH*611*EXP(17.27*(Tl_cool/(Tl_cool+237.3))))))-1)*1000))/(1005*(Tavg_cold-Tl_cool))))*1.039+((-0.000729*$C69+0.001448)*(Tl_cool-Tavg_cold)+(0.016908*$C69-0.033574))*1.039>1,1,1/(1+((2258*((0.622/(($Z$11/(1*611*EXP(17.27*(Tavg_cold/(Tavg_cold+237.3))))))-1)*1000-(0.622/(($Z$11/(RH*611*EXP(17.27*(Tl_cool/(Tl_cool+237.3))))))-1)*1000))/(1005*(Tavg_cold-Tl_cool))))*1.039+((-0.000729*$C69+0.001448)*(Tl_cool-Tavg_cold)+(0.016908*$C69-0.033574))*1.039))))*Watts","v":{"v":2135.09,"d":"2135"}},{"$f":"ROUND(((H69/Watts)/((Tr_cool-Tv_cool)*1.163))*$I$14,IF($X$4=1,0,IF($X$4=2,2)))","v":918},{"$f":"($AA$66*(I69/$I$14)^$AA$68)*$J$14","v":{"v":23.35234746783593,"d":"23.35"}},{"$f":"L69-8","v":{"v":45,"d":"45.0"}},{"v":53,"d":"53.0"},38.8,{"$f":"AD69*Cubics","v":748},{"$f":"((($D69/Watts)/(((p_atm*0.028964)/(8.31447*(20+273.15)))*(($N69/3600)/Cubics)*(1005+1870*((0.622)/(((p_atm)/($E$12*Pvs_Heat_in))-1)))))+Tl_heat)*Celc1+Celc2","v":{"v":69.12819043452205,"d":"69"}},{"$f":"(Tl_cool-(($G69/Watts)/(1006*$N69*kgss)))*Celc1+Celc2","v":{"v":18.516157024135136,"d":"19"}},1,{"v":0.7711,"d":"0.771"},0,0,{"v":0.7711,"d":"0.771"},0,{"$f":"(H69-G69)/H69","v":{"v":0,"d":"0.0%"}},12519.2,0,2135.09,0,{"v":53,"d":"53.0"},38.8,748,{"$nulls":25},8280,null,2102.47,null,{"v":53,"d":"53.0"},38.8,748,12519.2,null,2135.09,null,{"v":53,"d":"53.0"},38.8,748]
[null,{"$f":"IF($S$7=1,NL!A69,IF(cal!$S$7=2,EN!A69,IF(cal!$S$7=3,DE!A69,IF(cal!$S$7=4,FR!A69,IF(cal!$S$7=5,NR!A69,IF(cal!$S$7=6,SP!A69,IF(cal!$S$7=7,SW!A69,IF(cal!$S$7=8,TS!A69,IF(cal!$S$7=9,ExtraTaal1!A69,IF(cal!$S$7=10,ExtraTaal2!A69,IF(cal!$S$7=11,ExtraTaal3!A69,)))))))))))","v":"*Values according to EN 16430"},{"$nulls":11},{"$f":"'Clima Canal'!P71","v":"v2022-12-13"},{"$nulls":9},"H",13,"B",32,"L",300,0,{"$nulls":25},"H",{"$f":"BE22","v":13},"B",{"$f":"BG22","v":32},"L",{"$f":"IF($X$4=1,300,300/2.54)","v":300},null,"H",{"$f":"BL22","v":13},"B",{"$f":"BN22","v":32},"L",{"$f":"IF($X$4=1,300,300/2.54)","v":300}]
[null,{"$f":"IF($S$7=1,NL!A70,IF(cal!$S$7=2,EN!A70,IF(cal!$S$7=3,DE!A70,IF(cal!$S$7=4,FR!A70,IF(cal!$S$7=5,NR!A70,IF(cal!$S$7=6,SP!A70,IF(cal!$S$7=7,SW!A70,IF(cal!$S$7=8,TS!A70,IF(cal!$S$7=9,ExtraTaal1!A70,IF(cal!$S$7=10,ExtraTaal2!A70,IF(cal!$S$7=11,ExtraTaal3!A70,)))))))))))","v":"**Sound power according to ISO 3741:2010"}]
[null,{"$f":"IF($S$7=1,NL!A71,IF(cal!$S$7=2,EN!A71,IF(cal!$S$7=3,DE!A71,IF(cal!$S$7=4,FR!A71,IF(cal!$S$7=5,NR!A71,IF(cal!$S$7=6,SP!A71,IF(cal!$S$7=7,SW!A71,IF(cal!$S$7=8,TS!A71,IF(cal!$S$7=9,ExtraTaal1!A71,IF(cal!$S$7=10,ExtraTaal2!A71,IF(cal!$S$7=11,ExtraTaal3!A71,)))))))))))","v":"***Sound pressure with an assumed room damping of 8dB(A)"}]

{"sheet":"NL","index":2,"n_rows":71,"n_cols":18,"rows_kept":71,"hidden":true,"merged":[[5,11,5,12],[6,11,6,12],[7,0,7,2],[7,5,7,8],[7,11,7,12],[8,0,8,2],[8,5,8,8],[9,0,9,2],[9,5,9,8],[10,5,10,7],[14,0,14,12],[20,0,20,12],[26,0,26,12],[32,0,32,12],[38,0,38,12],[44,0,44,12],[50,0,50,12],[56,0,56,12],[62,0,62,12]]}
[]
["Invulformulier"]
[]
["Randvoorwaarden"]
[]
["Temperaturen",{"$nulls":10},"Geplaatste hoogte"]
["Verwarmen:",{"$nulls":4},"Koelen:",{"$nulls":10},"Kopieer alle data"]
[{"$f":"\"Aanvoertemp.\"","v":"Aanvoertemp."},null,null,{"$f":"cal!E9","v":75},{"$f":"IF(cal!$X$4=1,\"°C\",IF(cal!$X$4=2,\"°F\"))","v":"°C"},{"$f":"A8","v":"Aanvoertemp."},{"$nulls":3},{"$f":"cal!K9","v":16},{"$f":"E8","v":"°C"},"Eenheidsstelsel",{"$nulls":4},"SI-eenheden"]
[{"$f":"\"Retourtemp.\"","v":"Retourtemp."},null,null,{"$f":"cal!E10","v":65},{"$f":"E8","v":"°C"},{"$f":"A9","v":"Retourtemp."},{"$nulls":3},{"$f":"cal!K10","v":18},{"$f":"E8","v":"°C"},{"$nulls":5},"Imperiale-eenheden"]
[{"$f":"\"Ruimtetemp.\"","v":"Ruimtetemp."},null,null,{"$f":"cal!E11","v":20},{"$f":"E8","v":"°C"},{"$f":"A10","v":"Ruimtetemp."},{"$nulls":3},{"$f":"cal!K11","v":27},{"$f":"E8","v":"°C"}]
[{"$nulls":5},"Relatieve vochtigheid",{"$nulls":3},{"$f":"cal!K12","v":{"v":0.5,"d":"50%"}}]
[]
[]
["Snelheidsniveau:","Stuurspanning: [V]",{"$f":"CONCATENATE(\"Warmteafgifte * \",ROUND(D8,0),\"/\",ROUND(D9,0),\"/\",ROUND(D10,0),\" [\"&IF(cal!$X$4=1,\"W\",IF(cal!$X$4=2,\"Btu/h\"))&\"]\")","v":"Warmteafgifte * 75/65/20 [W]"},{"$f":"\"Waterdebiet, verwarming [\"&IF(cal!$X$4=1,\"l/h\",IF(cal!$X$4=2,\"GPM\"))&\"]\"","v":"Waterdebiet, verwarming [l/h]"},{"$f":"\"Waterzijdig drukverlies [\"&IF(cal!$X$4=1,\"kPa\",IF(cal!$X$4=2,\"inH2O\"))&\"]\"","v":"Waterzijdig drukverlies [kPa]"},{"$f":"CONCATENATE(\"Voelb. Koelcapaciteit * \",ROUND(J8,0),\"/\",,ROUND(J9,0),\"/\",,ROUND(J10,0),\" [\"&IF(cal!$X$4=1,\"W\",IF(cal!$X$4=2,\"Btu/h\"))&\"]\")","v":"Voelb. Koelcapaciteit * 16/18/27 [W]"},{"$f":"CONCATENATE(\"Tot. koelcapaciteit \",,ROUND(J8,0),\"/\",,ROUND(J9,0),\"/\",,ROUND(J10,0),\" [\"&IF(cal!$X$4=1,\"W\",IF(cal!$X$4=2,\"Btu/h\"))&\"]\")","v":"Tot. koelcapaciteit 16/18/27 [W]"},{"$f":"\"Waterdebiet, koeling [\"&IF(cal!$X$4=1,\"l/h\",IF(cal!$X$4=2,\"GPM\"))&\"]\"","v":"Waterdebiet, koeling [l/h]"},{"$f":"\"Waterzijdig drukverlies [\"&IF(cal!$X$4=1,\"kPa\",IF(cal!$X$4=2,\"inH2O\"))&\"]\"","v":"Waterzijdig drukverlies [kPa]"},"Geluidsdruk *** [dB(A)]","Geluidsvermogen ** [dB(A)]","Opgenomen elektr. vermogen [W]",{"$f":"\"Luchtdebiet [\"&IF(cal!$X$4=1,\"m³/h\",IF(cal!$X$4=2,\"CFM\"))&\"]\"","v":"Luchtdebiet [m³/h]"},{"$f":"\"Uitblaastemp. verwarming [\"&IF(cal!$X$4=1,\"°C\",IF(cal!$X$4=2,\"°F\"))&\"]\"","v":"Uitblaastemp. verwarming [°C]"},{"$f":"\"Uitblaastemp. koeling [\"&IF(cal!$X$4=1,\"°C\",IF(cal!$X$4=2,\"°F\"))&\"]\"","v":"Uitblaastemp. koeling [°C]"}]
[{"$f":"cal!$AF$1&\" \"&$R$15&\" \"&ROUND(cal!Y22,1)&IF(cal!$X$4=1,\" cm\",IF(cal!$X$4=2,\" in\"))&\" \"&$R$16&\" \"&ROUND(cal!AA22,1)&IF(cal!$X$4=1,\" cm\",IF(cal!$X$4=2,\" in\"))&\" \"&$R$17&\" \"&ROUND(cal!AC22,1)&IF(cal!$X$4=1,\" cm\",IF(cal!$X$4=2,\" in\"))&\" (Type 1)\"","v":"Clima Canal hoogte 13 cm breedte 32 cm lengte 70 cm (Type 1)"},{"$nulls":15},"Temp.","hoogte"]
[{"$nulls":16},"verw.!","breedte"]
[{"$nulls":16},"koelen!","lengte"]
[]
[]
[]
[{"$f":"cal!$AF$1&\" \"&$R$15&\" \"&ROUND(cal!Y28,1)&IF(cal!$X$4=1,\" cm\",IF(cal!$X$4=2,\" in\"))&\" \"&$R$16&\" \"&ROUND(cal!AA28,1)&IF(cal!$X$4=1,\" cm\",IF(cal!$X$4=2,\" in\"))&\" \"&$R$17&\" \"&ROUND(cal!AC28,1)&IF(cal!$X$4=1,\" cm\",IF(cal!$X$4=2,\" in\"))&\" (Type 2)\"","v":"Clima Canal hoogte 13 cm breedte 32 cm lengte 100 cm (Type 2)"}]
[]
[]
[]
[]
[]
[{"$f":"cal!$AF$1&\" \"&$R$15&\" \"&ROUND(cal!Y34,1)&IF(cal!$X$4=1,\" cm\",IF(cal!$X$4=2,\" in\"))&\" \"&$R$16&\" \"&ROUND(cal!AA34,1)&IF(cal!$X$4=1,\" cm\",IF(cal!$X$4=2,\" in\"))&\" \"&$R$17&\" \"&ROUND(cal!AC34,1)&IF(cal!$X$4=1,\" cm\",IF(cal!$X$4=2,\" in\"))&\" (Type 3)\"","v":"Clima Canal hoogte 13 cm breedte 32 cm lengte 120 cm (Type 3)"}]
[]
[]
[]
[]
[]
[{"$f":"cal!$AF$1&\" \"&$R$15&\" \"&ROUND(cal!Y40,1)&IF(cal!$X$4=1,\" cm\",IF(cal!$X$4=2,\" in\"))&\" \"&$R$16&\" \"&ROUND(cal!AA40,1)&IF(cal!$X$4=1,\" cm\",IF(cal!$X$4=2,\" in\"))&\" \"&$R$17&\" \"&ROUND(cal!AC40,1)&IF(cal!$X$4=1,\" cm\",IF(cal!$X$4=2,\" in\"))&\" (Type 4)\"","v":"Clima Canal hoogte 13 cm breedte 32 cm lengte 140 cm (Type 4)"}]
[]
[]
[]
[]
[]
[{"$f":"cal!$AF$1&\" \"&$R$15&\" \"&ROUND(cal!Y46,1)&IF(cal!$X$4=1,\" cm\",IF(cal!$X$4=2,\" in\"))&\" \"&$R$16&\" \"&ROUND(cal!AA46,1)&IF(cal!$X$4=1,\" cm\",IF(cal!$X$4=2,\" in\"))&\" \"&$R$17&\" \"&ROUND(cal!AC46,1)&IF(cal!$X$4=1,\" cm\",IF(cal!$X$4=2,\" in\"))&\" (Type 5)\"","v":"Clima Canal hoogte 13 cm breedte 32 cm lengte 170 cm (Type 5)"}]
[]
[]
[]
[]
[]
[{"$f":"cal!$AF$1&\" \"&$R$15&\" \"&ROUND(cal!Y52,1)&IF(cal!$X$4=1,\" cm\",IF(cal!$X$4=2,\" in\"))&\" \"&$R$16&\" \"&ROUND(cal!AA52,1)&IF(cal!$X$4=1,\" cm\",IF(cal!$X$4=2,\" in\"))&\" \"&$R$17&\" \"&ROUND(cal!AC52,1)&IF(cal!$X$4=1,\" cm\",IF(cal!$X$4=2,\" in\"))&\" (Type 6)\"","v":"Clima Canal hoogte 13 cm breedte 32 cm lengte 200 cm (Type 6)"}]
[]
[]
[]
[]
[]
[{"$f":"cal!$AF$1&\" \"&$R$15&\" \"&ROUND(cal!Y58,1)&IF(cal!$X$4=1,\" cm\",IF(cal!$X$4=2,\" in\"))&\" \"&$R$16&\" \"&ROUND(cal!AA58,1)&IF(cal!$X$4=1,\" cm\",IF(cal!$X$4=2,\" in\"))&\" \"&$R$17&\" \"&ROUND(cal!AC58,1)&IF(cal!$X$4=1,\" cm\",IF(cal!$X$4=2,\" in\"))&\" (Type 7)\"","v":"Clima Canal hoogte 13 cm breedte 32 cm lengte 230 cm (Type 7)"}]
[]
[]
[]
[]
[]
[{"$f":"cal!$AF$1&\" \"&$R$15&\" \"&ROUND(cal!Y64,1)&IF(cal!$X$4=1,\" cm\",IF(cal!$X$4=2,\" in\"))&\" \"&$R$16&\" \"&ROUND(cal!AA64,1)&IF(cal!$X$4=1,\" cm\",IF(cal!$X$4=2,\" in\"))&\" \"&$R$17&\" \"&ROUND(cal!AC64,1)&IF(cal!$X$4=1,\" cm\",IF(cal!$X$4=2,\" in\"))&\" (Type 8)\"","v":"Clima Canal hoogte 13 cm breedte 32 cm lengte 280 cm (Type 8)"}]
[]
[]
[]
[]
[]
[{"$f":"cal!$AF$1&\" \"&$R$15&\" \"&ROUND(cal!Y70,1)&IF(cal!$X$4=1,\" cm\",IF(cal!$X$4=2,\" in\"))&\" \"&$R$16&\" \"&ROUND(cal!AA70,1)&IF(cal!$X$4=1,\" cm\",IF(cal!$X$4=2,\" in\"))&\" \"&$R$17&\" \"&ROUND(cal!AC70,1)&IF(cal!$X$4=1,\" cm\",IF(cal!$X$4=2,\" in\"))&\" (Type 9)\"","v":"Clima Canal hoogte 13 cm breedte 32 cm lengte 300 cm (Type 9)"}]
[]
[]
[]
[]
[]
["*Waardes gemeten volgens EN 16430",{"$nulls":11},{"$f":"cal!N70","v":"v2022-12-13"}]
["**Geluidsvermogen gemeten volgens ISO 3741:2010"]
["***Geluidsdruk bij een aangenomen ruimtedemping van 8 dB(A)"]

{"sheet":"EN","index":3,"n_rows":71,"n_cols":18,"rows_kept":71,"hidden":true,"merged":[[5,11,5,12],[6,11,6,12],[7,0,7,2],[7,5,7,8],[7,11,7,12],[8,0,8,2],[8,5,8,8],[9,0,9,2],[9,5,9,8],[10,5,10,7],[14,0,14,12],[20,0,20,12],[26,0,26,12],[32,0,32,12],[38,0,38,12],[44,0,44,12],[50,0,50,12],[56,0,56,12],[62,0,62,12]]}
[]
["Formulary"]
[]
["Conditions"]
[]
["Temperatures",{"$nulls":10},"Altitude"]
["Heating:",{"$nulls":4},"Cooling:",{"$nulls":10},"Copy all data"]
[{"$f":"\"Inlet temp.\"","v":"Inlet temp."},null,null,{"$f":"cal!E9","v":75},{"$f":"IF(cal!$X$4=1,\"°C\",IF(cal!$X$4=2,\"°F\"))","v":"°C"},{"$f":"A8","v":"Inlet temp."},{"$nulls":3},{"$f":"cal!K9","v":16},{"$f":"E8","v":"°C"},"Unit conversion",{"$nulls":4},"SI-units"]
[{"$f":"\"Return temp.\"","v":"Return temp."},null,null,{"$f":"cal!E10","v":65},{"$f":"E8","v":"°C"},{"$f":"A9","v":"Return temp."},{"$nulls":3},{"$f":"cal!K10","v":18},{"$f":"E8","v":"°C"},{"$nulls":5},"Imperial-units"]
[{"$f":"\"Room temp.\"","v":"Room temp."},null,null,{"$f":"cal!E11","v":20},{"$f":"E8","v":"°C"},{"$f":"A10","v":"Room temp."},{"$nulls":3},{"$f":"cal!K11","v":27},{"$f":"E8","v":"°C"}]
[{"$nulls":5},"Relative humidity",{"$nulls":3},{"$f":"cal!K12","v":{"v":0.5,"d":"50%"}}]
[]
[]
["Speed level:","Control voltage [V]",{"$f":"CONCATENATE(\"Heat output * \",ROUND(D8,0),\"/\",ROUND(D9,0),\"/\",ROUND(D10,0),\" [\"&IF(cal!$X$4=1,\"W\",IF(cal!$X$4=2,\"Btu/h\"))&\"]\")","v":"Heat output * 75/65/20 [W]"},{"$f":"\"Water flowrate, heating [\"&IF(cal!$X$4=1,\"l/h\",IF(cal!$X$4=2,\"GPM\"))&\"]\"","v":"Water flowrate, heating [l/h]"},{"$f":"\"Watersided pressure loss [\"&IF(cal!$X$4=1,\"kPa\",IF(cal!$X$4=2,\"inH2O\"))&\"]\"","v":"Watersided pressure loss [kPa]"},{"$f":"CONCATENATE(\"Sens. cooling capacity * \",ROUND(J8,0),\"/\",ROUND(J9,0),\"/\",ROUND(J10,0),\" [\"&IF(cal!$X$4=1,\"W\",IF(cal!$X$4=2,\"Btu/h\"))&\"]\")","v":"Sens. cooling capacity * 16/18/27 [W]"},{"$f":"CONCATENATE(\"Tot. cooling capacity \",ROUND(J8,0),\"/\",ROUND(J9,0),\"/\",ROUND(J10,0),\" [\"&IF(cal!$X$4=1,\"W\",IF(cal!$X$4=2,\"Btu/h\"))&\"]\")","v":"Tot. cooling capacity 16/18/27 [W]"},{"$f":"\"Water flowrate, cooling [\"&IF(cal!$X$4=1,\"l/h\",IF(cal!$X$4=2,\"GPM\"))&\"]\"","v":"Water flowrate, cooling [l/h]"},{"$f":"\"Watersided pressure loss [\"&IF(cal!$X$4=1,\"kPa\",IF(cal!$X$4=2,\"inH2O\"))&\"]\"","v":"Watersided pressure loss [kPa]"},"Sound pressure *** [dB(A)]","Sound power ** [dB(A)]","Electrical power [W]",{"$f":"\"Air flowrate [\"&IF(cal!$X$4=1,\"m³/h\",IF(cal!$X$4=2,\"CFM\"))&\"]\"","v":"Air flowrate [m³/h]"},{"$f":"\"Air exhaust temp. heating [\"&IF(cal!$X$4=1,\"°C\",IF(cal!$X$4=2,\"°F\"))&\"]\"","v":"Air exhaust temp. heating [°C]"},{"$f":"\"Air exhaust temp. cooling [\"&IF(cal!$X$4=1,\"°C\",IF(cal!$X$4=2,\"°F\"))&\"]\"","v":"Air exhaust temp. cooling [°C]"}]
[{"$f":"cal!$AF$1&\" \"&$R$15&\" \"&ROUND(cal!Y22,1)&IF(cal!$X$4=1,\" cm\",IF(cal!$X$4=2,\" in\"))&\" \"&$R$16&\" \"&ROUND(cal!AA22,1)&IF(cal!$X$4=1,\" cm\",IF(cal!$X$4=2,\" in\"))&\" \"&$R$17&\" \"&ROUND(cal!AC22,1)&IF(cal!$X$4=1,\" cm\",IF(cal!$X$4=2,\" in\"))&\" (Type 1)\"","v":"Clima Canal height 13 cm width 32 cm length 70 cm (Type 1)"},{"$nulls":15},"Temp.","height"]
[{"$nulls":16},"heating!","width"]
[{"$nulls":16},"cooling!","length"]
[]
[]
[]
[{"$f":"cal!$AF$1&\" \"&$R$15&\" \"&ROUND(cal!Y28,1)&IF(cal!$X$4=1,\" cm\",IF(cal!$X$4=2,\" in\"))&\" \"&$R$16&\" \"&ROUND(cal!AA28,1)&IF(cal!$X$4=1,\" cm\",IF(cal!$X$4=2,\" in\"))&\" \"&$R$17&\" \"&ROUND(cal!AC28,1)&IF(cal!$X$4=1,\" cm\",IF(cal!$X$4=2,\" in\"))&\" (Type 2)\"","v":"Clima Canal height 13 cm width 32 cm length 100 cm (Type 2)"}]
[]
[]
[]
[]
[]
[{"$f":"cal!$AF$1&\" \"&$R$15&\" \"&ROUND(cal!Y34,1)&IF(cal!$X$4=1,\" cm\",IF(cal!$X$4=2,\" in\"))&\" \"&$R$16&\" \"&ROUND(cal!AA34,1)&IF(cal!$X$4=1,\" cm\",IF(cal!$X$4=2,\" in\"))&\" \"&$R$17&\" \"&ROUND(cal!AC34,1)&IF(cal!$X$4=1,\" cm\",IF(cal!$X$4=2,\" in\"))&\" (Type 3)\"","v":"Clima Canal height 13 cm width 32 cm length 120 cm (Type 3)"}]
[]
[]
[]
[]
[]
[{"$f":"cal!$AF$1&\" \"&$R$15&\" \"&ROUND(cal!Y40,1)&IF(cal!$X$4=1,\" cm\",IF(cal!$X$4=2,\" in\"))&\" \"&$R$16&\" \"&ROUND(cal!AA40,1)&IF(cal!$X$4=1,\" cm\",IF(cal!$X$4=2,\" in\"))&\" \"&$R$17&\" \"&ROUND(cal!AC40,1)&IF(cal!$X$4=1,\" cm\",IF(cal!$X$4=2,\" in\"))&\" (Type 4)\"","v":"Clima Canal height 13 cm width 32 cm length 140 cm (Type 4)"}]
[]
[]
[]
[]
[]
[{"$f":"cal!$AF$1&\" \"&$R$15&\" \"&ROUND(cal!Y46,1)&IF(cal!$X$4=1,\" cm\",IF(cal!$X$4=2,\" in\"))&\" \"&$R$16&\" \"&ROUND(cal!AA46,1)&IF(cal!$X$4=1,\" cm\",IF(cal!$X$4=2,\" in\"))&\" \"&$R$17&\" \"&ROUND(cal!AC46,1)&IF(cal!$X$4=1,\" cm\",IF(cal!$X$4=2,\" in\"))&\" (Type 5)\"","v":"Clima Canal height 13 cm width 32 cm length 170 cm (Type 5)"}]
[]
[]
[]
[]
[]
[{"$f":"cal!$AF$1&\" \"&$R$15&\" \"&ROUND(cal!Y52,1)&IF(cal!$X$4=1,\" cm\",IF(cal!$X$4=2,\" in\"))&\" \"&$R$16&\" \"&ROUND(cal!AA52,1)&IF(cal!$X$4=1,\" cm\",IF(cal!$X$4=2,\" in\"))&\" \"&$R$17&\" \"&ROUND(cal!AC52,1)&IF(cal!$X$4=1,\" cm\",IF(cal!$X$4=2,\" in\"))&\" (Type 6)\"","v":"Clima Canal height 13 cm width 32 cm length 200 cm (Type 6)"}]
[]
[]
[]
[]
[]
[{"$f":"cal!$AF$1&\" \"&$R$15&\" \"&ROUND(cal!Y58,1)&IF(cal!$X$4=1,\" cm\",IF(cal!$X$4=2,\" in\"))&\" \"&$R$16&\" \"&ROUND(cal!AA58,1)&IF(cal!$X$4=1,\" cm\",IF(cal!$X$4=2,\" in\"))&\" \"&$R$17&\" \"&ROUND(cal!AC58,1)&IF(cal!$X$4=1,\" cm\",IF(cal!$X$4=2,\" in\"))&\" (Type 7)\"","v":"Clima Canal height 13 cm width 32 cm length 230 cm (Type 7)"}]
[]
[]
[]
[]
[]
[{"$f":"cal!$AF$1&\" \"&$R$15&\" \"&ROUND(cal!Y64,1)&IF(cal!$X$4=1,\" cm\",IF(cal!$X$4=2,\" in\"))&\" \"&$R$16&\" \"&ROUND(cal!AA64,1)&IF(cal!$X$4=1,\" cm\",IF(cal!$X$4=2,\" in\"))&\" \"&$R$17&\" \"&ROUND(cal!AC64,1)&IF(cal!$X$4=1,\" cm\",IF(cal!$X$4=2,\" in\"))&\" (Type 8)\"","v":"Clima Canal height 13 cm width 32 cm length 280 cm (Type 8)"}]
[]
[]
[]
[]
[]
[{"$f":"cal!$AF$1&\" \"&$R$15&\" \"&ROUND(cal!Y70,1)&IF(cal!$X$4=1,\" cm\",IF(cal!$X$4=2,\" in\"))&\" \"&$R$16&\" \"&ROUND(cal!AA70,1)&IF(cal!$X$4=1,\" cm\",IF(cal!$X$4=2,\" in\"))&\" \"&$R$17&\" \"&ROUND(cal!AC70,1)&IF(cal!$X$4=1,\" cm\",IF(cal!$X$4=2,\" in\"))&\" (Type 9)\"","v":"Clima Canal height 13 cm width 32 cm length 300 cm (Type 9)"}]
[]
[]
[]
[]
[]
["*Values according to EN 16430",{"$nulls":11},{"$f":"cal!N70","v":"v2022-12-13"}]
["**Sound power according to ISO 3741:2010"]
["***Sound pressure with an assumed room damping of 8dB(A)"]

{"sheet":"DE","index":4,"n_rows":71,"n_cols":18,"rows_kept":71,"hidden":true,"merged":[[5,11,5,12],[6,11,6,12],[7,0,7,2],[7,5,7,8],[7,11,7,12],[8,0,8,2],[8,5,8,8],[9,0,9,2],[9,5,9,8],[10,5,10,7],[14,0,14,12],[20,0,20,12],[26,0,26,12],[32,0,32,12],[38,0,38,12],[44,0,44,12],[50,0,50,12],[56,0,56,12],[62,0,62,12]]}
[]
["Eingabefelder"]
[]
["Auslegungsrandbedingungen"]
[]
["Temperaturen",{"$nulls":10},"Platzierte Höhe"]
["Heizen:",{"$nulls":4},"Kühlen:",{"$nulls":10},"Kopieren Sie alle daten"]
[{"$f":"\"Vorlauftemp.\"","v":"Vorlauftemp."},null,null,{"$f":"cal!E9","v":75},{"$f":"IF(cal!$X$4=1,\"°C\",IF(cal!$X$4=2,\"°F\"))","v":"°C"},{"$f":"A8","v":"Vorlauftemp."},{"$nulls":3},{"$f":"cal!K9","v":16},{"$f":"E8","v":"°C"},"Einheiten",{"$nulls":4},"SI-einheiten"]
[{"$f":"\"Rücklauftemp.\"","v":"Rücklauftemp."},null,null,{"$f":"cal!E10","v":65},{"$f":"E8","v":"°C"},{"$f":"A9","v":"Rücklauftemp."},{"$nulls":3},{"$f":"cal!K10","v":18},{"$f":"E8","v":"°C"},{"$nulls":5},"Imperiale-einheiten"]
[{"$f":"\"Raumtemp.\"","v":"Raumtemp."},null,null,{"$f":"cal!E11","v":20},{"$f":"E8","v":"°C"},{"$f":"A10","v":"Raumtemp."},{"$nulls":3},{"$f":"cal!K11","v":27},{"$f":"E8","v":"°C"}]
[{"$nulls":5},"Relative Luftfeuchtigkeit",{"$nulls":3},{"$f":"cal!K12","v":{"v":0.5,"d":"50%"}}]
[]
[]
["Drehzahlstufe:","Regelspannung: [V]",{"$f":"CONCATENATE(\"Wärmeleistung * \",ROUND(D8,0),\"/\",ROUND(D9,0),\"/\",ROUND(D10,0),\" [\"&IF(cal!$X$4=1,\"W\",IF(cal!$X$4=2,\"Btu/h\"))&\"]\")","v":"Wärmeleistung * 75/65/20 [W]"},{"$f":"\"Heizmittelstrom [\"&IF(cal!$X$4=1,\"l/h\",IF(cal!$X$4=2,\"GPM\"))&\"]\"","v":"Heizmittelstrom [l/h]"},{"$f":"\"zug. wassers. Druckverlust [\"&IF(cal!$X$4=1,\"kPa\",IF(cal!$X$4=2,\"inH2O\"))&\"]\"","v":"zug. wassers. Druckverlust [kPa]"},{"$f":"CONCATENATE(\"Sens. Kälteleistung * \",ROUND(J8,0),\"/\",ROUND(J9,0),\"/\",ROUND(J10,0),\" [\"&IF(cal!$X$4=1,\"W\",IF(cal!$X$4=2,\"Btu/h\"))&\"]\")","v":"Sens. Kälteleistung * 16/18/27 [W]"},{"$f":"CONCATENATE(\"Tot. Kälteleistung \",ROUND(J8,0),\"/\",ROUND(J9,0),\"/\",ROUND(J10,0),\" [\"&IF(cal!$X$4=1,\"W\",IF(cal!$X$4=2,\"Btu/h\"))&\"]\")","v":"Tot. Kälteleistung 16/18/27 [W]"},{"$f":"\"Kühlmittelstrom [\"&IF(cal!$X$4=1,\"l/h\",IF(cal!$X$4=2,\"GPM\"))&\"]\"","v":"Kühlmittelstrom [l/h]"},{"$f":"\"zug. wassers. Druckverlust [\"&IF(cal!$X$4=1,\"kPa\",IF(cal!$X$4=2,\"inH2O\"))&\"]\"","v":"zug. wassers. Druckverlust [kPa]"},"Schalldruckpegel *** [dB(A)]","Schallleistungspegel ** [dB(A)]","Leistungsaufnahme [W]",{"$f":"\"Luftvolumenstrom [\"&IF(cal!$X$4=1,\"m³/h\",IF(cal!$X$4=2,\"CFM\"))&\"]\"","v":"Luftvolumenstrom [m³/h]"},{"$f":"\"Luftaustrittstemp. Heizung [\"&IF(cal!$X$4=1,\"°C\",IF(cal!$X$4=2,\"°F\"))&\"]\"","v":"Luftaustrittstemp. Heizung [°C]"},{"$f":"\"Luftaustrittstemp. kühlung [\"&IF(cal!$X$4=1,\"°C\",IF(cal!$X$4=2,\"°F\"))&\"]\"","v":"Luftaustrittstemp. kühlung [°C]"}]
[{"$f":"cal!$AF$1&\" \"&$R$15&\" \"&ROUND(cal!Y22,1)&IF(cal!$X$4=1,\" cm\",IF(cal!$X$4=2,\" in\"))&\" \"&$R$16&\" \"&ROUND(cal!AA22,1)&IF(cal!$X$4=1,\" cm\",IF(cal!$X$4=2,\" in\"))&\" \"&$R$17&\" \"&ROUND(cal!AC22,1)&IF(cal!$X$4=1,\" cm\",IF(cal!$X$4=2,\" in\"))&\" (Type 1)\"","v":"Clima Canal höhe 13 cm breite 32 cm länge 70 cm (Type 1)"},{"$nulls":15},"Temp.","höhe"]
[{"$nulls":16},"heizen!","breite"]
[{"$nulls":16},"kühlen!","länge"]
[]
[]
[]
[{"$f":"cal!$AF$1&\" \"&$R$15&\" \"&ROUND(cal!Y28,1)&IF(cal!$X$4=1,\" cm\",IF(cal!$X$4=2,\" in\"))&\" \"&$R$16&\" \"&ROUND(cal!AA28,1)&IF(cal!$X$4=1,\" cm\",IF(cal!$X$4=2,\" in\"))&\" \"&$R$17&\" \"&ROUND(cal!AC28,1)&IF(cal!$X$4=1,\" cm\",IF(cal!$X$4=2,\" in\"))&\" (Type 2)\"","v":"Clima Canal höhe 13 cm breite 32 cm länge 100 cm (Type 2)"}]
[]
[]
[]
[]
[]
[{"$f":"cal!$AF$1&\" \"&$R$15&\" \"&ROUND(cal!Y34,1)&IF(cal!$X$4=1,\" cm\",IF(cal!$X$4=2,\" in\"))&\" \"&$R$16&\" \"&ROUND(cal!AA34,1)&IF(cal!$X$4=1,\" cm\",IF(cal!$X$4=2,\" in\"))&\" \"&$R$17&\" \"&ROUND(cal!AC34,1)&IF(cal!$X$4=1,\" cm\",IF(cal!$X$4=2,\" in\"))&\" (Type 3)\"","v":"Clima Canal höhe 13 cm breite 32 cm länge 120 cm (Type 3)"}]
[]
[]
[]
[]
[]
[{"$f":"cal!$AF$1&\" \"&$R$15&\" \"&ROUND(cal!Y40,1)&IF(cal!$X$4=1,\" cm\",IF(cal!$X$4=2,\" in\"))&\" \"&$R$16&\" \"&ROUND(cal!AA40,1)&IF(cal!$X$4=1,\" cm\",IF(cal!$X$4=2,\" in\"))&\" \"&$R$17&\" \"&ROUND(cal!AC40,1)&IF(cal!$X$4=1,\" cm\",IF(cal!$X$4=2,\" in\"))&\" (Type 4)\"","v":"Clima Canal höhe 13 cm breite 32 cm länge 140 cm (Type 4)"}]
[]
[]
[]
[]
[]
[{"$f":"cal!$AF$1&\" \"&$R$15&\" \"&ROUND(cal!Y46,1)&IF(cal!$X$4=1,\" cm\",IF(cal!$X$4=2,\" in\"))&\" \"&$R$16&\" \"&ROUND(cal!AA46,1)&IF(cal!$X$4=1,\" cm\",IF(cal!$X$4=2,\" in\"))&\" \"&$R$17&\" \"&ROUND(cal!AC46,1)&IF(cal!$X$4=1,\" cm\",IF(cal!$X$4=2,\" in\"))&\" (Type 5)\"","v":"Clima Canal höhe 13 cm breite 32 cm länge 170 cm (Type 5)"}]
[]
[]
[]
[]
[]
[{"$f":"cal!$AF$1&\" \"&$R$15&\" \"&ROUND(cal!Y52,1)&IF(cal!$X$4=1,\" cm\",IF(cal!$X$4=2,\" in\"))&\" \"&$R$16&\" \"&ROUND(cal!AA52,1)&IF(cal!$X$4=1,\" cm\",IF(cal!$X$4=2,\" in\"))&\" \"&$R$17&\" \"&ROUND(cal!AC52,1)&IF(cal!$X$4=1,\" cm\",IF(cal!$X$4=2,\" in\"))&\" (Type 6)\"","v":"Clima Canal höhe 13 cm breite 32 cm länge 200 cm (Type 6)"}]
[]
[]
[]
[]
[]
[{"$f":"cal!$AF$1&\" \"&$R$15&\" \"&ROUND(cal!Y58,1)&IF(cal!$X$4=1,\" cm\",IF(cal!$X$4=2,\" in\"))&\" \"&$R$16&\" \"&ROUND(cal!AA58,1)&IF(cal!$X$4=1,\" cm\",IF(cal!$X$4=2,\" in\"))&\" \"&$R$17&\" \"&ROUND(cal!AC58,1)&IF(cal!$X$4=1,\" cm\",IF(cal!$X$4=2,\" in\"))&\" (Type 7)\"","v":"Clima Canal höhe 13 cm breite 32 cm länge 230 cm (Type 7)"}]
[]
[]
[]
[]
[]
[{"$f":"cal!$AF$1&\" \"&$R$15&\" \"&ROUND(cal!Y64,1)&IF(cal!$X$4=1,\" cm\",IF(cal!$X$4=2,\" in\"))&\" \"&$R$16&\" \"&ROUND(cal!AA64,1)&IF(cal!$X$4=1,\" cm\",IF(cal!$X$4=2,\" in\"))&\" \"&$R$17&\" \"&ROUND(cal!AC64,1)&IF(cal!$X$4=1,\" cm\",IF(cal!$X$4=2,\" in\"))&\" (Type 8)\"","v":"Clima Canal höhe 13 cm breite 32 cm länge 280 cm (Type 8)"}]
[]
[]
[]
[]
[]
[{"$f":"cal!$AF$1&\" \"&$R$15&\" \"&ROUND(cal!Y70,1)&IF(cal!$X$4=1,\" cm\",IF(cal!$X$4=2,\" in\"))&\" \"&$R$16&\" \"&ROUND(cal!AA70,1)&IF(cal!$X$4=1,\" cm\",IF(cal!$X$4=2,\" in\"))&\" \"&$R$17&\" \"&ROUND(cal!AC70,1)&IF(cal!$X$4=1,\" cm\",IF(cal!$X$4=2,\" in\"))&\" (Type 9)\"","v":"Clima Canal höhe 13 cm breite 32 cm länge 300 cm (Type 9)"}]
[]
[]
[]
[]
[]
["*Leistungsangaben nach EN 16430",{"$nulls":11},{"$f":"cal!N70","v":"v2022-12-13"}]
["**Schallleistungspegel nach ISO 3741:2010"]
["***Schalldruckpegel bei angenommener Raumdämpfung von 8dB(A)"]

{"sheet":"FR","index":5,"n_rows":71,"n_cols":18,"rows_kept":71,"hidden":true,"merged":[[5,11,5,12],[6,11,6,12],[7,0,7,2],[7,5,7,8],[7,11,7,12],[8,0,8,2],[8,5,8,8],[9,0,9,2],[9,5,9,8],[10,5,10,7],[14,0,14,12],[20,0,20,12],[26,0,26,12],[32,0,32,12],[38,0,38,12],[44,0,44,12],[50,0,50,12],[56,0,56,12],[62,0,62,12]]}
[]
["Formulaire"]
[]
["Conditions"]
[]
["Températures",{"$nulls":10},"Hauteur placée"]
["Chauffer:",{"$nulls":4},"Refroidir:",{"$nulls":10},"Copier toutes des données"]
[{"$f":"\"Temp. entrée\"","v":"Temp. entrée"},null,null,{"$f":"cal!E9","v":75},{"$f":"IF(cal!$X$4=1,\"°C\",IF(cal!$X$4=2,\"°F\"))","v":"°C"},{"$f":"A8","v":"Temp. entrée"},{"$nulls":3},{"$f":"cal!K9","v":16},{"$f":"E8","v":"°C"},"Système unitaire",{"$nulls":4},"Unités-SI"]
[{"$f":"\"Temp. retour\"","v":"Temp. retour"},null,null,{"$f":"cal!E10","v":65},{"$f":"E8","v":"°C"},{"$f":"A9","v":"Temp. retour"},{"$nulls":3},{"$f":"cal!K10","v":18},{"$f":"E8","v":"°C"},{"$nulls":5},"Unités-Impériales"]
[{"$f":"\"Temp. ambiante\"","v":"Temp. ambiante"},null,null,{"$f":"cal!E11","v":20},{"$f":"E8","v":"°C"},{"$f":"A10","v":"Temp. ambiante"},{"$nulls":3},{"$f":"cal!K11","v":27},{"$f":"E8","v":"°C"}]
[{"$nulls":5},"Humidité relative",{"$nulls":3},{"$f":"cal!K12","v":{"v":0.5,"d":"50%"}}]
[]
[]
["Niveau de vitesse","Voltage [V]",{"$f":"CONCATENATE(\"Puissance de cha. * \",ROUND(D8,0),\"/\",ROUND(D9,0),\"/\",ROUND(D10,0),\" [\"&IF(cal!$X$4=1,\"W\",IF(cal!$X$4=2,\"Btu/h\"))&\"]\")","v":"Puissance de cha. * 75/65/20 [W]"},{"$f":"\"Débit d'eau, chauffer [\"&IF(cal!$X$4=1,\"l/h\",IF(cal!$X$4=2,\"GPM\"))&\"]\"","v":"Débit d'eau, chauffer [l/h]"},{"$f":"\"Perte de charge [\"&IF(cal!$X$4=1,\"kPa\",IF(cal!$X$4=2,\"inH2O\"))&\"]\"","v":"Perte de charge [kPa]"},{"$f":"CONCATENATE(\"Puissance sens. de refr. * \",ROUND(J8,0),\"/\",ROUND(J9,0),\"/\",ROUND(J10,0),\" [\"&IF(cal!$X$4=1,\"W\",IF(cal!$X$4=2,\"Btu/h\"))&\"]\")","v":"Puissance sens. de refr. * 16/18/27 [W]"},{"$f":"CONCATENATE(\"Puissance tot. de refr. \",ROUND(J8,0),\"/\",ROUND(J9,0),\"/\",ROUND(J10,0),\" [\"&IF(cal!$X$4=1,\"W\",IF(cal!$X$4=2,\"Btu/h\"))&\"]\")","v":"Puissance tot. de refr. 16/18/27 [W]"},{"$f":"\"Débit d'eau, refroidir [\"&IF(cal!$X$4=1,\"l/h\",IF(cal!$X$4=2,\"GPM\"))&\"]\"","v":"Débit d'eau, refroidir [l/h]"},{"$f":"\"Perte de charge [\"&IF(cal!$X$4=1,\"kPa\",IF(cal!$X$4=2,\"inH2O\"))&\"]\"","v":"Perte de charge [kPa]"},"Pression sonore *** [dB(A)]","Puissance sonore ** [dB(A)]","Puissance absorbée [W]",{"$f":"\"Débit d'air [\"&IF(cal!$X$4=1,\"m³/h\",IF(cal!$X$4=2,\"CFM\"))&\"]\"","v":"Débit d'air [m³/h]"},{"$f":"\"Temp. de la sortie d'air cha. [\"&IF(cal!$X$4=1,\"°C\",IF(cal!$X$4=2,\"°F\"))&\"]\"","v":"Temp. de la sortie d'air cha. [°C]"},{"$f":"\"Temp. de la sortie d'air refr. [\"&IF(cal!$X$4=1,\"°C\",IF(cal!$X$4=2,\"°F\"))&\"]\"","v":"Temp. de la sortie d'air refr. [°C]"}]
[{"$f":"cal!$AF$1&\" \"&$R$15&\" \"&ROUND(cal!Y22,1)&IF(cal!$X$4=1,\" cm\",IF(cal!$X$4=2,\" in\"))&\" \"&$R$16&\" \"&ROUND(cal!AA22,1)&IF(cal!$X$4=1,\" cm\",IF(cal!$X$4=2,\" in\"))&\" \"&$R$17&\" \"&ROUND(cal!AC22,1)&IF(cal!$X$4=1,\" cm\",IF(cal!$X$4=2,\" in\"))&\" (Type 1)\"","v":"Clima Canal hauteur 13 cm largeur 32 cm longueur 70 cm (Type 1)"},{"$nulls":15},"Temp.","hauteur"]
[{"$nulls":16},"chauf.!","largeur"]
[{"$nulls":16},"refr.!","longueur"]
[]
[]
[]
[{"$f":"cal!$AF$1&\" \"&$R$15&\" \"&ROUND(cal!Y28,1)&IF(cal!$X$4=1,\" cm\",IF(cal!$X$4=2,\" in\"))&\" \"&$R$16&\" \"&ROUND(cal!AA28,1)&IF(cal!$X$4=1,\" cm\",IF(cal!$X$4=2,\" in\"))&\" \"&$R$17&\" \"&ROUND(cal!AC28,1)&IF(cal!$X$4=1,\" cm\",IF(cal!$X$4=2,\" in\"))&\" (Type 2)\"","v":"Clima Canal hauteur 13 cm largeur 32 cm longueur 100 cm (Type 2)"}]
[]
[]
[]
[]
[]
[{"$f":"cal!$AF$1&\" \"&$R$15&\" \"&ROUND(cal!Y34,1)&IF(cal!$X$4=1,\" cm\",IF(cal!$X$4=2,\" in\"))&\" \"&$R$16&\" \"&ROUND(cal!AA34,1)&IF(cal!$X$4=1,\" cm\",IF(cal!$X$4=2,\" in\"))&\" \"&$R$17&\" \"&ROUND(cal!AC34,1)&IF(cal!$X$4=1,\" cm\",IF(cal!$X$4=2,\" in\"))&\" (Type 3)\"","v":"Clima Canal hauteur 13 cm largeur 32 cm longueur 120 cm (Type 3)"}]
[]
[]
[]
[]
[]
[{"$f":"cal!$AF$1&\" \"&$R$15&\" \"&ROUND(cal!Y40,1)&IF(cal!$X$4=1,\" cm\",IF(cal!$X$4=2,\" in\"))&\" \"&$R$16&\" \"&ROUND(cal!AA40,1)&IF(cal!$X$4=1,\" cm\",IF(cal!$X$4=2,\" in\"))&\" \"&$R$17&\" \"&ROUND(cal!AC40,1)&IF(cal!$X$4=1,\" cm\",IF(cal!$X$4=2,\" in\"))&\" (Type 4)\"","v":"Clima Canal hauteur 13 cm largeur 32 cm longueur 140 cm (Type 4)"}]
[]
[]
[]
[]
[]
[{"$f":"cal!$AF$1&\" \"&$R$15&\" \"&ROUND(cal!Y46,1)&IF(cal!$X$4=1,\" cm\",IF(cal!$X$4=2,\" in\"))&\" \"&$R$16&\" \"&ROUND(cal!AA46,1)&IF(cal!$X$4=1,\" cm\",IF(cal!$X$4=2,\" in\"))&\" \"&$R$17&\" \"&ROUND(cal!AC46,1)&IF(cal!$X$4=1,\" cm\",IF(cal!$X$4=2,\" in\"))&\" (Type 5)\"","v":"Clima Canal hauteur 13 cm largeur 32 cm longueur 170 cm (Type 5)"}]
[]
[]
[]
[]
[]
[{"$f":"cal!$AF$1&\" \"&$R$15&\" \"&ROUND(cal!Y52,1)&IF(cal!$X$4=1,\" cm\",IF(cal!$X$4=2,\" in\"))&\" \"&$R$16&\" \"&ROUND(cal!AA52,1)&IF(cal!$X$4=1,\" cm\",IF(cal!$X$4=2,\" in\"))&\" \"&$R$17&\" \"&ROUND(cal!AC52,1)&IF(cal!$X$4=1,\" cm\",IF(cal!$X$4=2,\" in\"))&\" (Type 6)\"","v":"Clima Canal hauteur 13 cm largeur 32 cm longueur 200 cm (Type 6)"}]
[]
[]
[]
[]
[]
[{"$f":"cal!$AF$1&\" \"&$R$15&\" \"&ROUND(cal!Y58,1)&IF(cal!$X$4=1,\" cm\",IF(cal!$X$4=2,\" in\"))&\" \"&$R$16&\" \"&ROUND(cal!AA58,1)&IF(cal!$X$4=1,\" cm\",IF(cal!$X$4=2,\" in\"))&\" \"&$R$17&\" \"&ROUND(cal!AC58,1)&IF(cal!$X$4=1,\" cm\",IF(cal!$X$4=2,\" in\"))&\" (Type 7)\"","v":"Clima Canal hauteur 13 cm largeur 32 cm longueur 230 cm (Type 7)"}]
[]
[]
[]
[]
[]
[{"$f":"cal!$AF$1&\" \"&$R$15&\" \"&ROUND(cal!Y64,1)&IF(cal!$X$4=1,\" cm\",IF(cal!$X$4=2,\" in\"))&\" \"&$R$16&\" \"&ROUND(cal!AA64,1)&IF(cal!$X$4=1,\" cm\",IF(cal!$X$4=2,\" in\"))&\" \"&$R$17&\" \"&ROUND(cal!AC64,1)&IF(cal!$X$4=1,\" cm\",IF(cal!$X$4=2,\" in\"))&\" (Type 8)\"","v":"Clima Canal hauteur 13 cm largeur 32 cm longueur 280 cm (Type 8)"}]
[]
[]
[]
[]
[]
[{"$f":"cal!$AF$1&\" \"&$R$15&\" \"&ROUND(cal!Y70,1)&IF(cal!$X$4=1,\" cm\",IF(cal!$X$4=2,\" in\"))&\" \"&$R$16&\" \"&ROUND(cal!AA70,1)&IF(cal!$X$4=1,\" cm\",IF(cal!$X$4=2,\" in\"))&\" \"&$R$17&\" \"&ROUND(cal!AC70,1)&IF(cal!$X$4=1,\" cm\",IF(cal!$X$4=2,\" in\"))&\" (Type 9)\"","v":"Clima Canal hauteur 13 cm largeur 32 cm longueur 300 cm (Type 9)"}]
[]
[]
[]
[]
[]
["*Testé selon EN 16430",{"$nulls":11},{"$f":"cal!N70","v":"v2022-12-13"}]
["**Puissance sonore testé selon ISO 3741:2010"]
["***Pression sonore avec une atténuation ambiante du 8dB(A)"]

{"sheet":"NR","index":6,"n_rows":71,"n_cols":18,"rows_kept":71,"hidden":true,"merged":[[2,6,2,9],[3,6,3,9],[5,11,5,12],[6,11,6,12],[7,0,7,2],[7,5,7,8],[7,11,7,12],[8,0,8,2],[8,5,8,8],[9,0,9,2],[9,5,9,8],[10,5,10,7],[14,0,14,12],[20,0,20,12],[26,0,26,12],[32,0,32,12],[38,0,38,12],[44,0,44,12],[50,0,50,12],[56,0,56,12],[62,0,62,12]]}
[]
["Modell"]
[]
["Conditions"]
[]
["Temperaturer",{"$nulls":10},"Plassert høyde"]
["Varme:",{"$nulls":4},"Kjøling:",{"$nulls":10},"Kopier alle data"]
["Tur vanntemp.",0,0,{"$f":"cal!E9","v":75},{"$f":"IF(cal!$X$4=1,\"°C\",IF(cal!$X$4=2,\"°F\"))","v":"°C"},{"$f":"A8","v":"Tur vanntemp."},{"$nulls":3},{"$f":"cal!K9","v":16},{"$f":"E8","v":"°C"},"Enhetssystem",{"$nulls":4},"SI-enheter"]
["Retur vanntemp.",0,0,{"$f":"cal!E10","v":65},{"$f":"E8","v":"°C"},{"$f":"A9","v":"Retur vanntemp."},{"$nulls":3},{"$f":"cal!K10","v":18},{"$f":"E8","v":"°C"},{"$nulls":5},"Imperiale-enheter"]
["Rom temp.",0,0,{"$f":"cal!E11","v":20},{"$f":"E8","v":"°C"},{"$f":"A10","v":"Rom temp."},{"$nulls":3},{"$f":"cal!K11","v":27},{"$f":"E8","v":"°C"}]
[{"$nulls":5},"Relativ fuktighet",{"$nulls":3},{"$f":"cal!K12","v":{"v":0.5,"d":"50%"}}]
[]
[]
["Hastighet:","Styresignal[V]",{"$f":"CONCATENATE(\"Varme effekt * \",ROUND(D8,0),\"/\",ROUND(D9,0),\"/\",ROUND(D10,0),\" [\"&IF(cal!$X$4=1,\"W\",IF(cal!$X$4=2,\"Btu/h\"))&\"]\")","v":"Varme effekt * 75/65/20 [W]"},{"$f":"\"Vannmengde, varme [\"&IF(cal!$X$4=1,\"l/h\",IF(cal!$X$4=2,\"GPM\"))&\"]\"","v":"Vannmengde, varme [l/h]"},{"$f":"\"Trykktap [\"&IF(cal!$X$4=1,\"kPa\",IF(cal!$X$4=2,\"ftH2O\"))&\"]\"","v":"Trykktap [kPa]"},{"$f":"CONCATENATE(\"Sens. Kjøling effekt * \",ROUND(J8,0),\"/\",ROUND(J9,0),\"/\",ROUND(J10,0),\" [\"&IF(cal!$X$4=1,\"W\",IF(cal!$X$4=2,\"Btu/h\"))&\"]\")","v":"Sens. Kjøling effekt * 16/18/27 [W]"},{"$f":"CONCATENATE(\"Tot. Kjøle effekt * \",ROUND(J8,0),\"/\",ROUND(J9,0),\"/\",ROUND(J10,0),\" [\"&IF(cal!$X$4=1,\"W\",IF(cal!$X$4=2,\"Btu/h\"))&\"]\")","v":"Tot. Kjøle effekt * 16/18/27 [W]"},{"$f":"\"Vannmengde, kjøling [\"&IF(cal!$X$4=1,\"l/h\",IF(cal!$X$4=2,\"GPM\"))&\"]\"","v":"Vannmengde, kjøling [l/h]"},{"$f":"E14","v":"Trykktap [kPa]"},"Lydtrykk *** [dB(A)]","Lydeffekt ** [dB(A)]","Elektrisk effekt [W]",{"$f":"\"Luftmengde [\"&IF(cal!$X$4=1,\"m³/h\",IF(cal!$X$4=2,\"CFM\"))&\"]\"","v":"Luftmengde [m³/h]"},{"$f":"\"Utluft temperatur, Varme [\"&IF(cal!$X$4=1,\"°C\",IF(cal!$X$4=2,\"°F\"))&\"]\"","v":"Utluft temperatur, Varme [°C]"},{"$f":"\"Utluft temperatur, Kjøling [\"&IF(cal!$X$4=1,\"°C\",IF(cal!$X$4=2,\"°F\"))&\"]\"","v":"Utluft temperatur, Kjøling [°C]"}]
[{"$f":"cal!$AF$1&\" \"&$R$15&\" \"&ROUND(cal!Y22,1)&IF(cal!$X$4=1,\" cm\",IF(cal!$X$4=2,\" in\"))&\" \"&$R$16&\" \"&ROUND(cal!AA22,1)&IF(cal!$X$4=1,\" cm\",IF(cal!$X$4=2,\" in\"))&\" \"&$R$17&\" \"&ROUND(cal!AC22,1)&IF(cal!$X$4=1,\" cm\",IF(cal!$X$4=2,\" in\"))&\" (Type 1)\"","v":"Clima Canal høyde 13 cm bredde 32 cm lengde 70 cm (Type 1)"},{"$nulls":15},"Temp.","høyde"]
[{"$nulls":16},"varme!","bredde"]
[{"$nulls":16},"kjøling!","lengde"]
[]
[]
[]
[{"$f":"cal!$AF$1&\" \"&$R$15&\" \"&ROUND(cal!Y28,1)&IF(cal!$X$4=1,\" cm\",IF(cal!$X$4=2,\" in\"))&\" \"&$R$16&\" \"&ROUND(cal!AA28,1)&IF(cal!$X$4=1,\" cm\",IF(cal!$X$4=2,\" in\"))&\" \"&$R$17&\" \"&ROUND(cal!AC28,1)&IF(cal!$X$4=1,\" cm\",IF(cal!$X$4=2,\" in\"))&\" (Type 2)\"","v":"Clima Canal høyde 13 cm bredde 32 cm lengde 100 cm (Type 2)"}]
[]
[]
[]
[]
[]
[{"$f":"cal!$AF$1&\" \"&$R$15&\" \"&ROUND(cal!Y34,1)&IF(cal!$X$4=1,\" cm\",IF(cal!$X$4=2,\" in\"))&\" \"&$R$16&\" \"&ROUND(cal!AA34,1)&IF(cal!$X$4=1,\" cm\",IF(cal!$X$4=2,\" in\"))&\" \"&$R$17&\" \"&ROUND(cal!AC34,1)&IF(cal!$X$4=1,\" cm\",IF(cal!$X$4=2,\" in\"))&\" (Type 3)\"","v":"Clima Canal høyde 13 cm bredde 32 cm lengde 120 cm (Type 3)"}]
[]
[]
[]
[]
[]
[{"$f":"cal!$AF$1&\" \"&$R$15&\" \"&ROUND(cal!Y40,1)&IF(cal!$X$4=1,\" cm\",IF(cal!$X$4=2,\" in\"))&\" \"&$R$16&\" \"&ROUND(cal!AA40,1)&IF(cal!$X$4=1,\" cm\",IF(cal!$X$4=2,\" in\"))&\" \"&$R$17&\" \"&ROUND(cal!AC40,1)&IF(cal!$X$4=1,\" cm\",IF(cal!$X$4=2,\" in\"))&\" (Type 4)\"","v":"Clima Canal høyde 13 cm bredde 32 cm lengde 140 cm (Type 4)"}]
[]
[]
[]
[]
[]
[{"$f":"cal!$AF$1&\" \"&$R$15&\" \"&ROUND(cal!Y46,1)&IF(cal!$X$4=1,\" cm\",IF(cal!$X$4=2,\" in\"))&\" \"&$R$16&\" \"&ROUND(cal!AA46,1)&IF(cal!$X$4=1,\" cm\",IF(cal!$X$4=2,\" in\"))&\" \"&$R$17&\" \"&ROUND(cal!AC46,1)&IF(cal!$X$4=1,\" cm\",IF(cal!$X$4=2,\" in\"))&\" (Type 5)\"","v":"Clima Canal høyde 13 cm bredde 32 cm lengde 170 cm (Type 5)"}]
[]
[]
[]
[]
[]
[{"$f":"cal!$AF$1&\" \"&$R$15&\" \"&ROUND(cal!Y52,1)&IF(cal!$X$4=1,\" cm\",IF(cal!$X$4=2,\" in\"))&\" \"&$R$16&\" \"&ROUND(cal!AA52,1)&IF(cal!$X$4=1,\" cm\",IF(cal!$X$4=2,\" in\"))&\" \"&$R$17&\" \"&ROUND(cal!AC52,1)&IF(cal!$X$4=1,\" cm\",IF(cal!$X$4=2,\" in\"))&\" (Type 6)\"","v":"Clima Canal høyde 13 cm bredde 32 cm lengde 200 cm (Type 6)"}]
[]
[]
[]
[]
[]
[{"$f":"cal!$AF$1&\" \"&$R$15&\" \"&ROUND(cal!Y58,1)&IF(cal!$X$4=1,\" cm\",IF(cal!$X$4=2,\" in\"))&\" \"&$R$16&\" \"&ROUND(cal!AA58,1)&IF(cal!$X$4=1,\" cm\",IF(cal!$X$4=2,\" in\"))&\" \"&$R$17&\" \"&ROUND(cal!AC58,1)&IF(cal!$X$4=1,\" cm\",IF(cal!$X$4=2,\" in\"))&\" (Type 7)\"","v":"Clima Canal høyde 13 cm bredde 32 cm lengde 230 cm (Type 7)"}]
[]
[]
[]
[]
[]
[{"$f":"cal!$AF$1&\" \"&$R$15&\" \"&ROUND(cal!Y64,1)&IF(cal!$X$4=1,\" cm\",IF(cal!$X$4=2,\" in\"))&\" \"&$R$16&\" \"&ROUND(cal!AA64,1)&IF(cal!$X$4=1,\" cm\",IF(cal!$X$4=2,\" in\"))&\" \"&$R$17&\" \"&ROUND(cal!AC64,1)&IF(cal!$X$4=1,\" cm\",IF(cal!$X$4=2,\" in\"))&\" (Type 8)\"","v":"Clima Canal høyde 13 cm bredde 32 cm lengde 280 cm (Type 8)"}]
[]
[]
[]
[]
[]
[{"$f":"cal!$AF$1&\" \"&$R$15&\" \"&ROUND(cal!Y70,1)&IF(cal!$X$4=1,\" cm\",IF(cal!$X$4=2,\" in\"))&\" \"&$R$16&\" \"&ROUND(cal!AA70,1)&IF(cal!$X$4=1,\" cm\",IF(cal!$X$4=2,\" in\"))&\" \"&$R$17&\" \"&ROUND(cal!AC70,1)&IF(cal!$X$4=1,\" cm\",IF(cal!$X$4=2,\" in\"))&\" (Type 9)\"","v":"Clima Canal høyde 13 cm bredde 32 cm lengde 300 cm (Type 9)"}]
[]
[]
[]
[]
[]
["*Testé selon EN 16430",{"$nulls":11},{"$f":"cal!N70","v":"v2022-12-13"}]
["**Puissance sonore testé selon ISO 3741:2010"]
["***Pression sonore avec une atténuation ambiante du 8dB(A)"]

{"sheet":"SP","index":7,"n_rows":71,"n_cols":18,"rows_kept":71,"hidden":true,"merged":[[2,6,2,9],[3,6,3,9],[5,11,5,12],[6,11,6,12],[7,0,7,2],[7,5,7,8],[7,11,7,12],[8,0,8,2],[8,5,8,8],[9,0,9,2],[9,5,9,8],[10,5,10,7],[14,0,14,12],[20,0,20,12],[26,0,26,12],[32,0,32,12],[38,0,38,12],[44,0,44,12],[50,0,50,12],[56,0,56,12],[62,0,62,12]]}
[]
["Model"]
[]
["Conditions"]
[]
["Temperaturas",{"$nulls":10},"Altitud"]
["Calefacción:",{"$nulls":4},"Enfriamiento:",{"$nulls":10},"Copiar todos los datos"]
["Agua impulsión",0,0,{"$f":"cal!E9","v":75},{"$f":"IF(cal!$X$4=1,\"°C\",IF(cal!$X$4=2,\"°F\"))","v":"°C"},{"$f":"A8","v":"Agua impulsión"},{"$nulls":3},{"$f":"cal!K9","v":16},{"$f":"E8","v":"°C"},"Convers. de unidades",{"$nulls":4},"Unidades-SI"]
["Agua retorno",0,0,{"$f":"cal!E10","v":65},{"$f":"E8","v":"°C"},{"$f":"A9","v":"Agua retorno"},{"$nulls":3},{"$f":"cal!K10","v":18},{"$f":"E8","v":"°C"},{"$nulls":5},"Unidades-Imperial"]
["Ambiente (bulbo seco)",0,0,{"$f":"cal!E11","v":20},{"$f":"E8","v":"°C"},{"$f":"A10","v":"Ambiente (bulbo seco)"},{"$nulls":3},{"$f":"cal!K11","v":27},{"$f":"E8","v":"°C"}]
[{"$nulls":5},"Humedad relativa",{"$nulls":3},{"$f":"cal!K12","v":{"v":0.5,"d":"50%"}}]
[]
[]
["Nivel de velocidad:"," Voltaje control [V]",{"$f":"CONCATENATE(\"Emisión calefacción * \",ROUND(D8,0),\"/\",ROUND(D9,0),\"/\",ROUND(D10,0),\" [\"&IF(cal!$X$4=1,\"W\",IF(cal!$X$4=2,\"Btu/h\"))&\"]\")","v":"Emisión calefacción * 75/65/20 [W]"},{"$f":"\"Caudal de agua, calefacción [\"&IF(cal!$X$4=1,\"l/h\",IF(cal!$X$4=2,\"GPM\"))&\"]\"","v":"Caudal de agua, calefacción [l/h]"},{"$f":"\"Pérdida de carga del agua [\"&IF(cal!$X$4=1,\"kPa\",IF(cal!$X$4=2,\"ftH2O\"))&\"]\"","v":"Pérdida de carga del agua [kPa]"},{"$f":"CONCATENATE(\"Emisión sensible Frío * \",ROUND(J8,0),\"/\",ROUND(J9,0),\"/\",ROUND(J10,0),\" [\"&IF(cal!$X$4=1,\"W\",IF(cal!$X$4=2,\"Btu/h\"))&\"]\")","v":"Emisión sensible Frío * 16/18/27 [W]"},{"$f":"CONCATENATE(\"Emisión total Frío * \",ROUND(J8,0),\"/\",ROUND(J9,0),\"/\",ROUND(J10,0),\" [\"&IF(cal!$X$4=1,\"W\",IF(cal!$X$4=2,\"Btu/h\"))&\"]\")","v":"Emisión total Frío * 16/18/27 [W]"},{"$f":"\"Caudal de agua, calefacción [\"&IF(cal!$X$4=1,\"l/h\",IF(cal!$X$4=2,\"GPM\"))&\"]\"","v":"Caudal de agua, calefacción [l/h]"},{"$f":"E14","v":"Pérdida de carga del agua [kPa]"},"Presión sonora *** [dB(A)]","Potencia sonora ** [dB(A)]","Potencia eléctrica absorbida [W]",{"$f":"\"Caudal de aire [\"&IF(cal!$X$4=1,\"m³/h\",IF(cal!$X$4=2,\"CFM\"))&\"]\"","v":"Caudal de aire [m³/h]"},{"$f":"\"Temperatura salida de aire calefacción [\"&IF(cal!$X$4=1,\"°C\",IF(cal!$X$4=2,\"°F\"))&\"]\"","v":"Temperatura salida de aire calefacción [°C]"},{"$f":"\"Temperatura salida de aire refrigeración [\"&IF(cal!$X$4=1,\"°C\",IF(cal!$X$4=2,\"°F\"))&\"]\"","v":"Temperatura salida de aire refrigeración [°C]"}]
[{"$f":"cal!$AF$1&\" \"&$R$15&\" \"&ROUND(cal!Y22,1)&IF(cal!$X$4=1,\" cm\",IF(cal!$X$4=2,\" in\"))&\" \"&$R$16&\" \"&ROUND(cal!AA22,1)&IF(cal!$X$4=1,\" cm\",IF(cal!$X$4=2,\" in\"))&\" \"&$R$17&\" \"&ROUND(cal!AC22,1)&IF(cal!$X$4=1,\" cm\",IF(cal!$X$4=2,\" in\"))&\" (Type 1)\"","v":"Clima Canal altura 13 cm ancho 32 cm longitud 70 cm (Type 1)"},{"$nulls":15},"Temp.","altura"]
[{"$nulls":16},"calefac.","ancho"]
[{"$nulls":16},"enfria.","longitud"]
[]
[]
[]
[{"$f":"cal!$AF$1&\" \"&$R$15&\" \"&ROUND(cal!Y28,1)&IF(cal!$X$4=1,\" cm\",IF(cal!$X$4=2,\" in\"))&\" \"&$R$16&\" \"&ROUND(cal!AA28,1)&IF(cal!$X$4=1,\" cm\",IF(cal!$X$4=2,\" in\"))&\" \"&$R$17&\" \"&ROUND(cal!AC28,1)&IF(cal!$X$4=1,\" cm\",IF(cal!$X$4=2,\" in\"))&\" (Type 2)\"","v":"Clima Canal altura 13 cm ancho 32 cm longitud 100 cm (Type 2)"}]
[]
[]
[]
[]
[]
[{"$f":"cal!$AF$1&\" \"&$R$15&\" \"&ROUND(cal!Y34,1)&IF(cal!$X$4=1,\" cm\",IF(cal!$X$4=2,\" in\"))&\" \"&$R$16&\" \"&ROUND(cal!AA34,1)&IF(cal!$X$4=1,\" cm\",IF(cal!$X$4=2,\" in\"))&\" \"&$R$17&\" \"&ROUND(cal!AC34,1)&IF(cal!$X$4=1,\" cm\",IF(cal!$X$4=2,\" in\"))&\" (Type 3)\"","v":"Clima Canal altura 13 cm ancho 32 cm longitud 120 cm (Type 3)"}]
[]
[]
[]
[]
[]
[{"$f":"cal!$AF$1&\" \"&$R$15&\" \"&ROUND(cal!Y40,1)&IF(cal!$X$4=1,\" cm\",IF(cal!$X$4=2,\" in\"))&\" \"&$R$16&\" \"&ROUND(cal!AA40,1)&IF(cal!$X$4=1,\" cm\",IF(cal!$X$4=2,\" in\"))&\" \"&$R$17&\" \"&ROUND(cal!AC40,1)&IF(cal!$X$4=1,\" cm\",IF(cal!$X$4=2,\" in\"))&\" (Type 4)\"","v":"Clima Canal altura 13 cm ancho 32 cm longitud 140 cm (Type 4)"}]
[]
[]
[]
[]
[]
[{"$f":"cal!$AF$1&\" \"&$R$15&\" \"&ROUND(cal!Y46,1)&IF(cal!$X$4=1,\" cm\",IF(cal!$X$4=2,\" in\"))&\" \"&$R$16&\" \"&ROUND(cal!AA46,1)&IF(cal!$X$4=1,\" cm\",IF(cal!$X$4=2,\" in\"))&\" \"&$R$17&\" \"&ROUND(cal!AC46,1)&IF(cal!$X$4=1,\" cm\",IF(cal!$X$4=2,\" in\"))&\" (Type 5)\"","v":"Clima Canal altura 13 cm ancho 32 cm longitud 170 cm (Type 5)"}]
[]
[]
[]
[]
[]
[{"$f":"cal!$AF$1&\" \"&$R$15&\" \"&ROUND(cal!Y52,1)&IF(cal!$X$4=1,\" cm\",IF(cal!$X$4=2,\" in\"))&\" \"&$R$16&\" \"&ROUND(cal!AA52,1)&IF(cal!$X$4=1,\" cm\",IF(cal!$X$4=2,\" in\"))&\" \"&$R$17&\" \"&ROUND(cal!AC52,1)&IF(cal!$X$4=1,\" cm\",IF(cal!$X$4=2,\" in\"))&\" (Type 6)\"","v":"Clima Canal altura 13 cm ancho 32 cm longitud 200 cm (Type 6)"}]
[]
[]
[]
[]
[]
[{"$f":"cal!$AF$1&\" \"&$R$15&\" \"&ROUND(cal!Y58,1)&IF(cal!$X$4=1,\" cm\",IF(cal!$X$4=2,\" in\"))&\" \"&$R$16&\" \"&ROUND(cal!AA58,1)&IF(cal!$X$4=1,\" cm\",IF(cal!$X$4=2,\" in\"))&\" \"&$R$17&\" \"&ROUND(cal!AC58,1)&IF(cal!$X$4=1,\" cm\",IF(cal!$X$4=2,\" in\"))&\" (Type 7)\"","v":"Clima Canal altura 13 cm ancho 32 cm longitud 230 cm (Type 7)"}]
[]
[]
[]
[]
[]
[{"$f":"cal!$AF$1&\" \"&$R$15&\" \"&ROUND(cal!Y64,1)&IF(cal!$X$4=1,\" cm\",IF(cal!$X$4=2,\" in\"))&\" \"&$R$16&\" \"&ROUND(cal!AA64,1)&IF(cal!$X$4=1,\" cm\",IF(cal!$X$4=2,\" in\"))&\" \"&$R$17&\" \"&ROUND(cal!AC64,1)&IF(cal!$X$4=1,\" cm\",IF(cal!$X$4=2,\" in\"))&\" (Type 8)\"","v":"Clima Canal altura 13 cm ancho 32 cm longitud 280 cm (Type 8)"}]
[]
[]
[]
[]
[]
[{"$f":"cal!$AF$1&\" \"&$R$15&\" \"&ROUND(cal!Y70,1)&IF(cal!$X$4=1,\" cm\",IF(cal!$X$4=2,\" in\"))&\" \"&$R$16&\" \"&ROUND(cal!AA70,1)&IF(cal!$X$4=1,\" cm\",IF(cal!$X$4=2,\" in\"))&\" \"&$R$17&\" \"&ROUND(cal!AC70,1)&IF(cal!$X$4=1,\" cm\",IF(cal!$X$4=2,\" in\"))&\" (Type 9)\"","v":"Clima Canal altura 13 cm ancho 32 cm longitud 300 cm (Type 9)"}]
[]
[]
[]
[]
[]
["*La potencia de enfriamiento se calcula según la norma EN 16430 con ventiladores de todas las alturas.",{"$nulls":11},{"$f":"cal!N70","v":"v2022-12-13"}]
["**Potencia sonora según ISO 3741: 2010."]
["***Nivel de presión acústica con una amortiguación ambiental supuesta de 8 dB (A)."]

{"sheet":"SW","index":8,"n_rows":71,"n_cols":18,"rows_kept":71,"hidden":true,"merged":[[5,11,5,12],[6,11,6,12],[7,5,7,8],[7,11,7,12],[8,5,8,8],[9,5,9,8],[10,5,10,8],[14,0,14,12],[20,0,20,12],[26,0,26,12],[32,0,32,12],[38,0,38,12],[44,0,44,12],[50,0,50,12],[56,0,56,12],[62,0,62,12]]}
[]
["Formulary"]
[]
["Conditions"]
[]
["Temperaturer",{"$nulls":10},"Höjd över havet"]
["Värme:",{"$nulls":4},"Kyla:",{"$nulls":10},"Kopiera all data"]
["Tillopp",null,null,{"$f":"cal!E9","v":75},{"$f":"IF(cal!$X$4=1,\"°C\",IF(cal!$X$4=2,\"°F\"))","v":"°C"},{"$f":"A8","v":"Tillopp"},{"$nulls":3},{"$f":"cal!K9","v":16},{"$f":"E8","v":"°C"},"Enhetssystem",{"$nulls":4},"SI-enheter"]
["Retur",null,null,{"$f":"cal!E10","v":65},{"$f":"E8","v":"°C"},{"$f":"A9","v":"Retur"},{"$nulls":3},{"$f":"cal!K10","v":18},{"$f":"E8","v":"°C"},{"$nulls":5},"Imperiella-enheter"]
["Rum (torr)",null,null,{"$f":"cal!E11","v":20},{"$f":"E8","v":"°C"},{"$f":"A10","v":"Rum (torr)"},{"$nulls":3},{"$f":"cal!K11","v":27},{"$f":"E8","v":"°C"}]
[{"$nulls":5},"rel. Fuktighet",{"$nulls":3},{"$f":"cal!K12","v":{"v":0.5,"d":"50%"}}]
[]
[]
["Fläkthastighet","Spänning, Fläkt [V]",{"$f":"CONCATENATE(\"Värme effekt * \",ROUND(D8,0),\"/\",ROUND(D9,0),\"/\",ROUND(D10,0),\" [\"&IF(cal!$X$4=1,\"W\",IF(cal!$X$4=2,\"Btu/h\"))&\"]\")","v":"Värme effekt * 75/65/20 [W]"},{"$f":"\"Vattenflöde, värme [\"&IF(cal!$X$4=1,\"l/h\",IF(cal!$X$4=2,\"GPM\"))&\"]\"","v":"Vattenflöde, värme [l/h]"},{"$f":"\"Tryckfall, vatten [\"&IF(cal!$X$4=1,\"kPa\",IF(cal!$X$4=2,\"inH2O\"))&\"]\"","v":"Tryckfall, vatten [kPa]"},{"$f":"CONCATENATE(\"Märkbar kylkapacitet * \",ROUND(J8,0),\"/\",ROUND(J9,0),\"/\",ROUND(J10,0),\" [\"&IF(cal!$X$4=1,\"W\",IF(cal!$X$4=2,\"Btu/h\"))&\"]\")","v":"Märkbar kylkapacitet * 16/18/27 [W]"},{"$f":"CONCATENATE(\"Total kylkapacitet \",ROUND(J8,0),\"/\",ROUND(J9,0),\"/\",ROUND(J10,0),\" [\"&IF(cal!$X$4=1,\"W\",IF(cal!$X$4=2,\"Btu/h\"))&\"]\")","v":"Total kylkapacitet 16/18/27 [W]"},{"$f":"\"Vattenflöde, kyla [\"&IF(cal!$X$4=1,\"l/h\",IF(cal!$X$4=2,\"GPM\"))&\"]\"","v":"Vattenflöde, kyla [l/h]"},{"$f":"E14","v":"Tryckfall, vatten [kPa]"},"Ljudtryck *** [dB(A)]","Ljudeffekt ** [dB(A)]","Effektförbrukning [W]",{"$f":"\"Luftflöde [\"&IF(cal!$X$4=1,\"m³/h\",IF(cal!$X$4=2,\"CFM\"))&\"]\"","v":"Luftflöde [m³/h]"},{"$f":"\"Air exhaust temp. heating [\"&IF(cal!$X$4=1,\"°C\",IF(cal!$X$4=2,\"°F\"))&\"]\"","v":"Air exhaust temp. heating [°C]"},{"$f":"\"Air exhaust temp. cooling [\"&IF(cal!$X$4=1,\"°C\",IF(cal!$X$4=2,\"°F\"))&\"]\"","v":"Air exhaust temp. cooling [°C]"}]
[{"$f":"cal!$AF$1&\" \"&$R$15&\" \"&ROUND(cal!Y22,1)&IF(cal!$X$4=1,\" cm\",IF(cal!$X$4=2,\" in\"))&\" \"&$R$16&\" \"&ROUND(cal!AA22,1)&IF(cal!$X$4=1,\" cm\",IF(cal!$X$4=2,\" in\"))&\" \"&$R$17&\" \"&ROUND(cal!AC22,1)&IF(cal!$X$4=1,\" cm\",IF(cal!$X$4=2,\" in\"))&\" (Typ 1)\"","v":"Clima Canal höjd 13 cm djup 32 cm längd 70 cm (Typ 1)"},{"$nulls":15},"Temp.","höjd"]
[{"$nulls":16},"värme!","djup"]
[{"$nulls":16},"kyla!","längd"]
[]
[]
[]
[{"$f":"cal!$AF$1&\" \"&$R$15&\" \"&ROUND(cal!Y28,1)&IF(cal!$X$4=1,\" cm\",IF(cal!$X$4=2,\" in\"))&\" \"&$R$16&\" \"&ROUND(cal!AA28,1)&IF(cal!$X$4=1,\" cm\",IF(cal!$X$4=2,\" in\"))&\" \"&$R$17&\" \"&ROUND(cal!AC28,1)&IF(cal!$X$4=1,\" cm\",IF(cal!$X$4=2,\" in\"))&\" (Typ 2)\"","v":"Clima Canal höjd 13 cm djup 32 cm längd 100 cm (Typ 2)"}]
[]
[]
[]
[]
[]
[{"$f":"cal!$AF$1&\" \"&$R$15&\" \"&ROUND(cal!Y34,1)&IF(cal!$X$4=1,\" cm\",IF(cal!$X$4=2,\" in\"))&\" \"&$R$16&\" \"&ROUND(cal!AA34,1)&IF(cal!$X$4=1,\" cm\",IF(cal!$X$4=2,\" in\"))&\" \"&$R$17&\" \"&ROUND(cal!AC34,1)&IF(cal!$X$4=1,\" cm\",IF(cal!$X$4=2,\" in\"))&\" (Typ 3)\"","v":"Clima Canal höjd 13 cm djup 32 cm längd 120 cm (Typ 3)"}]
[]
[]
[]
[]
[]
[{"$f":"cal!$AF$1&\" \"&$R$15&\" \"&ROUND(cal!Y40,1)&IF(cal!$X$4=1,\" cm\",IF(cal!$X$4=2,\" in\"))&\" \"&$R$16&\" \"&ROUND(cal!AA40,1)&IF(cal!$X$4=1,\" cm\",IF(cal!$X$4=2,\" in\"))&\" \"&$R$17&\" \"&ROUND(cal!AC40,1)&IF(cal!$X$4=1,\" cm\",IF(cal!$X$4=2,\" in\"))&\" (Typ 4)\"","v":"Clima Canal höjd 13 cm djup 32 cm längd 140 cm (Typ 4)"}]
[]
[]
[]
[]
[]
[{"$f":"cal!$AF$1&\" \"&$R$15&\" \"&ROUND(cal!Y46,1)&IF(cal!$X$4=1,\" cm\",IF(cal!$X$4=2,\" in\"))&\" \"&$R$16&\" \"&ROUND(cal!AA46,1)&IF(cal!$X$4=1,\" cm\",IF(cal!$X$4=2,\" in\"))&\" \"&$R$17&\" \"&ROUND(cal!AC46,1)&IF(cal!$X$4=1,\" cm\",IF(cal!$X$4=2,\" in\"))&\" (Typ 5)\"","v":"Clima Canal höjd 13 cm djup 32 cm längd 170 cm (Typ 5)"}]
[]
[]
[]
[]
[]
[{"$f":"cal!$AF$1&\" \"&$R$15&\" \"&ROUND(cal!Y52,1)&IF(cal!$X$4=1,\" cm\",IF(cal!$X$4=2,\" in\"))&\" \"&$R$16&\" \"&ROUND(cal!AA52,1)&IF(cal!$X$4=1,\" cm\",IF(cal!$X$4=2,\" in\"))&\" \"&$R$17&\" \"&ROUND(cal!AC52,1)&IF(cal!$X$4=1,\" cm\",IF(cal!$X$4=2,\" in\"))&\" (Typ 6)\"","v":"Clima Canal höjd 13 cm djup 32 cm längd 200 cm (Typ 6)"}]
[]
[]
[]
[]
[]
[{"$f":"cal!$AF$1&\" \"&$R$15&\" \"&ROUND(cal!Y58,1)&IF(cal!$X$4=1,\" cm\",IF(cal!$X$4=2,\" in\"))&\" \"&$R$16&\" \"&ROUND(cal!AA58,1)&IF(cal!$X$4=1,\" cm\",IF(cal!$X$4=2,\" in\"))&\" \"&$R$17&\" \"&ROUND(cal!AC58,1)&IF(cal!$X$4=1,\" cm\",IF(cal!$X$4=2,\" in\"))&\" (Typ 7)\"","v":"Clima Canal höjd 13 cm djup 32 cm längd 230 cm (Typ 7)"}]
[]
[]
[]
[]
[]
[{"$f":"cal!$AF$1&\" \"&$R$15&\" \"&ROUND(cal!Y64,1)&IF(cal!$X$4=1,\" cm\",IF(cal!$X$4=2,\" in\"))&\" \"&$R$16&\" \"&ROUND(cal!AA64,1)&IF(cal!$X$4=1,\" cm\",IF(cal!$X$4=2,\" in\"))&\" \"&$R$17&\" \"&ROUND(cal!AC64,1)&IF(cal!$X$4=1,\" cm\",IF(cal!$X$4=2,\" in\"))&\" (Typ 8)\"","v":"Clima Canal höjd 13 cm djup 32 cm längd 280 cm (Typ 8)"}]
[]
[]
[]
[]
[]
[{"$f":"cal!$AF$1&\" \"&$R$15&\" \"&ROUND(cal!Y70,1)&IF(cal!$X$4=1,\" cm\",IF(cal!$X$4=2,\" in\"))&\" \"&$R$16&\" \"&ROUND(cal!AA70,1)&IF(cal!$X$4=1,\" cm\",IF(cal!$X$4=2,\" in\"))&\" \"&$R$17&\" \"&ROUND(cal!AC70,1)&IF(cal!$X$4=1,\" cm\",IF(cal!$X$4=2,\" in\"))&\" (Typ 9)\"","v":"Clima Canal höjd 13 cm djup 32 cm längd 300 cm (Typ 9)"}]
[]
[]
[]
[]
[]
["*Värden enligt EN16430",{"$nulls":11},{"$f":"cal!N70","v":"v2022-12-13"}]
["**Ljudeffekt enligt ISO 3741: 2010"]
["***Ljudtryck med en antagen rumsdämpning på 8dB (A),"]

{"sheet":"TS","index":9,"n_rows":71,"n_cols":18,"rows_kept":71,"hidden":true,"merged":[[5,11,5,12],[6,11,6,12],[7,0,7,2],[7,5,7,8],[7,11,7,12],[8,0,8,2],[8,5,8,8],[9,0,9,2],[9,5,9,8],[10,5,10,7],[14,0,14,12],[20,0,20,12],[26,0,26,12],[32,0,32,12],[38,0,38,12],[44,0,44,12],[50,0,50,12],[56,0,56,12],[62,0,62,12]]}
[]
["Formulary"]
[]
["Conditions"]
[]
["Teploty",{"$nulls":10},"Výška umístění"]
["Topení:",{"$nulls":4},"Chlazení:",{"$nulls":10},"Kopírovat všechna data"]
["Voda na přívodu",null,null,{"$f":"cal!E9","v":75},{"$f":"IF(cal!$X$4=1,\"°C\",IF(cal!$X$4=2,\"°F\"))","v":"°C"},{"$f":"A8","v":"Voda na přívodu"},{"$nulls":3},{"$f":"cal!K9","v":16},{"$f":"E8","v":"°C"},"Převod jednotek",{"$nulls":4},"Mezinárodní (Sl)"]
["Voda na zpátečce",null,null,{"$f":"cal!E10","v":65},{"$f":"E8","v":"°C"},{"$f":"A9","v":"Voda na zpátečce"},{"$nulls":3},{"$f":"cal!K10","v":18},{"$f":"E8","v":"°C"},{"$nulls":5},"Imperiální"]
["\"Suchá\" Teplota vzduchu",null,null,{"$f":"cal!E11","v":20},{"$f":"E8","v":"°C"},{"$f":"A10","v":"\"Suchá\" Teplota vzduchu"},{"$nulls":3},{"$f":"cal!K11","v":27},{"$f":"E8","v":"°C"}]
[{"$nulls":5},"Relativní vlhkost",{"$nulls":3},{"$f":"cal!K12","v":{"v":0.5,"d":"50%"}}]
[]
[]
["Rychlost","Ovládací napětí [V]",{"$f":"CONCATENATE(\"Výkon Topení * \",ROUND(D8,0),\"/\",ROUND(D9,0),\"/\",ROUND(D10,0),\" [\"&IF(cal!$X$4=1,\"W\",IF(cal!$X$4=2,\"Btu/h\"))&\"]\")","v":"Výkon Topení * 75/65/20 [W]"},{"$f":"\"Průtok vody, topení [\"&IF(cal!$X$4=1,\"l/h\",IF(cal!$X$4=2,\"GPM\"))&\"]\"","v":"Průtok vody, topení [l/h]"},{"$f":"\"Tlaková ztráta [\"&IF(cal!$X$4=1,\"kPa\",IF(cal!$X$4=2,\"inH2O\"))&\"]\"","v":"Tlaková ztráta [kPa]"},{"$f":"CONCATENATE(\"Výkon chlazení Znatelný * \",ROUND(J8,0),\"/\",ROUND(J9,0),\"/\",ROUND(J10,0),\" [\"&IF(cal!$X$4=1,\"W\",IF(cal!$X$4=2,\"Btu/h\"))&\"]\")","v":"Výkon chlazení Znatelný * 16/18/27 [W]"},{"$f":"CONCATENATE(\"Výkon chlazení Celkový \",ROUND(J8,0),\"/\",ROUND(J9,0),\"/\",ROUND(J10,0),\" [\"&IF(cal!$X$4=1,\"W\",IF(cal!$X$4=2,\"Btu/h\"))&\"]\")","v":"Výkon chlazení Celkový 16/18/27 [W]"},{"$f":"\"Průtok vody,chlazení [\"&IF(cal!$X$4=1,\"l/h\",IF(cal!$X$4=2,\"GPM\"))&\"]\"","v":"Průtok vody,chlazení [l/h]"},{"$f":"E14","v":"Tlaková ztráta [kPa]"},"Akustický tlak *** [dB(A)]","Akustický výkon ** [dB(A)]","Elektrický výkon [W]",{"$f":"\"Průtok vzduchu [\"&IF(cal!$X$4=1,\"m³/h\",IF(cal!$X$4=2,\"CFM\"))&\"]\"","v":"Průtok vzduchu [m³/h]"},{"$f":"\"Air exhaust temp. heating [\"&IF(cal!$X$4=1,\"°C\",IF(cal!$X$4=2,\"°F\"))&\"]\"","v":"Air exhaust temp. heating [°C]"},{"$f":"\"Air exhaust temp. cooling [\"&IF(cal!$X$4=1,\"°C\",IF(cal!$X$4=2,\"°F\"))&\"]\"","v":"Air exhaust temp. cooling [°C]"}]
[{"$f":"cal!$AF$1&\", \"&$R$15&\" \"&ROUND(cal!Y22,1)&IF(cal!$X$4=1,\" cm\",IF(cal!$X$4=2,\" in\"))&\", \"&$R$16&\" \"&ROUND(cal!AA22,1)&IF(cal!$X$4=1,\" cm\",IF(cal!$X$4=2,\" in\"))&\", \"&$R$17&\" \"&ROUND(cal!AC22,1)&IF(cal!$X$4=1,\" cm\",IF(cal!$X$4=2,\" in\"))&\" (Typ 1)\"","v":"Clima Canal, Výška 13 cm, Šířka 32 cm, Délka 70 cm (Typ 1)"},{"$nulls":15},"Teploty","Výška"]
[{"$nulls":16},"topení!","Šířka"]
[{"$nulls":16},"chlazení!","Délka"]
[]
[]
[]
[{"$f":"cal!$AF$1&\" \"&$R$15&\" \"&ROUND(cal!Y28,1)&IF(cal!$X$4=1,\" cm\",IF(cal!$X$4=2,\" in\"))&\" \"&$R$16&\" \"&ROUND(cal!AA28,1)&IF(cal!$X$4=1,\" cm\",IF(cal!$X$4=2,\" in\"))&\" \"&$R$17&\" \"&ROUND(cal!AC28,1)&IF(cal!$X$4=1,\" cm\",IF(cal!$X$4=2,\" in\"))&\" (Typ 2)\"","v":"Clima Canal Výška 13 cm Šířka 32 cm Délka 100 cm (Typ 2)"}]
[]
[]
[]
[]
[]
[{"$f":"cal!$AF$1&\" \"&$R$15&\" \"&ROUND(cal!Y34,1)&IF(cal!$X$4=1,\" cm\",IF(cal!$X$4=2,\" in\"))&\" \"&$R$16&\" \"&ROUND(cal!AA34,1)&IF(cal!$X$4=1,\" cm\",IF(cal!$X$4=2,\" in\"))&\" \"&$R$17&\" \"&ROUND(cal!AC34,1)&IF(cal!$X$4=1,\" cm\",IF(cal!$X$4=2,\" in\"))&\" (Type 3)\"","v":"Clima Canal Výška 13 cm Šířka 32 cm Délka 120 cm (Type 3)"}]
[]
[]
[]
[]
[]
[{"$f":"cal!$AF$1&\" \"&$R$15&\" \"&ROUND(cal!Y40,1)&IF(cal!$X$4=1,\" cm\",IF(cal!$X$4=2,\" in\"))&\" \"&$R$16&\" \"&ROUND(cal!AA40,1)&IF(cal!$X$4=1,\" cm\",IF(cal!$X$4=2,\" in\"))&\" \"&$R$17&\" \"&ROUND(cal!AC40,1)&IF(cal!$X$4=1,\" cm\",IF(cal!$X$4=2,\" in\"))&\" (Typ 4)\"","v":"Clima Canal Výška 13 cm Šířka 32 cm Délka 140 cm (Typ 4)"}]
[]
[]
[]
[]
[]
[{"$f":"cal!$AF$1&\" \"&$R$15&\" \"&ROUND(cal!Y46,1)&IF(cal!$X$4=1,\" cm\",IF(cal!$X$4=2,\" in\"))&\" \"&$R$16&\" \"&ROUND(cal!AA46,1)&IF(cal!$X$4=1,\" cm\",IF(cal!$X$4=2,\" in\"))&\" \"&$R$17&\" \"&ROUND(cal!AC46,1)&IF(cal!$X$4=1,\" cm\",IF(cal!$X$4=2,\" in\"))&\" (Typ 5)\"","v":"Clima Canal Výška 13 cm Šířka 32 cm Délka 170 cm (Typ 5)"}]
[]
[]
[]
[]
[]
[{"$f":"cal!$AF$1&\" \"&$R$15&\" \"&ROUND(cal!Y52,1)&IF(cal!$X$4=1,\" cm\",IF(cal!$X$4=2,\" in\"))&\" \"&$R$16&\" \"&ROUND(cal!AA52,1)&IF(cal!$X$4=1,\" cm\",IF(cal!$X$4=2,\" in\"))&\" \"&$R$17&\" \"&ROUND(cal!AC52,1)&IF(cal!$X$4=1,\" cm\",IF(cal!$X$4=2,\" in\"))&\" (Typ 6)\"","v":"Clima Canal Výška 13 cm Šířka 32 cm Délka 200 cm (Typ 6)"}]
[]
[]
[]
[]
[]
[{"$f":"cal!$AF$1&\" \"&$R$15&\" \"&ROUND(cal!Y58,1)&IF(cal!$X$4=1,\" cm\",IF(cal!$X$4=2,\" in\"))&\" \"&$R$16&\" \"&ROUND(cal!AA58,1)&IF(cal!$X$4=1,\" cm\",IF(cal!$X$4=2,\" in\"))&\" \"&$R$17&\" \"&ROUND(cal!AC58,1)&IF(cal!$X$4=1,\" cm\",IF(cal!$X$4=2,\" in\"))&\" (Typ 7)\"","v":"Clima Canal Výška 13 cm Šířka 32 cm Délka 230 cm (Typ 7)"}]
[]
[]
[]
[]
[]
[{"$f":"cal!$AF$1&\" \"&$R$15&\" \"&ROUND(cal!Y64,1)&IF(cal!$X$4=1,\" cm\",IF(cal!$X$4=2,\" in\"))&\" \"&$R$16&\" \"&ROUND(cal!AA64,1)&IF(cal!$X$4=1,\" cm\",IF(cal!$X$4=2,\" in\"))&\" \"&$R$17&\" \"&ROUND(cal!AC64,1)&IF(cal!$X$4=1,\" cm\",IF(cal!$X$4=2,\" in\"))&\" (Typ 8)\"","v":"Clima Canal Výška 13 cm Šířka 32 cm Délka 280 cm (Typ 8)"}]
[]
[]
[]
[]
[]
[{"$f":"cal!$AF$1&\" \"&$R$15&\" \"&ROUND(cal!Y70,1)&IF(cal!$X$4=1,\" cm\",IF(cal!$X$4=2,\" in\"))&\" \"&$R$16&\" \"&ROUND(cal!AA70,1)&IF(cal!$X$4=1,\" cm\",IF(cal!$X$4=2,\" in\"))&\" \"&$R$17&\" \"&ROUND(cal!AC70,1)&IF(cal!$X$4=1,\" cm\",IF(cal!$X$4=2,\" in\"))&\" (Typ 9)\"","v":"Clima Canal Výška 13 cm Šířka 32 cm Délka 300 cm (Typ 9)"}]
[]
[]
[]
[]
[]
["*Hodnoty podle EN16430",{"$nulls":11},{"$f":"cal!N70","v":"v2022-12-13"}]
["**Akustický tlak podle ISO 3741:2010"]
["***Akustický výkon s předpokládaným útlumem místnosti 8 dB (A)."]

{"sheet":"ExtraTaal1","index":10,"n_rows":71,"n_cols":18,"rows_kept":71,"hidden":true,"merged":[[5,11,5,12],[6,11,6,12],[7,0,7,2],[7,5,7,8],[7,11,7,12],[8,0,8,2],[8,5,8,8],[9,0,9,2],[9,5,9,8],[10,5,10,7],[14,0,14,12],[20,0,20,12],[26,0,26,12],[32,0,32,12],[38,0,38,12],[44,0,44,12],[50,0,50,12],[56,0,56,12],[62,0,62,12]]}
[]
["Formulary"]
[]
["Conditions"]
[]
["Temperatures",{"$nulls":10},"Altitude"]
["Heating:",{"$nulls":4},"Cooling:",{"$nulls":10},"Copy all data"]
[{"$f":"\"Inlet temp.\"","v":"Inlet temp."},null,null,{"$f":"cal!E9","v":75},{"$f":"IF(cal!$X$4=1,\"°C\",IF(cal!$X$4=2,\"°F\"))","v":"°C"},{"$f":"A8","v":"Inlet temp."},{"$nulls":3},{"$f":"cal!K9","v":16},{"$f":"E8","v":"°C"},"Unit conversion",{"$nulls":4},"SI-units"]
[{"$f":"\"Return temp.\"","v":"Return temp."},null,null,{"$f":"cal!E10","v":65},{"$f":"E8","v":"°C"},{"$f":"A9","v":"Return temp."},{"$nulls":3},{"$f":"cal!K10","v":18},{"$f":"E8","v":"°C"},{"$nulls":5},"Imperial-units"]
[{"$f":"\"Room temp.\"","v":"Room temp."},null,null,{"$f":"cal!E11","v":20},{"$f":"E8","v":"°C"},{"$f":"A10","v":"Room temp."},{"$nulls":3},{"$f":"cal!K11","v":27},{"$f":"E8","v":"°C"}]
[{"$nulls":5},"Relative humidity",{"$nulls":3},{"$f":"cal!K12","v":{"v":0.5,"d":"50%"}}]
[]
[]
["Speed level:","Control voltage [V]",{"$f":"CONCATENATE(\"Heat output * \",ROUND(D8,0),\"/\",ROUND(D9,0),\"/\",ROUND(D10,0),\" [\"&IF(cal!$X$4=1,\"W\",IF(cal!$X$4=2,\"Btu/h\"))&\"]\")","v":"Heat output * 75/65/20 [W]"},{"$f":"\"Water flowrate, heating [\"&IF(cal!$X$4=1,\"l/h\",IF(cal!$X$4=2,\"GPM\"))&\"]\"","v":"Water flowrate, heating [l/h]"},{"$f":"\"Watersided pressure loss [\"&IF(cal!$X$4=1,\"kPa\",IF(cal!$X$4=2,\"inH2O\"))&\"]\"","v":"Watersided pressure loss [kPa]"},{"$f":"CONCATENATE(\"Sens. cooling capacity * \",ROUND(J8,0),\"/\",ROUND(J9,0),\"/\",ROUND(J10,0),\" [\"&IF(cal!$X$4=1,\"W\",IF(cal!$X$4=2,\"Btu/h\"))&\"]\")","v":"Sens. cooling capacity * 16/18/27 [W]"},{"$f":"CONCATENATE(\"Tot. cooling capacity \",ROUND(J8,0),\"/\",ROUND(J9,0),\"/\",ROUND(J10,0),\" [\"&IF(cal!$X$4=1,\"W\",IF(cal!$X$4=2,\"Btu/h\"))&\"]\")","v":"Tot. cooling capacity 16/18/27 [W]"},{"$f":"\"Water flowrate, cooling [\"&IF(cal!$X$4=1,\"l/h\",IF(cal!$X$4=2,\"GPM\"))&\"]\"","v":"Water flowrate, cooling [l/h]"},{"$f":"\"Watersided pressure loss [\"&IF(cal!$X$4=1,\"kPa\",IF(cal!$X$4=2,\"inH2O\"))&\"]\"","v":"Watersided pressure loss [kPa]"},"Sound pressure *** [dB(A)]","Sound power ** [dB(A)]","Electrical power [W]",{"$f":"\"Air flowrate [\"&IF(cal!$X$4=1,\"m³/h\",IF(cal!$X$4=2,\"CFM\"))&\"]\"","v":"Air flowrate [m³/h]"},{"$f":"\"Air exhaust temp. heating [\"&IF(cal!$X$4=1,\"°C\",IF(cal!$X$4=2,\"°F\"))&\"]\"","v":"Air exhaust temp. heating [°C]"},{"$f":"\"Air exhaust temp. cooling [\"&IF(cal!$X$4=1,\"°C\",IF(cal!$X$4=2,\"°F\"))&\"]\"","v":"Air exhaust temp. cooling [°C]"}]
[{"$f":"cal!$AF$1&\" \"&$R$15&\" \"&ROUND(cal!Y22,1)&IF(cal!$X$4=1,\" cm\",IF(cal!$X$4=2,\" in\"))&\" \"&$R$16&\" \"&ROUND(cal!AA22,1)&IF(cal!$X$4=1,\" cm\",IF(cal!$X$4=2,\" in\"))&\" \"&$R$17&\" \"&ROUND(cal!AC22,1)&IF(cal!$X$4=1,\" cm\",IF(cal!$X$4=2,\" in\"))&\" (Type 1)\"","v":"Clima Canal height 13 cm width 32 cm length 70 cm (Type 1)"},{"$nulls":15},"Temp.","height"]
[{"$nulls":16},"heating!","width"]
[{"$nulls":16},"cooling!","length"]
[]
[]
[]
[{"$f":"cal!$AF$1&\" \"&$R$15&\" \"&ROUND(cal!Y28,1)&IF(cal!$X$4=1,\" cm\",IF(cal!$X$4=2,\" in\"))&\" \"&$R$16&\" \"&ROUND(cal!AA28,1)&IF(cal!$X$4=1,\" cm\",IF(cal!$X$4=2,\" in\"))&\" \"&$R$17&\" \"&ROUND(cal!AC28,1)&IF(cal!$X$4=1,\" cm\",IF(cal!$X$4=2,\" in\"))&\" (Type 2)\"","v":"Clima Canal height 13 cm width 32 cm length 100 cm (Type 2)"}]
[]
[]
[]
[]
[]
[{"$f":"cal!$AF$1&\" \"&$R$15&\" \"&ROUND(cal!Y34,1)&IF(cal!$X$4=1,\" cm\",IF(cal!$X$4=2,\" in\"))&\" \"&$R$16&\" \"&ROUND(cal!AA34,1)&IF(cal!$X$4=1,\" cm\",IF(cal!$X$4=2,\" in\"))&\" \"&$R$17&\" \"&ROUND(cal!AC34,1)&IF(cal!$X$4=1,\" cm\",IF(cal!$X$4=2,\" in\"))&\" (Type 3)\"","v":"Clima Canal height 13 cm width 32 cm length 120 cm (Type 3)"}]
[]
[]
[]
[]
[]
[{"$f":"cal!$AF$1&\" \"&$R$15&\" \"&ROUND(cal!Y40,1)&IF(cal!$X$4=1,\" cm\",IF(cal!$X$4=2,\" in\"))&\" \"&$R$16&\" \"&ROUND(cal!AA40,1)&IF(cal!$X$4=1,\" cm\",IF(cal!$X$4=2,\" in\"))&\" \"&$R$17&\" \"&ROUND(cal!AC40,1)&IF(cal!$X$4=1,\" cm\",IF(cal!$X$4=2,\" in\"))&\" (Type 4)\"","v":"Clima Canal height 13 cm width 32 cm length 140 cm (Type 4)"}]
[]
[]
[]
[]
[]
[{"$f":"cal!$AF$1&\" \"&$R$15&\" \"&ROUND(cal!Y46,1)&IF(cal!$X$4=1,\" cm\",IF(cal!$X$4=2,\" in\"))&\" \"&$R$16&\" \"&ROUND(cal!AA46,1)&IF(cal!$X$4=1,\" cm\",IF(cal!$X$4=2,\" in\"))&\" \"&$R$17&\" \"&ROUND(cal!AC46,1)&IF(cal!$X$4=1,\" cm\",IF(cal!$X$4=2,\" in\"))&\" (Type 5)\"","v":"Clima Canal height 13 cm width 32 cm length 170 cm (Type 5)"}]
[]
[]
[]
[]
[]
[{"$f":"cal!$AF$1&\" \"&$R$15&\" \"&ROUND(cal!Y52,1)&IF(cal!$X$4=1,\" cm\",IF(cal!$X$4=2,\" in\"))&\" \"&$R$16&\" \"&ROUND(cal!AA52,1)&IF(cal!$X$4=1,\" cm\",IF(cal!$X$4=2,\" in\"))&\" \"&$R$17&\" \"&ROUND(cal!AC52,1)&IF(cal!$X$4=1,\" cm\",IF(cal!$X$4=2,\" in\"))&\" (Type 6)\"","v":"Clima Canal height 13 cm width 32 cm length 200 cm (Type 6)"}]
[]
[]
[]
[]
[]
[{"$f":"cal!$AF$1&\" \"&$R$15&\" \"&ROUND(cal!Y58,1)&IF(cal!$X$4=1,\" cm\",IF(cal!$X$4=2,\" in\"))&\" \"&$R$16&\" \"&ROUND(cal!AA58,1)&IF(cal!$X$4=1,\" cm\",IF(cal!$X$4=2,\" in\"))&\" \"&$R$17&\" \"&ROUND(cal!AC58,1)&IF(cal!$X$4=1,\" cm\",IF(cal!$X$4=2,\" in\"))&\" (Type 7)\"","v":"Clima Canal height 13 cm width 32 cm length 230 cm (Type 7)"}]
[]
[]
[]
[]
[]
[{"$f":"cal!$AF$1&\" \"&$R$15&\" \"&ROUND(cal!Y64,1)&IF(cal!$X$4=1,\" cm\",IF(cal!$X$4=2,\" in\"))&\" \"&$R$16&\" \"&ROUND(cal!AA64,1)&IF(cal!$X$4=1,\" cm\",IF(cal!$X$4=2,\" in\"))&\" \"&$R$17&\" \"&ROUND(cal!AC64,1)&IF(cal!$X$4=1,\" cm\",IF(cal!$X$4=2,\" in\"))&\" (Type 8)\"","v":"Clima Canal height 13 cm width 32 cm length 280 cm (Type 8)"}]
[]
[]
[]
[]
[]
[{"$f":"cal!$AF$1&\" \"&$R$15&\" \"&ROUND(cal!Y70,1)&IF(cal!$X$4=1,\" cm\",IF(cal!$X$4=2,\" in\"))&\" \"&$R$16&\" \"&ROUND(cal!AA70,1)&IF(cal!$X$4=1,\" cm\",IF(cal!$X$4=2,\" in\"))&\" \"&$R$17&\" \"&ROUND(cal!AC70,1)&IF(cal!$X$4=1,\" cm\",IF(cal!$X$4=2,\" in\"))&\" (Type 9)\"","v":"Clima Canal height 13 cm width 32 cm length 300 cm (Type 9)"}]
[]
[]
[]
[]
[]
["*Values according to EN 16430",{"$nulls":11},{"$f":"cal!N70","v":"v2022-12-13"}]
["**Sound power according to ISO 3741:2010"]
["***Sound pressure with an assumed room damping of 8dB(A)"]

{"sheet":"ExtraTaal2","index":11,"n_rows":71,"n_cols":18,"rows_kept":71,"hidden":true,"merged":[[5,11,5,12],[6,11,6,12],[7,0,7,2],[7,5,7,8],[7,11,7,12],[8,0,8,2],[8,5,8,8],[9,0,9,2],[9,5,9,8],[10,5,10,7],[14,0,14,12],[20,0,20,12],[26,0,26,12],[32,0,32,12],[38,0,38,12],[44,0,44,12],[50,0,50,12],[56,0,56,12],[62,0,62,12]]}
[]
["Formulary"]
[]
["Conditions"]
[]
["Temperatures",{"$nulls":10},"Altitude"]
["Heating:",{"$nulls":4},"Cooling:",{"$nulls":10},"Copy all data"]
[{"$f":"\"Inlet temp.\"","v":"Inlet temp."},null,null,{"$f":"cal!E9","v":75},{"$f":"IF(cal!$X$4=1,\"°C\",IF(cal!$X$4=2,\"°F\"))","v":"°C"},{"$f":"A8","v":"Inlet temp."},{"$nulls":3},{"$f":"cal!K9","v":16},{"$f":"E8","v":"°C"},"Unit conversion",{"$nulls":4},"SI-units"]
[{"$f":"\"Return temp.\"","v":"Return temp."},null,null,{"$f":"cal!E10","v":65},{"$f":"E8","v":"°C"},{"$f":"A9","v":"Return temp."},{"$nulls":3},{"$f":"cal!K10","v":18},{"$f":"E8","v":"°C"},{"$nulls":5},"Imperial-units"]
[{"$f":"\"Room temp.\"","v":"Room temp."},null,null,{"$f":"cal!E11","v":20},{"$f":"E8","v":"°C"},{"$f":"A10","v":"Room temp."},{"$nulls":3},{"$f":"cal!K11","v":27},{"$f":"E8","v":"°C"}]
[{"$nulls":5},"Relative humidity",{"$nulls":3},{"$f":"cal!K12","v":{"v":0.5,"d":"50%"}}]
[]
[]
["Speed level:","Control voltage [V]",{"$f":"CONCATENATE(\"Heat output * \",ROUND(D8,0),\"/\",ROUND(D9,0),\"/\",ROUND(D10,0),\" [\"&IF(cal!$X$4=1,\"W\",IF(cal!$X$4=2,\"Btu/h\"))&\"]\")","v":"Heat output * 75/65/20 [W]"},{"$f":"\"Water flowrate, heating [\"&IF(cal!$X$4=1,\"l/h\",IF(cal!$X$4=2,\"GPM\"))&\"]\"","v":"Water flowrate, heating [l/h]"},{"$f":"\"Watersided pressure loss [\"&IF(cal!$X$4=1,\"kPa\",IF(cal!$X$4=2,\"inH2O\"))&\"]\"","v":"Watersided pressure loss [kPa]"},{"$f":"CONCATENATE(\"Sens. cooling capacity * \",ROUND(J8,0),\"/\",ROUND(J9,0),\"/\",ROUND(J10,0),\" [\"&IF(cal!$X$4=1,\"W\",IF(cal!$X$4=2,\"Btu/h\"))&\"]\")","v":"Sens. cooling capacity * 16/18/27 [W]"},{"$f":"CONCATENATE(\"Tot. cooling capacity \",ROUND(J8,0),\"/\",ROUND(J9,0),\"/\",ROUND(J10,0),\" [\"&IF(cal!$X$4=1,\"W\",IF(cal!$X$4=2,\"Btu/h\"))&\"]\")","v":"Tot. cooling capacity 16/18/27 [W]"},{"$f":"\"Water flowrate, cooling [\"&IF(cal!$X$4=1,\"l/h\",IF(cal!$X$4=2,\"GPM\"))&\"]\"","v":"Water flowrate, cooling [l/h]"},{"$f":"\"Watersided pressure loss [\"&IF(cal!$X$4=1,\"kPa\",IF(cal!$X$4=2,\"inH2O\"))&\"]\"","v":"Watersided pressure loss [kPa]"},"Sound pressure *** [dB(A)]","Sound power ** [dB(A)]","Electrical power [W]",{"$f":"\"Air flowrate [\"&IF(cal!$X$4=1,\"m³/h\",IF(cal!$X$4=2,\"CFM\"))&\"]\"","v":"Air flowrate [m³/h]"},{"$f":"\"Air exhaust temp. heating [\"&IF(cal!$X$4=1,\"°C\",IF(cal!$X$4=2,\"°F\"))&\"]\"","v":"Air exhaust temp. heating [°C]"},{"$f":"\"Air exhaust temp. cooling [\"&IF(cal!$X$4=1,\"°C\",IF(cal!$X$4=2,\"°F\"))&\"]\"","v":"Air exhaust temp. cooling [°C]"}]
[{"$f":"cal!$AF$1&\" \"&$R$15&\" \"&ROUND(cal!Y22,1)&IF(cal!$X$4=1,\" cm\",IF(cal!$X$4=2,\" in\"))&\" \"&$R$16&\" \"&ROUND(cal!AA22,1)&IF(cal!$X$4=1,\" cm\",IF(cal!$X$4=2,\" in\"))&\" \"&$R$17&\" \"&ROUND(cal!AC22,1)&IF(cal!$X$4=1,\" cm\",IF(cal!$X$4=2,\" in\"))&\" (Type 1)\"","v":"Clima Canal height 13 cm width 32 cm length 70 cm (Type 1)"},{"$nulls":15},"Temp.","height"]
[{"$nulls":16},"heating!","width"]
[{"$nulls":16},"cooling!","length"]
[]
[]
[]
[{"$f":"cal!$AF$1&\" \"&$R$15&\" \"&ROUND(cal!Y28,1)&IF(cal!$X$4=1,\" cm\",IF(cal!$X$4=2,\" in\"))&\" \"&$R$16&\" \"&ROUND(cal!AA28,1)&IF(cal!$X$4=1,\" cm\",IF(cal!$X$4=2,\" in\"))&\" \"&$R$17&\" \"&ROUND(cal!AC28,1)&IF(cal!$X$4=1,\" cm\",IF(cal!$X$4=2,\" in\"))&\" (Type 2)\"","v":"Clima Canal height 13 cm width 32 cm length 100 cm (Type 2)"}]
[]
[]
[]
[]
[]
[{"$f":"cal!$AF$1&\" \"&$R$15&\" \"&ROUND(cal!Y34,1)&IF(cal!$X$4=1,\" cm\",IF(cal!$X$4=2,\" in\"))&\" \"&$R$16&\" \"&ROUND(cal!AA34,1)&IF(cal!$X$4=1,\" cm\",IF(cal!$X$4=2,\" in\"))&\" \"&$R$17&\" \"&ROUND(cal!AC34,1)&IF(cal!$X$4=1,\" cm\",IF(cal!$X$4=2,\" in\"))&\" (Type 3)\"","v":"Clima Canal height 13 cm width 32 cm length 120 cm (Type 3)"}]
[]
[]
[]
[]
[]
[{"$f":"cal!$AF$1&\" \"&$R$15&\" \"&ROUND(cal!Y40,1)&IF(cal!$X$4=1,\" cm\",IF(cal!$X$4=2,\" in\"))&\" \"&$R$16&\" \"&ROUND(cal!AA40,1)&IF(cal!$X$4=1,\" cm\",IF(cal!$X$4=2,\" in\"))&\" \"&$R$17&\" \"&ROUND(cal!AC40,1)&IF(cal!$X$4=1,\" cm\",IF(cal!$X$4=2,\" in\"))&\" (Type 4)\"","v":"Clima Canal height 13 cm width 32 cm length 140 cm (Type 4)"}]
[]
[]
[]
[]
[]
[{"$f":"cal!$AF$1&\" \"&$R$15&\" \"&ROUND(cal!Y46,1)&IF(cal!$X$4=1,\" cm\",IF(cal!$X$4=2,\" in\"))&\" \"&$R$16&\" \"&ROUND(cal!AA46,1)&IF(cal!$X$4=1,\" cm\",IF(cal!$X$4=2,\" in\"))&\" \"&$R$17&\" \"&ROUND(cal!AC46,1)&IF(cal!$X$4=1,\" cm\",IF(cal!$X$4=2,\" in\"))&\" (Type 5)\"","v":"Clima Canal height 13 cm width 32 cm length 170 cm (Type 5)"}]
[]
[]
[]
[]
[]
[{"$f":"cal!$AF$1&\" \"&$R$15&\" \"&ROUND(cal!Y52,1)&IF(cal!$X$4=1,\" cm\",IF(cal!$X$4=2,\" in\"))&\" \"&$R$16&\" \"&ROUND(cal!AA52,1)&IF(cal!$X$4=1,\" cm\",IF(cal!$X$4=2,\" in\"))&\" \"&$R$17&\" \"&ROUND(cal!AC52,1)&IF(cal!$X$4=1,\" cm\",IF(cal!$X$4=2,\" in\"))&\" (Type 6)\"","v":"Clima Canal height 13 cm width 32 cm length 200 cm (Type 6)"}]
[]
[]
[]
[]
[]
[{"$f":"cal!$AF$1&\" \"&$R$15&\" \"&ROUND(cal!Y58,1)&IF(cal!$X$4=1,\" cm\",IF(cal!$X$4=2,\" in\"))&\" \"&$R$16&\" \"&ROUND(cal!AA58,1)&IF(cal!$X$4=1,\" cm\",IF(cal!$X$4=2,\" in\"))&\" \"&$R$17&\" \"&ROUND(cal!AC58,1)&IF(cal!$X$4=1,\" cm\",IF(cal!$X$4=2,\" in\"))&\" (Type 7)\"","v":"Clima Canal height 13 cm width 32 cm length 230 cm (Type 7)"}]
[]
[]
[]
[]
[]
[{"$f":"cal!$AF$1&\" \"&$R$15&\" \"&ROUND(cal!Y64,1)&IF(cal!$X$4=1,\" cm\",IF(cal!$X$4=2,\" in\"))&\" \"&$R$16&\" \"&ROUND(cal!AA64,1)&IF(cal!$X$4=1,\" cm\",IF(cal!$X$4=2,\" in\"))&\" \"&$R$17&\" \"&ROUND(cal!AC64,1)&IF(cal!$X$4=1,\" cm\",IF(cal!$X$4=2,\" in\"))&\" (Type 8)\"","v":"Clima Canal height 13 cm width 32 cm length 280 cm (Type 8)"}]
[]
[]
[]
[]
[]
[{"$f":"cal!$AF$1&\" \"&$R$15&\" \"&ROUND(cal!Y70,1)&IF(cal!$X$4=1,\" cm\",IF(cal!$X$4=2,\" in\"))&\" \"&$R$16&\" \"&ROUND(cal!AA70,1)&IF(cal!$X$4=1,\" cm\",IF(cal!$X$4=2,\" in\"))&\" \"&$R$17&\" \"&ROUND(cal!AC70,1)&IF(cal!$X$4=1,\" cm\",IF(cal!$X$4=2,\" in\"))&\" (Type 9)\"","v":"Clima Canal height 13 cm width 32 cm length 300 cm (Type 9)"}]
[]
[]
[]
[]
[]
["*Values according to EN 16430",{"$nulls":11},{"$f":"cal!N70","v":"v2022-12-13"}]
["**Sound power according to ISO 3741:2010"]
["***Sound pressure with an assumed room damping of 8dB(A)"]

{"sheet":"ExtraTaal3","index":12,"n_rows":71,"n_cols":18,"rows_kept":71,"hidden":true,"merged":[[5,11,5,12],[6,11,6,12],[7,0,7,2],[7,5,7,8],[7,11,7,12],[8,0,8,2],[8,5,8,8],[9,0,9,2],[9,5,9,8],[10,5,10,7],[14,0,14,12],[20,0,20,12],[26,0,26,12],[32,0,32,12],[38,0,38,12],[44,0,44,12],[50,0,50,12],[56,0,56,12],[62,0,62,12]]}
[]
["Formulary"]
[]
["Conditions"]
[]
["Temperatures",{"$nulls":10},"Altitude"]
["Heating:",{"$nulls":4},"Cooling:",{"$nulls":10},"Copy all data"]
[{"$f":"\"Inlet temp.\"","v":"Inlet temp."},null,null,{"$f":"cal!E9","v":75},{"$f":"IF(cal!$X$4=1,\"°C\",IF(cal!$X$4=2,\"°F\"))","v":"°C"},{"$f":"A8","v":"Inlet temp."},{"$nulls":3},{"$f":"cal!K9","v":16},{"$f":"E8","v":"°C"},"Unit conversion",{"$nulls":4},"SI-units"]
[{"$f":"\"Return temp.\"","v":"Return temp."},null,null,{"$f":"cal!E10","v":65},{"$f":"E8","v":"°C"},{"$f":"A9","v":"Return temp."},{"$nulls":3},{"$f":"cal!K10","v":18},{"$f":"E8","v":"°C"},{"$nulls":5},"Imperial-units"]
[{"$f":"\"Room temp.\"","v":"Room temp."},null,null,{"$f":"cal!E11","v":20},{"$f":"E8","v":"°C"},{"$f":"A10","v":"Room temp."},{"$nulls":3},{"$f":"cal!K11","v":27},{"$f":"E8","v":"°C"}]
[{"$nulls":5},"Relative humidity",{"$nulls":3},{"$f":"cal!K12","v":{"v":0.5,"d":"50%"}}]
[]
[]
["Speed level:","Control voltage [V]",{"$f":"CONCATENATE(\"Heat output * \",ROUND(D8,0),\"/\",ROUND(D9,0),\"/\",ROUND(D10,0),\" [\"&IF(cal!$X$4=1,\"W\",IF(cal!$X$4=2,\"Btu/h\"))&\"]\")","v":"Heat output * 75/65/20 [W]"},{"$f":"\"Water flowrate, heating [\"&IF(cal!$X$4=1,\"l/h\",IF(cal!$X$4=2,\"GPM\"))&\"]\"","v":"Water flowrate, heating [l/h]"},{"$f":"\"Watersided pressure loss [\"&IF(cal!$X$4=1,\"kPa\",IF(cal!$X$4=2,\"inH2O\"))&\"]\"","v":"Watersided pressure loss [kPa]"},{"$f":"CONCATENATE(\"Sens. cooling capacity * \",ROUND(J8,0),\"/\",ROUND(J9,0),\"/\",ROUND(J10,0),\" [\"&IF(cal!$X$4=1,\"W\",IF(cal!$X$4=2,\"Btu/h\"))&\"]\")","v":"Sens. cooling capacity * 16/18/27 [W]"},{"$f":"CONCATENATE(\"Tot. cooling capacity \",ROUND(J8,0),\"/\",ROUND(J9,0),\"/\",ROUND(J10,0),\" [\"&IF(cal!$X$4=1,\"W\",IF(cal!$X$4=2,\"Btu/h\"))&\"]\")","v":"Tot. cooling capacity 16/18/27 [W]"},{"$f":"\"Water flowrate, cooling [\"&IF(cal!$X$4=1,\"l/h\",IF(cal!$X$4=2,\"GPM\"))&\"]\"","v":"Water flowrate, cooling [l/h]"},{"$f":"\"Watersided pressure loss [\"&IF(cal!$X$4=1,\"kPa\",IF(cal!$X$4=2,\"inH2O\"))&\"]\"","v":"Watersided pressure loss [kPa]"},"Sound pressure *** [dB(A)]","Sound power ** [dB(A)]","Electrical power [W]",{"$f":"\"Air flowrate [\"&IF(cal!$X$4=1,\"m³/h\",IF(cal!$X$4=2,\"CFM\"))&\"]\"","v":"Air flowrate [m³/h]"},{"$f":"\"Air exhaust temp. heating [\"&IF(cal!$X$4=1,\"°C\",IF(cal!$X$4=2,\"°F\"))&\"]\"","v":"Air exhaust temp. heating [°C]"},{"$f":"\"Air exhaust temp. cooling [\"&IF(cal!$X$4=1,\"°C\",IF(cal!$X$4=2,\"°F\"))&\"]\"","v":"Air exhaust temp. cooling [°C]"}]
[{"$f":"cal!$AF$1&\" \"&$R$15&\" \"&ROUND(cal!Y22,1)&IF(cal!$X$4=1,\" cm\",IF(cal!$X$4=2,\" in\"))&\" \"&$R$16&\" \"&ROUND(cal!AA22,1)&IF(cal!$X$4=1,\" cm\",IF(cal!$X$4=2,\" in\"))&\" \"&$R$17&\" \"&ROUND(cal!AC22,1)&IF(cal!$X$4=1,\" cm\",IF(cal!$X$4=2,\" in\"))&\" (Type 1)\"","v":"Clima Canal height 13 cm width 32 cm length 70 cm (Type 1)"},{"$nulls":15},"Temp.","height"]
[{"$nulls":16},"heating!","width"]
[{"$nulls":16},"cooling!","length"]
[]
[]
[]
[{"$f":"cal!$AF$1&\" \"&$R$15&\" \"&ROUND(cal!Y28,1)&IF(cal!$X$4=1,\" cm\",IF(cal!$X$4=2,\" in\"))&\" \"&$R$16&\" \"&ROUND(cal!AA28,1)&IF(cal!$X$4=1,\" cm\",IF(cal!$X$4=2,\" in\"))&\" \"&$R$17&\" \"&ROUND(cal!AC28,1)&IF(cal!$X$4=1,\" cm\",IF(cal!$X$4=2,\" in\"))&\" (Type 2)\"","v":"Clima Canal height 13 cm width 32 cm length 100 cm (Type 2)"}]
[]
[]
[]
[]
[]
[{"$f":"cal!$AF$1&\" \"&$R$15&\" \"&ROUND(cal!Y34,1)&IF(cal!$X$4=1,\" cm\",IF(cal!$X$4=2,\" in\"))&\" \"&$R$16&\" \"&ROUND(cal!AA34,1)&IF(cal!$X$4=1,\" cm\",IF(cal!$X$4=2,\" in\"))&\" \"&$R$17&\" \"&ROUND(cal!AC34,1)&IF(cal!$X$4=1,\" cm\",IF(cal!$X$4=2,\" in\"))&\" (Type 3)\"","v":"Clima Canal height 13 cm width 32 cm length 120 cm (Type 3)"}]
[]
[]
[]
[]
[]
[{"$f":"cal!$AF$1&\" \"&$R$15&\" \"&ROUND(cal!Y40,1)&IF(cal!$X$4=1,\" cm\",IF(cal!$X$4=2,\" in\"))&\" \"&$R$16&\" \"&ROUND(cal!AA40,1)&IF(cal!$X$4=1,\" cm\",IF(cal!$X$4=2,\" in\"))&\" \"&$R$17&\" \"&ROUND(cal!AC40,1)&IF(cal!$X$4=1,\" cm\",IF(cal!$X$4=2,\" in\"))&\" (Type 4)\"","v":"Clima Canal height 13 cm width 32 cm length 140 cm (Type 4)"}]
[]
[]
[]
[]
[]
[{"$f":"cal!$AF$1&\" \"&$R$15&\" \"&ROUND(cal!Y46,1)&IF(cal!$X$4=1,\" cm\",IF(cal!$X$4=2,\" in\"))&\" \"&$R$16&\" \"&ROUND(cal!AA46,1)&IF(cal!$X$4=1,\" cm\",IF(cal!$X$4=2,\" in\"))&\" \"&$R$17&\" \"&ROUND(cal!AC46,1)&IF(cal!$X$4=1,\" cm\",IF(cal!$X$4=2,\" in\"))&\" (Type 5)\"","v":"Clima Canal height 13 cm width 32 cm length 170 cm (Type 5)"}]
[]
[]
[]
[]
[]
[{"$f":"cal!$AF$1&\" \"&$R$15&\" \"&ROUND(cal!Y52,1)&IF(cal!$X$4=1,\" cm\",IF(cal!$X$4=2,\" in\"))&\" \"&$R$16&\" \"&ROUND(cal!AA52,1)&IF(cal!$X$4=1,\" cm\",IF(cal!$X$4=2,\" in\"))&\" \"&$R$17&\" \"&ROUND(cal!AC52,1)&IF(cal!$X$4=1,\" cm\",IF(cal!$X$4=2,\" in\"))&\" (Type 6)\"","v":"Clima Canal height 13 cm width 32 cm length 200 cm (Type 6)"}]
[]
[]
[]
[]
[]
[{"$f":"cal!$AF$1&\" \"&$R$15&\" \"&ROUND(cal!Y58,1)&IF(cal!$X$4=1,\" cm\",IF(cal!$X$4=2,\" in\"))&\" \"&$R$16&\" \"&ROUND(cal!AA58,1)&IF(cal!$X$4=1,\" cm\",IF(cal!$X$4=2,\" in\"))&\" \"&$R$17&\" \"&ROUND(cal!AC58,1)&IF(cal!$X$4=1,\" cm\",IF(cal!$X$4=2,\" in\"))&\" (Type 7)\"","v":"Clima Canal height 13 cm width 32 cm length 230 cm (Type 7)"}]
[]
[]
[]
[]
[]
[{"$f":"cal!$AF$1&\" \"&$R$15&\" \"&ROUND(cal!Y64,1)&IF(cal!$X$4=1,\" cm\",IF(cal!$X$4=2,\" in\"))&\" \"&$R$16&\" \"&ROUND(cal!AA64,1)&IF(cal!$X$4=1,\" cm\",IF(cal!$X$4=2,\" in\"))&\" \"&$R$17&\" \"&ROUND(cal!AC64,1)&IF(cal!$X$4=1,\" cm\",IF(cal!$X$4=2,\" in\"))&\" (Type 8)\"","v":"Clima Canal height 13 cm width 32 cm length 280 cm (Type 8)"}]
[]
[]
[]
[]
[]
[{"$f":"cal!$AF$1&\" \"&$R$15&\" \"&ROUND(cal!Y70,1)&IF(cal!$X$4=1,\" cm\",IF(cal!$X$4=2,\" in\"))&\" \"&$R$16&\" \"&ROUND(cal!AA70,1)&IF(cal!$X$4=1,\" cm\",IF(cal!$X$4=2,\" in\"))&\" \"&$R$17&\" \"&ROUND(cal!AC70,1)&IF(cal!$X$4=1,\" cm\",IF(cal!$X$4=2,\" in\"))&\" (Type 9)\"","v":"Clima Canal height 13 cm width 32 cm length 300 cm (Type 9)"}]
[]
[]
[]
[]
[]
["*Values according to EN 16430",{"$nulls":11},{"$f":"cal!N70","v":"v2022-12-13"}]
["**Sound power according to ISO 3741:2010"]
["***Sound pressure with an assumed room damping of 8dB(A)"]