{"text_format":"3","workbook":"xlsx","n_sheets":13,"sheets":["Briza 22 & 26","cal","NL","EN","DE","FR","NR","SP","SW","TS","ExtraTaal1","ExtraTaal2","ExtraTaal3"],"not_rendered":{"charts":2,"images":22,"macros":1,"defined_names":50,"comments":1},"read":"whole","date_system":"1900"}

{"sheet":"Briza 22 & 26","index":0,"n_rows":65,"n_cols":27,"rows_kept":65,"merged":[[1,1,1,4],[1,6,1,9],[1,10,1,12],[1,25,4,25],[1,26,4,26],[2,1,2,4],[2,6,2,9],[2,10,2,11],[3,6,3,9],[3,10,3,11],[3,12,3,14],[3,15,3,16],[7,1,7,3],[7,6,7,9],[7,12,7,13],[7,15,7,16],[7,17,7,18],[8,1,8,3],[8,6,8,9],[8,12,8,13],[8,15,11,16],[8,17,11,18],[9,1,9,3],[9,6,9,9],[9,12,9,13],[10,1,10,3],[10,6,10,9],[10,12,10,13],[11,1,11,3],[11,6,11,9],[15,1,15,12],[15,13,15,20],[21,1,21,12],[21,13,21,20],[29,1,29,12],[29,13,29,20],[37,1,37,12],[37,13,37,20],[45,1,45,12],[45,13,45,20],[53,1,53,12],[53,13,53,20]]}
[]
[null,"Selectiontool",{"$nulls":4},"Taal/Language/Sprache/Språk/Jazyk",0,0,0,"English",{"$nulls":14},"Heating ","Cooling "]
[null,"Briza 22 & Briza 26",{"$nulls":4},{"$f":"cal!G5","v":"Hydronic mix:"},{"$f":"cal!H5","v":"Hydronic mix:"},{"$f":"cal!I5","v":0},{"$f":"cal!J5","v":0},"Fresh water",null,{"v":1,"d":"100%"}]
[{"$nulls":6},{"$f":"cal!G6","v":"Device - Ventilator - Utilization:"},{"$f":"cal!H6","v":"Device - Ventilator - Utilization:"},{"$f":"cal!I6","v":0},{"$f":"cal!J6","v":0},"Briza 22 2-pipe",null,"Standard 230V (EU)",null,null,"Built-in"]
[]
[null,{"$f":"cal!B8","v":"Temperatures"},{"$nulls":23},{"$f":"cal!V9","v":"Temp"},{"$f":"cal!BI9","v":"Temp"}]
[null,{"$f":"cal!B9","v":"Heating:"},{"$nulls":4},{"$f":"cal!G9","v":"Cooling:"},{"$nulls":18},{"$f":"cal!V10","v":65},{"$f":"cal!BI10","v":16}]
[null,{"$f":"cal!B10","v":"Supply water"},{"$f":"cal!C10","v":0},{"$f":"cal!D10","v":0},65,{"$f":"IF(cal!$Z$5=1,\"°C\",IF(cal!$Z$5=2,\"°F\"))","v":"°C"},{"$f":"cal!G10","v":"Supply water"},{"$f":"cal!H10","v":0},{"$f":"cal!I10","v":0},{"$f":"cal!J10","v":0},16,{"$f":"F8","v":"°C"},{"$f":"cal!M8","v":"Static pressure"},{"$f":"cal!N8","v":0},null,{"$f":"cal!P7","v":"Unit conversion"},null,{"$f":"cal!R7","v":"Known variables"},{"$nulls":7},{"$f":"cal!V11","v":55},{"$f":"cal!BI11","v":18}]
[null,{"$f":"cal!B11","v":"Return water"},{"$f":"cal!C11","v":0},{"$f":"cal!D11","v":0},55,{"$f":"F8","v":"°C"},{"$f":"cal!G11","v":"Return water"},{"$f":"cal!H11","v":0},{"$f":"cal!I11","v":0},{"$f":"cal!J11","v":0},18,{"$f":"F8","v":"°C"},{"v":0,"d":"0.000"},null,{"$f":"IF(cal!$Z$5=1,\"Pa\",IF(cal!$Z$5=2,\"inchH2O\"))","v":"Pa"},{"$nulls":10},{"$f":"cal!V12","v":20},{"$f":"cal!BI12","v":27}]
[null,{"$f":"cal!B12","v":"Entering air (dry bulb)"},null,null,20,{"$f":"F8","v":"°C"},{"$f":"cal!G12","v":"Entering air (dry bulb)"},{"$f":"cal!H12","v":0},{"$f":"cal!I12","v":0},{"$f":"cal!J12","v":0},27,{"$f":"F8","v":"°C"},{"$f":"cal!M11","v":"Altitude"},{"$nulls":12},{"$f":"cal!V13","v":{"v":0,"d":"0.0"}},{"$f":"cal!BI13","v":{"v":19.415087041495514,"d":"19.4"}}]
[{"$nulls":6},{"$f":"cal!G13","v":"Entering air (wet bulb)"},{"$f":"cal!H13","v":0},{"$f":"cal!I13","v":0},{"$f":"cal!J13","v":0},{"v":19.415087041495514,"d":"19.4"},{"$f":"F8","v":"°C"},0,null,{"$f":"IF(cal!$Z$5=1,\"m\",IF(cal!$Z$5=2,\"ft\"))","v":"m"},{"$nulls":10},"Patm=",{"$f":"p_atm","v":101325}]
[{"$nulls":6},{"$f":"cal!G14","v":"Relative humidity"},{"$nulls":3},{"v":0.5,"d":"50%"}]
[]
[]
[null,{"$f":"cal!B16","v":"Speed level"},{"$f":"cal!C16","v":"Control voltage [V]"},{"$f":"cal!D16","v":"Heat output * 65/55/20 [W]"},{"$f":"cal!E16","v":"Water flowrate, heating [l/h]"},{"$f":"cal!F16","v":"Water side pressure loss [kPa]"},{"$f":"cal!G16","v":"Sens. cooling capacity * 16/18/27 [W]"},{"$f":"cal!H16","v":"Tot. cooling capacity 16/18/27 [W]"},{"$f":"cal!I16","v":"Water flowrate, cooling [l/h]"},{"$f":"cal!J16","v":"Water side pressure loss [kPa]"},{"$f":"cal!K16","v":"Sound pressure *** [dB(A)]"},{"$f":"cal!L16","v":"Sound power ** [dB(A)]"},{"$f":"cal!M16","v":"Electrical power [W]"},{"$f":"cal!N16","v":"Air flowrate [m³/h]"},{"$f":"cal!O16","v":"Face velocity [m/s]"},{"$f":"cal!P16","v":"Air exhaust temp. heating [°C]"},{"$f":"cal!R16","v":"Air exhaust temp. cooling (dry bulb) [°C]"},{"$f":"cal!S16","v":"Air exhaust temp. cooling (wet bulb) [°C]"},{"$f":"cal!T16","v":"Rel. humid. cooled air [%] ****"},{"$f":"cal!U16","v":"fan rotation frequency [revolutions/minute]"},{"$f":"cal!V16","v":"Specific fan power [J/l]"},null,{"$f":"cal!$B$68","v":"Briza has multiple airflow supply and return air connection options. Visit our website for more information."}]
[null,{"$f":"IF(cal!$BK$17=\"11\",cal!B17,IF(cal!$BK$17=\"21\",cal!B17,IF(cal!$BK$17=\"12\",cal!B17,IF(cal!$BK$17=\"22\",cal!B17,IF(cal!$BK$17=\"13\",cal!B17,IF(cal!$BK$17=\"23\",cal!B17,IF(cal!$BK$17=\"14\",cal!B17,IF(cal!$BK$17=\"24\",cal!B17,IF(cal!$BK$17=\"31\",\"\",IF(cal!$BK$17=\"32\",\"\",IF(cal!$BK$17=\"33\",\"\",IF(cal!$BK$17=\"34\",\"\",IF(cal!$BK$17=\"41\",\"\",IF(cal!$BK$17=\"42\",\"\",IF(cal!$BK$17=\"43\",\"\",IF(cal!$BK$17=\"44\",\"\",))))))))))))))))","v":"Briza 22 (230V) height 54,5 cm, width 22 cm, length 55 cm (Type 02)"}]
[null,{"$f":"cal!B18","v":{"v":0.2,"d":"20%"}},{"$f":"cal!C18","v":2},{"$f":"IF($E$8<=$E$9,cal!$AC$6,cal!D18)","v":{"v":1758.4563964140746,"d":"1758"}},{"$f":"IF($E$8<=$E$9,\"\",cal!E18)","v":151},{"$f":"IF($E$8<=$E$9,\"\",cal!F18)","v":{"v":0.5910093296337543,"d":"0.59"}},{"$f":"IF($K$8>=$K$9,cal!$AC$6,cal!G18)","v":{"v":366.9946962996415,"d":"367"}},{"$f":"IF($K$8>=$K$9,\"\",cal!H18)","v":{"v":366.9946962996415,"d":"367"}},{"$f":"IF($K$8>=$K$9,\"\",cal!I18)","v":158},{"$f":"IF($K$8>=$K$9,\"\",cal!J18)","v":{"v":0.6423283007940608,"d":"0.64"}},{"$f":"cal!K18","v":25.5},{"$f":"cal!L18","v":33.5},{"$f":"cal!M18","v":{"v":3.664947735102877,"d":"3.7"}},{"$f":"cal!N18","v":{"v":133.768339,"d":"134"}},{"$f":"cal!O18","v":{"v":0.3070898507805325,"d":"0.3"}},{"$f":"IF($E$8<=$E$9,\"\",cal!P18)","v":{"v":58.58638182466632,"d":"58.6"}},{"$f":"IF($K$8>=$K$9,\"\",cal!R18)","v":{"v":18.845741281251485,"d":"18.8"}},{"$f":"IF($K$8>=$K$9,\"\",cal!S18)","v":{"v":16.774904168824342,"d":"16.8"}},{"$f":"IF($K$8>=$K$9,\"\",cal!T18)","v":{"v":0.8207400255232986,"d":"82%"}},{"$f":"IF($K$8>=$K$9,\"\",cal!U18)","v":{"v":480.7675172425503,"d":"481"}},{"$f":"IF($K$8>=$K$9,\"\",cal!V18)","v":{"v":0.09863179841360187,"d":"0.10"}}]
[null,{"$f":"cal!B19","v":{"v":0.4,"d":"40%"}},{"$f":"cal!C19","v":4},{"$f":"IF($E$8<=$E$9,cal!$AC$7,cal!D19)","v":{"v":3118.797946178422,"d":"3119"}},{"$f":"IF($E$8<=$E$9,\"\",cal!E19)","v":268},{"$f":"IF($E$8<=$E$9,\"\",cal!F19)","v":{"v":1.6960074461691081,"d":"1.70"}},{"$f":"IF($K$8>=$K$9,cal!$AC$8,cal!G19)","v":{"v":658.639655767295,"d":"659"}},{"$f":"IF($K$8>=$K$9,\"\",cal!H19)","v":{"v":658.639655767295,"d":"659"}},{"$f":"IF($K$8>=$K$9,\"\",cal!I19)","v":283},{"$f":"IF($K$8>=$K$9,\"\",cal!J19)","v":{"v":1.8745119075616177,"d":"1.87"}},{"$f":"cal!K19","v":{"v":35,"d":"35.0"}},{"$f":"cal!L19","v":{"v":43,"d":"43.0"}},{"$f":"cal!M19","v":{"v":8.738482750281012,"d":"8.7"}},{"$f":"cal!N19","v":{"v":254.186551,"d":"254"}},{"$f":"cal!O19","v":{"v":0.5835320270890726,"d":"0.6"}},{"$f":"IF($E$8<=$E$9,\"\",cal!P19)","v":{"v":56.01558383693053,"d":"56.0"}},{"$f":"IF($K$8>=$K$9,\"\",cal!R19)","v":{"v":19.298535103604365,"d":"19.3"}},{"$f":"IF($K$8>=$K$9,\"\",cal!S19)","v":{"v":16.90423224803864,"d":"16.9"}},{"$f":"IF($K$8>=$K$9,\"\",cal!T19)","v":{"v":0.7958003440540874,"d":"80%"}},{"$f":"IF($K$8>=$K$9,\"\",cal!U19)","v":{"v":729.9876975828838,"d":"730"}},{"$f":"IF($K$8>=$K$9,\"\",cal!V19)","v":{"v":0.12376161436256178,"d":"0.12"}}]
[null,{"$f":"cal!B20","v":{"v":0.6,"d":"60%"}},{"$f":"cal!C20","v":6},{"$f":"IF($E$8<=$E$9,\"\",cal!D20)","v":{"v":4070.8243954552063,"d":"4071"}},{"$f":"IF($E$8<=$E$9,\"\",cal!E20)","v":350},{"$f":"IF($E$8<=$E$9,\"\",cal!F20)","v":{"v":2.7698601082163314,"d":"2.77"}},{"$f":"IF($K$8>=$K$9,\"\",cal!G20)","v":{"v":881.6515824013712,"d":"882"}},{"$f":"IF($K$8>=$K$9,\"\",cal!H20)","v":{"v":881.6515824013712,"d":"882"}},{"$f":"IF($K$8>=$K$9,\"\",cal!I20)","v":379},{"$f":"IF($K$8>=$K$9,\"\",cal!J20)","v":{"v":3.2061450575655126,"d":"3.21"}},{"$f":"cal!K20","v":42.5},{"$f":"cal!L20","v":50.5},{"$f":"cal!M20","v":{"v":17.200408392224332,"d":"17.2"}},{"$f":"cal!N20","v":{"v":354.986764,"d":"355"}},{"$f":"cal!O20","v":{"v":0.8149374747474747,"d":"0.8"}},{"$f":"IF($E$8<=$E$9,\"\",cal!P20)","v":{"v":53.66092113510995,"d":"53.7"}},{"$f":"IF($K$8>=$K$9,\"\",cal!R20)","v":{"v":19.618189975634486,"d":"19.6"}},{"$f":"IF($K$8>=$K$9,\"\",cal!S20)","v":{"v":17.01308491519478,"d":"17.0"}},{"$f":"IF($K$8>=$K$9,\"\",cal!T20)","v":{"v":0.7801651180875728,"d":"78%"}},{"$f":"IF($K$8>=$K$9,\"\",cal!U20)","v":{"v":939.961693341587,"d":"940"}},{"$f":"IF($K$8>=$K$9,\"\",cal!V20)","v":{"v":0.17443318030868216,"d":"0.17"}}]
[null,{"$f":"cal!B21","v":{"v":0.8,"d":"80%"}},{"$f":"cal!C21","v":8},{"$f":"IF($E$8<=$E$9,\"\",cal!D21)","v":{"v":4970.630539772042,"d":"4971"}},{"$f":"IF($E$8<=$E$9,\"\",cal!E21)","v":427},{"$f":"IF($E$8<=$E$9,\"\",cal!F21)","v":{"v":3.9915912378970946,"d":"3.99"}},{"$f":"IF($K$8>=$K$9,\"\",cal!G21)","v":{"v":1074.5779201926093,"d":"1075"}},{"$f":"IF($K$8>=$K$9,\"\",cal!H21)","v":{"v":1074.5779201926093,"d":"1075"}},{"$f":"IF($K$8>=$K$9,\"\",cal!I21)","v":462},{"$f":"IF($K$8>=$K$9,\"\",cal!J21)","v":{"v":4.61333802466015,"d":"4.61"}},{"$f":"cal!K21","v":46.5},{"$f":"cal!L21","v":54.5},{"$f":"cal!M21","v":{"v":31.13583115645022,"d":"31.1"}},{"$f":"cal!N21","v":{"v":450.174779,"d":"450"}},{"$f":"cal!O21","v":{"v":1.0334590886134067,"d":"1.0"}},{"$f":"IF($E$8<=$E$9,\"\",cal!P21)","v":{"v":52.41052842868903,"d":"52.4"}},{"$f":"IF($K$8>=$K$9,\"\",cal!R21)","v":{"v":19.905287751520465,"d":"19.9"}},{"$f":"IF($K$8>=$K$9,\"\",cal!S21)","v":{"v":17.110488860674693,"d":"17.1"}},{"$f":"IF($K$8>=$K$9,\"\",cal!T21)","v":{"v":0.7664165487671575,"d":"77%"}},{"$f":"IF($K$8>=$K$9,\"\",cal!U21)","v":{"v":1142.7603685578915,"d":"1143"}},{"$f":"IF($K$8>=$K$9,\"\",cal!V21)","v":{"v":0.2489899421113967,"d":"0.25"}}]
[null,{"$f":"cal!B22","v":{"v":1,"d":"100%"}},{"$f":"cal!C22","v":10},{"$f":"IF($E$8<=$E$9,\"\",cal!D22)","v":{"v":5490.6296081231185,"d":"5491"}},{"$f":"IF($E$8<=$E$9,\"\",cal!E22)","v":472},{"$f":"IF($E$8<=$E$9,\"\",cal!F22)","v":{"v":4.7984866261193035,"d":"4.80"}},{"$f":"IF($K$8>=$K$9,\"\",cal!G22)","v":{"v":1168.9674964689752,"d":"1169"}},{"$f":"IF($K$8>=$K$9,\"\",cal!H22)","v":{"v":1168.9674964689752,"d":"1169"}},{"$f":"IF($K$8>=$K$9,\"\",cal!I22)","v":503},{"$f":"IF($K$8>=$K$9,\"\",cal!J22)","v":{"v":5.393462830825165,"d":"5.39"}},{"$f":"cal!K22","v":{"v":51,"d":"51.0"}},{"$f":"cal!L22","v":{"v":59,"d":"59.0"}},{"$f":"cal!M22","v":{"v":41.09229623443275,"d":"41.1"}},{"$f":"cal!N22","v":{"v":500.134295,"d":"500"}},{"$f":"cal!O22","v":{"v":1.1481503558310375,"d":"1.1"}},{"$f":"IF($E$8<=$E$9,\"\",cal!P22)","v":{"v":52.22487934662713,"d":"52.2"}},{"$f":"IF($K$8>=$K$9,\"\",cal!R22)","v":{"v":20.053055441326705,"d":"20.1"}},{"$f":"IF($K$8>=$K$9,\"\",cal!S22)","v":{"v":17.160489433954407,"d":"17.2"}},{"$f":"IF($K$8>=$K$9,\"\",cal!T22)","v":{"v":0.7594466736510744,"d":"76%"}},{"$f":"IF($K$8>=$K$9,\"\",cal!U22)","v":{"v":1247.4857962866836,"d":"1247"}},{"$f":"IF($K$8>=$K$9,\"\",cal!V22)","v":{"v":0.2957850879711376,"d":"0.30"}}]
[null,{"$f":"IF(cal!$BK$17=\"11\",cal!B23,IF(cal!$BK$17=\"21\",cal!B23,IF(cal!$BK$17=\"12\",cal!B23,IF(cal!$BK$17=\"22\",cal!B23,IF(cal!$BK$17=\"13\",cal!B23,IF(cal!$BK$17=\"23\",cal!B23,IF(cal!$BK$17=\"14\",cal!B23,IF(cal!$BK$17=\"24\",cal!B23,IF(cal!$BK$17=\"31\",\"\",IF(cal!$BK$17=\"32\",\"\",IF(cal!$BK$17=\"33\",\"\",IF(cal!$BK$17=\"34\",\"\",IF(cal!$BK$17=\"41\",\"\",IF(cal!$BK$17=\"42\",\"\",IF(cal!$BK$17=\"43\",\"\",IF(cal!$BK$17=\"44\",\"\",))))))))))))))))","v":"Briza 22 (230V) height 54,5 cm, width 22 cm, length 75 cm (Type 03)"}]
[null,{"$f":"cal!B24","v":{"v":0.2,"d":"20%"}},{"$f":"cal!C24","v":2},{"$f":"IF($E$8<=$E$9,cal!$AC$6,cal!D24)","v":{"v":2414.055412783147,"d":"2414"}},{"$f":"IF($E$8<=$E$9,\"\",cal!E24)","v":208},{"$f":"IF($E$8<=$E$9,\"\",cal!F24)","v":{"v":1.2996392386829112,"d":"1.30"}},{"$f":"IF($K$8>=$K$9,cal!$AC$6,cal!G24)","v":{"v":508.18297018770477,"d":"508"}},{"$f":"IF($K$8>=$K$9,\"\",cal!H24)","v":{"v":508.18297018770477,"d":"508"}},{"$f":"IF($K$8>=$K$9,\"\",cal!I24)","v":218},{"$f":"IF($K$8>=$K$9,\"\",cal!J24)","v":{"v":1.416197316226643,"d":"1.42"}},{"$f":"cal!K24","v":20.5},{"$f":"cal!L24","v":28.5},{"$f":"cal!M24","v":{"v":3.6631675496846254,"d":"3.7"}},{"$f":"cal!N24","v":{"v":178.414262,"d":"178"}},{"$f":"cal!O24","v":{"v":0.30036071043771045,"d":"0.3"}},{"$f":"IF($E$8<=$E$9,\"\",cal!P24)","v":{"v":59.71672730673983,"d":"59.7"}},{"$f":"IF($K$8>=$K$9,\"\",cal!R24)","v":{"v":18.534188923730937,"d":"18.5"}},{"$f":"IF($K$8>=$K$9,\"\",cal!S24)","v":{"v":16.64220680497453,"d":"16.6"}},{"$f":"IF($K$8>=$K$9,\"\",cal!T24)","v":{"v":0.834636453120847,"d":"83%"}},{"$f":"IF($K$8>=$K$9,\"\",cal!U24)","v":{"v":438.3206188255052,"d":"438"}},{"$f":"IF($K$8>=$K$9,\"\",cal!V24)","v":{"v":0.07391451238839107,"d":"0.07"}}]
[null,{"$f":"cal!B25","v":{"v":0.4,"d":"40%"}},{"$f":"cal!C25","v":4},{"$f":"IF($E$8<=$E$9,cal!$AC$7,cal!D25)","v":{"v":4256.248619077803,"d":"4256"}},{"$f":"IF($E$8<=$E$9,\"\",cal!E25)","v":366},{"$f":"IF($E$8<=$E$9,\"\",cal!F25)","v":{"v":3.653543834025186,"d":"3.65"}},{"$f":"IF($K$8>=$K$9,cal!$AC$8,cal!G25)","v":{"v":870.4079031708319,"d":"870"}},{"$f":"IF($K$8>=$K$9,\"\",cal!H25)","v":{"v":870.4079031708319,"d":"870"}},{"$f":"IF($K$8>=$K$9,\"\",cal!I25)","v":374},{"$f":"IF($K$8>=$K$9,\"\",cal!J25)","v":{"v":3.8009349421834946,"d":"3.80"}},{"$f":"cal!K25","v":29.5},{"$f":"cal!L25","v":37.5},{"$f":"cal!M25","v":{"v":8.819535674356523,"d":"8.8"}},{"$f":"cal!N25","v":{"v":326.678518,"d":"327"}},{"$f":"cal!O25","v":{"v":0.549963835016835,"d":"0.5"}},{"$f":"IF($E$8<=$E$9,\"\",cal!P25)","v":{"v":58.243902276633726,"d":"58.2"}},{"$f":"IF($K$8>=$K$9,\"\",cal!R25)","v":{"v":19.080818765833964,"d":"19.1"}},{"$f":"IF($K$8>=$K$9,\"\",cal!S25)","v":{"v":16.829848135327037,"d":"16.8"}},{"$f":"IF($K$8>=$K$9,\"\",cal!T25)","v":{"v":0.8066512902297772,"d":"81%"}},{"$f":"IF($K$8>=$K$9,\"\",cal!U25)","v":{"v":652.459279552639,"d":"652"}},{"$f":"IF($K$8>=$K$9,\"\",cal!V25)","v":{"v":0.09719135687913058,"d":"0.10"}}]
[null,{"$f":"cal!B26","v":{"v":0.5,"d":"50%"}},{"$f":"cal!C26","v":5},{"$f":"IF($E$8<=$E$9,\"\",cal!D26)","v":{"v":-176.58230878697927,"d":"-177"}},{"$f":"IF($E$8<=$E$9,\"\",cal!E26)","v":-15},{"$f":"IF($E$8<=$E$9,\"\",cal!F26)","v":{"$error":"#NUM!"}},{"$f":"IF($K$8>=$K$9,\"\",cal!G26)","v":{"v":5.8527436755953275,"d":"6"}},{"$f":"IF($K$8>=$K$9,\"\",IF($M$4=\"High Perform. 208/230V (US/EU)\",cal!HK26,cal!H26))","v":{"v":5.8527436755953275,"d":"6"}},{"$f":"IF($K$8>=$K$9,\"\",cal!I26)","v":3},{"$f":"IF($K$8>=$K$9,\"\",cal!J26)","v":{"v":5.579193318791106E-4,"d":"0.00"}},{"$f":"cal!K26","v":{"v":0,"d":"0.0"}},{"$f":"cal!L26","v":{"v":0,"d":"0.0"}},{"$f":"cal!M26","v":{"v":0,"d":"0.0"}},{"$f":"cal!N26","v":0},{"$f":"cal!O26","v":{"v":0,"d":"0.0"}},{"$f":"IF($E$8<=$E$9,\"\",cal!P26)","v":{"$error":"#DIV/0!"}},{"$f":"IF($K$8>=$K$9,\"\",cal!R26)","v":{"$error":"#DIV/0!"}},{"$f":"IF($K$8>=$K$9,\"\",cal!S26)","v":{"$error":"#DIV/0!"}},{"$f":"IF($K$8>=$K$9,\"\",cal!T26)","v":{"$error":"#DIV/0!"}},{"$f":"IF($K$8>=$K$9,\"\",cal!U26)","v":0},{"$f":"IF($K$8>=$K$9,\"\",cal!V26)","v":{"$error":"#DIV/0!"}}]
[null,{"$f":"cal!B27","v":{"v":0.6,"d":"60%"}},{"$f":"cal!C27","v":6},{"$f":"IF($E$8<=$E$9,\"\",cal!D27)","v":{"v":5635.100608838506,"d":"5635"}},{"$f":"IF($E$8<=$E$9,\"\",cal!E27)","v":485},{"$f":"IF($E$8<=$E$9,\"\",cal!F27)","v":{"v":6.114208391587188,"d":"6.11"}},{"$f":"IF($K$8>=$K$9,\"\",cal!G27)","v":{"v":1145.886622360002,"d":"1146"}},{"$f":"IF($K$8>=$K$9,\"\",IF($M$4=\"High Perform. 208/230V (US/EU)\",cal!HK27,cal!H27))","v":{"v":1145.886622360002,"d":"1146"}},{"$f":"IF($K$8>=$K$9,\"\",cal!I27)","v":493},{"$f":"IF($K$8>=$K$9,\"\",cal!J27)","v":{"v":6.299937804464194,"d":"6.30"}},{"$f":"cal!K27","v":{"v":39,"d":"39.0"}},{"$f":"cal!L27","v":{"v":47,"d":"47.0"}},{"$f":"cal!M27","v":{"v":17.716229239720533,"d":"17.7"}},{"$f":"cal!N27","v":{"v":456.231213,"d":"456"}},{"$f":"cal!O27","v":{"v":0.7680660151515151,"d":"0.8"}},{"$f":"IF($E$8<=$E$9,\"\",cal!P27)","v":{"v":56.255380575852506,"d":"56.3"}},{"$f":"IF($K$8>=$K$9,\"\",cal!R27)","v":{"v":19.5349161835818,"d":"19.5"}},{"$f":"IF($K$8>=$K$9,\"\",cal!S27)","v":{"v":16.984768565071484,"d":"17.0"}},{"$f":"IF($K$8>=$K$9,\"\",cal!T27)","v":{"v":0.7842047140227679,"d":"78%"}},{"$f":"IF($K$8>=$K$9,\"\",cal!U27)","v":{"v":832.5592387999743,"d":"833"}},{"$f":"IF($K$8>=$K$9,\"\",cal!V27)","v":{"v":0.13979408564269782,"d":"0.14"}}]
[null,{"$f":"cal!B28","v":{"v":0.7,"d":"70%"}},{"$f":"cal!C28","v":7},{"$f":"IF($E$8<=$E$9,\"\",cal!D28)","v":{"v":-176.58230878697927,"d":"-177"}},{"$f":"IF($E$8<=$E$9,\"\",cal!E28)","v":-15},{"$f":"IF($E$8<=$E$9,\"\",cal!F28)","v":{"$error":"#NUM!"}},{"$f":"IF($K$8>=$K$9,\"\",cal!G28)","v":{"v":5.8527436755953275,"d":"6"}},{"$f":"IF($K$8>=$K$9,\"\",IF($M$4=\"High Perform. 208/230V (US/EU)\",cal!HK28,cal!H28))","v":{"v":5.8527436755953275,"d":"6"}},{"$f":"IF($K$8>=$K$9,\"\",cal!I28)","v":3},{"$f":"IF($K$8>=$K$9,\"\",cal!J28)","v":{"v":5.579193318791106E-4,"d":"0.00"}},{"$f":"cal!K28","v":{"v":0,"d":"0.0"}},{"$f":"cal!L28","v":{"v":0,"d":"0.0"}},{"$f":"cal!M28","v":{"v":0,"d":"0.0"}},{"$f":"cal!N28","v":0},{"$f":"cal!O28","v":{"v":0,"d":"0.0"}},{"$f":"IF($E$8<=$E$9,\"\",cal!P28)","v":{"$error":"#DIV/0!"}},{"$f":"IF($K$8>=$K$9,\"\",cal!R28)","v":{"$error":"#DIV/0!"}},{"$f":"IF($K$8>=$K$9,\"\",cal!S28)","v":{"$error":"#DIV/0!"}},{"$f":"IF($K$8>=$K$9,\"\",cal!T28)","v":{"$error":"#DIV/0!"}},{"$f":"IF($K$8>=$K$9,\"\",cal!U28)","v":0},{"$f":"IF($K$8>=$K$9,\"\",cal!V28)","v":{"$error":"#DIV/0!"}}]
[null,{"$f":"cal!B29","v":{"v":0.8,"d":"80%"}},{"$f":"cal!C29","v":8},{"$f":"IF($E$8<=$E$9,\"\",cal!D29)","v":{"v":6744.396958828855,"d":"6744"}},{"$f":"IF($E$8<=$E$9,\"\",cal!E29)","v":580},{"$f":"IF($E$8<=$E$9,\"\",cal!F29)","v":{"v":8.480774212087125,"d":"8.48"}},{"$f":"IF($K$8>=$K$9,\"\",cal!G29)","v":{"v":1371.8997657119116,"d":"1372"}},{"$f":"IF($K$8>=$K$9,\"\",IF($M$4=\"High Perform. 208/230V (US/EU)\",cal!HK29,cal!H29))","v":{"v":1371.8997657119116,"d":"1372"}},{"$f":"IF($K$8>=$K$9,\"\",cal!I29)","v":590},{"$f":"IF($K$8>=$K$9,\"\",cal!J29)","v":{"v":8.750134100325388,"d":"8.75"}},{"$f":"cal!K29","v":{"v":45,"d":"45.0"}},{"$f":"cal!L29","v":{"v":53,"d":"53.0"}},{"$f":"cal!M29","v":{"v":31.879079582988997,"d":"31.9"}},{"$f":"cal!N29","v":{"v":579.161661,"d":"579"}},{"$f":"cal!O29","v":{"v":0.9750196313131312,"d":"1.0"}},{"$f":"IF($E$8<=$E$9,\"\",cal!P29)","v":{"v":54.182128860973364,"d":"54.2"}},{"$f":"IF($K$8>=$K$9,\"\",cal!R29)","v":{"v":19.959546895047005,"d":"20.0"}},{"$f":"IF($K$8>=$K$9,\"\",cal!S29)","v":{"v":17.128859131157803,"d":"17.1"}},{"$f":"IF($K$8>=$K$9,\"\",cal!T29)","v":{"v":0.7638489342617149,"d":"76%"}},{"$f":"IF($K$8>=$K$9,\"\",cal!U29)","v":{"v":1002.7134849674694,"d":"1003"}},{"$f":"IF($K$8>=$K$9,\"\",cal!V29)","v":{"v":0.19815656702932274,"d":"0.20"}}]
[null,{"$f":"cal!B30","v":{"v":1,"d":"100%"}},{"$f":"cal!C30","v":10},{"$f":"IF($E$8<=$E$9,\"\",cal!D30)","v":{"v":7515.139363436289,"d":"7515"}},{"$f":"IF($E$8<=$E$9,\"\",cal!E30)","v":646},{"$f":"IF($E$8<=$E$9,\"\",cal!F30)","v":{"v":10.328690311651778,"d":"10.33"}},{"$f":"IF($K$8>=$K$9,\"\",cal!G30)","v":{"v":1532.7406174704122,"d":"1533"}},{"$f":"IF($K$8>=$K$9,\"\",cal!H30)","v":{"v":1532.7406174704122,"d":"1533"}},{"$f":"IF($K$8>=$K$9,\"\",cal!I30)","v":659},{"$f":"IF($K$8>=$K$9,\"\",cal!J30)","v":{"v":10.712040232877664,"d":"10.71"}},{"$f":"cal!K30","v":{"v":49,"d":"49.0"}},{"$f":"cal!L30","v":{"v":57,"d":"57.0"}},{"$f":"cal!M30","v":{"v":46.36358146180268,"d":"46.4"}},{"$f":"cal!N30","v":{"v":680.796721,"d":"681"}},{"$f":"cal!O30","v":{"v":1.146122425925926,"d":"1.1"}},{"$f":"IF($E$8<=$E$9,\"\",cal!P30)","v":{"v":52.402265147039785,"d":"52.4"}},{"$f":"IF($K$8>=$K$9,\"\",cal!R30)","v":{"v":20.308411222994504,"d":"20.3"}},{"$f":"IF($K$8>=$K$9,\"\",cal!S30)","v":{"v":17.246683477907272,"d":"17.2"}},{"$f":"IF($K$8>=$K$9,\"\",cal!T30)","v":{"v":0.7475696262393953,"d":"75%"}},{"$f":"IF($K$8>=$K$9,\"\",cal!U30)","v":{"v":1119.0768344085554,"d":"1119"}},{"$f":"IF($K$8>=$K$9,\"\",cal!V30)","v":{"v":0.24516700523663312,"d":"0.25"}}]
[null,{"$f":"IF(cal!$BK$17=\"11\",cal!B31,IF(cal!$BK$17=\"21\",cal!B31,IF(cal!$BK$17=\"12\",cal!B31,IF(cal!$BK$17=\"22\",cal!B31,IF(cal!$BK$17=\"13\",cal!B31,IF(cal!$BK$17=\"23\",cal!B31,IF(cal!$BK$17=\"14\",cal!B31,IF(cal!$BK$17=\"24\",cal!B31,IF(cal!$BK$17=\"31\",\"\",IF(cal!$BK$17=\"32\",\"\",IF(cal!$BK$17=\"33\",\"\",IF(cal!$BK$17=\"34\",\"\",IF(cal!$BK$17=\"41\",\"\",IF(cal!$BK$17=\"42\",\"\",IF(cal!$BK$17=\"43\",\"\",IF(cal!$BK$17=\"44\",\"\",))))))))))))))))","v":"Briza 22 (230V) height 54,5 cm, width 22 cm, length 95 cm (Type 04)"}]
[null,{"$f":"cal!B32","v":{"v":0.2,"d":"20%"}},{"$f":"cal!C32","v":2},{"$f":"IF($E$8<=$E$9,cal!$AC$6,cal!D32)","v":{"v":3210.5181232071163,"d":"3211"}},{"$f":"IF($E$8<=$E$9,\"\",cal!E32)","v":276},{"$f":"IF($E$8<=$E$9,\"\",cal!F32)","v":{"v":2.558645147451846,"d":"2.56"}},{"$f":"IF($K$8>=$K$9,cal!$AC$6,cal!G32)","v":{"v":746.8295455661088,"d":"747"}},{"$f":"IF($K$8>=$K$9,\"\",cal!H32)","v":{"v":746.8295455661088,"d":"747"}},{"$f":"IF($K$8>=$K$9,\"\",cal!I32)","v":321},{"$f":"IF($K$8>=$K$9,\"\",cal!J32)","v":{"v":3.3735100324461316,"d":"3.37"}},{"$f":"cal!K32","v":{"v":22,"d":"22.0"}},{"$f":"cal!L32","v":{"v":30,"d":"30.0"}},{"$f":"cal!M32","v":{"v":3.932234097736646,"d":"3.9"}},{"$f":"cal!N32","v":{"v":247.220183,"d":"247"}},{"$f":"cal!O32","v":{"v":0.3285754691653376,"d":"0.3"}},{"$f":"IF($E$8<=$E$9,\"\",cal!P32)","v":{"v":58.11948199690513,"d":"58.1"}},{"$f":"IF($K$8>=$K$9,\"\",cal!R32)","v":{"v":18.0212557681714,"d":"18.0"}},{"$f":"IF($K$8>=$K$9,\"\",cal!S32)","v":{"v":16.46497319463652,"d":"16.5"}},{"$f":"IF($K$8>=$K$9,\"\",cal!T32)","v":{"v":0.8618931013881044,"d":"86%"}},{"$f":"IF($K$8>=$K$9,\"\",cal!U32)","v":{"v":417.3402059477958,"d":"417"}},{"$f":"IF($K$8>=$K$9,\"\",cal!V32)","v":{"v":0.05726086996647813,"d":"0.06"}}]
[null,{"$f":"cal!B33","v":{"v":0.4,"d":"40%"}},{"$f":"cal!C33","v":4},{"$f":"IF($E$8<=$E$9,cal!$AC$7,cal!D33)","v":{"v":5519.575227392482,"d":"5520"}},{"$f":"IF($E$8<=$E$9,\"\",cal!E33)","v":475},{"$f":"IF($E$8<=$E$9,\"\",cal!F33)","v":{"v":6.9120753049022925,"d":"6.91"}},{"$f":"IF($K$8>=$K$9,cal!$AC$8,cal!G33)","v":{"v":1265.5751323529887,"d":"1266"}},{"$f":"IF($K$8>=$K$9,\"\",cal!H33)","v":{"v":1265.5751323529887,"d":"1266"}},{"$f":"IF($K$8>=$K$9,\"\",cal!I33)","v":544},{"$f":"IF($K$8>=$K$9,\"\",cal!J33)","v":{"v":8.859991423883756,"d":"8.86"}},{"$f":"cal!K33","v":29.5},{"$f":"cal!L33","v":37.5},{"$f":"cal!M33","v":{"v":9.858097036075701,"d":"9.9"}},{"$f":"cal!N33","v":{"v":412.802491,"d":"413"}},{"$f":"cal!O33","v":{"v":0.5486476488569909,"d":"0.5"}},{"$f":"IF($E$8<=$E$9,\"\",cal!P33)","v":{"v":59.24814502651321,"d":"59.2"}},{"$f":"IF($K$8>=$K$9,\"\",cal!R33)","v":{"v":17.88779133166592,"d":"17.9"}},{"$f":"IF($K$8>=$K$9,\"\",cal!S33)","v":{"v":16.41867142382871,"d":"16.4"}},{"$f":"IF($K$8>=$K$9,\"\",cal!T33)","v":{"v":0.8691483965212843,"d":"87%"}},{"$f":"IF($K$8>=$K$9,\"\",cal!U33)","v":{"v":624.1658420142392,"d":"624"}},{"$f":"IF($K$8>=$K$9,\"\",cal!V33)","v":{"v":0.08597125769251361,"d":"0.09"}}]
[null,{"$f":"cal!B34","v":{"v":0.5,"d":"50%"}},{"$f":"cal!C34","v":5},{"$f":"IF($E$8<=$E$9,\"\",cal!D34)","v":{"v":-828.8478907144921,"d":"-829"}},{"$f":"IF($E$8<=$E$9,\"\",cal!E34)","v":-71},{"$f":"IF($E$8<=$E$9,\"\",cal!F34)","v":{"$error":"#NUM!"}},{"$f":"IF($K$8>=$K$9,\"\",cal!G34)","v":{"v":-168.87699058900006,"d":"-169"}},{"$f":"IF($K$8>=$K$9,\"\",IF($M$4=\"High Perform. 208/230V (US/EU)\",cal!HK34,cal!H34))","v":{"v":-168.87699058900006,"d":"-169"}},{"$f":"IF($K$8>=$K$9,\"\",cal!I34)","v":-73},{"$f":"IF($K$8>=$K$9,\"\",cal!J34)","v":{"$error":"#NUM!"}},{"$f":"cal!K34","v":{"v":0,"d":"0.0"}},{"$f":"cal!L34","v":{"v":0,"d":"0.0"}},{"$f":"cal!M34","v":{"v":0,"d":"0.0"}},{"$f":"cal!N34","v":0},{"$f":"cal!O34","v":{"v":0,"d":"0.0"}},{"$f":"IF($E$8<=$E$9,\"\",cal!P34)","v":{"$error":"#DIV/0!"}},{"$f":"IF($K$8>=$K$9,\"\",cal!R34)","v":{"$error":"#DIV/0!"}},{"$f":"IF($K$8>=$K$9,\"\",cal!S34)","v":{"$error":"#DIV/0!"}},{"$f":"IF($K$8>=$K$9,\"\",cal!T34)","v":{"$error":"#DIV/0!"}},{"$f":"IF($K$8>=$K$9,\"\",cal!U34)","v":0},{"$f":"IF($K$8>=$K$9,\"\",cal!V34)","v":{"$error":"#DIV/0!"}}]
[null,{"$f":"cal!B35","v":{"v":0.6,"d":"60%"}},{"$f":"cal!C35","v":6},{"$f":"IF($E$8<=$E$9,\"\",cal!D35)","v":{"v":7359.702109205712,"d":"7360"}},{"$f":"IF($E$8<=$E$9,\"\",cal!E35)","v":633},{"$f":"IF($E$8<=$E$9,\"\",cal!F35)","v":{"v":11.691966501114814,"d":"11.69"}},{"$f":"IF($K$8>=$K$9,\"\",cal!G35)","v":{"v":1675.0755144910545,"d":"1675"}},{"$f":"IF($K$8>=$K$9,\"\",IF($M$4=\"High Perform. 208/230V (US/EU)\",cal!HK35,cal!H35))","v":{"v":1675.0755144910545,"d":"1675"}},{"$f":"IF($K$8>=$K$9,\"\",cal!I35)","v":720},{"$f":"IF($K$8>=$K$9,\"\",cal!J35)","v":{"v":14.800077115227213,"d":"14.80"}},{"$f":"cal!K35","v":{"v":37,"d":"37.0"}},{"$f":"cal!L35","v":{"v":45,"d":"45.0"}},{"$f":"cal!M35","v":{"v":20.589359735431245,"d":"20.6"}},{"$f":"cal!N35","v":{"v":564.841279,"d":"565"}},{"$f":"cal!O35","v":{"v":0.7507194032429558,"d":"0.8"}},{"$f":"IF($E$8<=$E$9,\"\",cal!P35)","v":{"v":58.24631491319571,"d":"58.2"}},{"$f":"IF($K$8>=$K$9,\"\",cal!R35)","v":{"v":18.185737185141427,"d":"18.2"}},{"$f":"IF($K$8>=$K$9,\"\",cal!S35)","v":{"v":16.5219295645473,"d":"16.5"}},{"$f":"IF($K$8>=$K$9,\"\",cal!T35)","v":{"v":0.8530452035008976,"d":"85%"}},{"$f":"IF($K$8>=$K$9,\"\",cal!U35)","v":{"v":797.6976805119784,"d":"798"}},{"$f":"IF($K$8>=$K$9,\"\",cal!V35)","v":{"v":0.13122570499588518,"d":"0.13"}}]
[null,{"$f":"cal!B36","v":{"v":0.7,"d":"70%"}},{"$f":"cal!C36","v":7},{"$f":"IF($E$8<=$E$9,\"\",cal!D36)","v":{"v":-828.8478907144921,"d":"-829"}},{"$f":"IF($E$8<=$E$9,\"\",cal!E36)","v":-71},{"$f":"IF($E$8<=$E$9,\"\",cal!F36)","v":{"$error":"#NUM!"}},{"$f":"IF($K$8>=$K$9,\"\",cal!G36)","v":{"v":-168.87699058900006,"d":"-169"}},{"$f":"IF($K$8>=$K$9,\"\",IF($M$4=\"High Perform. 208/230V (US/EU)\",cal!HK36,cal!H36))","v":{"v":-168.87699058900006,"d":"-169"}},{"$f":"IF($K$8>=$K$9,\"\",cal!I36)","v":-73},{"$f":"IF($K$8>=$K$9,\"\",cal!J36)","v":{"$error":"#NUM!"}},{"$f":"cal!K36","v":{"v":0,"d":"0.0"}},{"$f":"cal!L36","v":{"v":0,"d":"0.0"}},{"$f":"cal!M36","v":{"v":0,"d":"0.0"}},{"$f":"cal!N36","v":0},{"$f":"cal!O36","v":{"v":0,"d":"0.0"}},{"$f":"IF($E$8<=$E$9,\"\",cal!P36)","v":{"$error":"#DIV/0!"}},{"$f":"IF($K$8>=$K$9,\"\",cal!R36)","v":{"$error":"#DIV/0!"}},{"$f":"IF($K$8>=$K$9,\"\",cal!S36)","v":{"$error":"#DIV/0!"}},{"$f":"IF($K$8>=$K$9,\"\",cal!T36)","v":{"$error":"#DIV/0!"}},{"$f":"IF($K$8>=$K$9,\"\",cal!U36)","v":0},{"$f":"IF($K$8>=$K$9,\"\",cal!V36)","v":{"$error":"#DIV/0!"}}]
[null,{"$f":"cal!B37","v":{"v":0.8,"d":"80%"}},{"$f":"cal!C37","v":8},{"$f":"IF($E$8<=$E$9,\"\",cal!D37)","v":{"v":8836.624378289422,"d":"8837"}},{"$f":"IF($E$8<=$E$9,\"\",cal!E37)","v":760},{"$f":"IF($E$8<=$E$9,\"\",cal!F37)","v":{"v":16.339757574578403,"d":"16.34"}},{"$f":"IF($K$8>=$K$9,\"\",cal!G37)","v":{"v":1999.864655238314,"d":"2000"}},{"$f":"IF($K$8>=$K$9,\"\",IF($M$4=\"High Perform. 208/230V (US/EU)\",cal!HK37,cal!H37))","v":{"v":1999.864655238314,"d":"2000"}},{"$f":"IF($K$8>=$K$9,\"\",cal!I37)","v":860},{"$f":"IF($K$8>=$K$9,\"\",cal!J37)","v":{"v":20.48870760994988,"d":"20.49"}},{"$f":"cal!K37","v":42.5},{"$f":"cal!L37","v":50.5},{"$f":"cal!M37","v":{"v":35.896108086935484,"d":"35.9"}},{"$f":"cal!N37","v":{"v":706.88795,"d":"707"}},{"$f":"cal!O37","v":{"v":0.9395108320042531,"d":"0.9"}},{"$f":"IF($E$8<=$E$9,\"\",cal!P37)","v":{"v":56.69370831153303,"d":"56.7"}},{"$f":"IF($K$8>=$K$9,\"\",cal!R37)","v":{"v":18.591315464905676,"d":"18.6"}},{"$f":"IF($K$8>=$K$9,\"\",cal!S37)","v":{"v":16.661875971188984,"d":"16.7"}},{"$f":"IF($K$8>=$K$9,\"\",cal!T37)","v":{"v":0.8316612910307803,"d":"83%"}},{"$f":"IF($K$8>=$K$9,\"\",cal!U37)","v":{"v":947.4805482130106,"d":"947"}},{"$f":"IF($K$8>=$K$9,\"\",cal!V37)","v":{"v":0.18280972127614814,"d":"0.18"}}]
[null,{"$f":"cal!B38","v":{"v":1,"d":"100%"}},{"$f":"cal!C38","v":10},{"$f":"IF($E$8<=$E$9,\"\",cal!D38)","v":{"v":9757.896337639077,"d":"9758"}},{"$f":"IF($E$8<=$E$9,\"\",cal!E38)","v":839},{"$f":"IF($E$8<=$E$9,\"\",cal!F38)","v":{"v":19.582207794636734,"d":"19.58"}},{"$f":"IF($K$8>=$K$9,\"\",cal!G38)","v":{"v":2199.744151575901,"d":"2200"}},{"$f":"IF($K$8>=$K$9,\"\",cal!H38)","v":{"v":2199.744151575901,"d":"2200"}},{"$f":"IF($K$8>=$K$9,\"\",cal!I38)","v":946},{"$f":"IF($K$8>=$K$9,\"\",cal!J38)","v":{"v":24.39399701732463,"d":"24.39"}},{"$f":"cal!K38","v":46.5},{"$f":"cal!L38","v":54.5},{"$f":"cal!M38","v":{"v":51.22249248842971,"d":"51.2"}},{"$f":"cal!N38","v":{"v":809.495999,"d":"809"}},{"$f":"cal!O38","v":{"v":1.0758851661350346,"d":"1.1"}},{"$f":"IF($E$8<=$E$9,\"\",cal!P38)","v":{"v":55.38321421226928,"d":"55.4"}},{"$f":"IF($K$8>=$K$9,\"\",cal!R38)","v":{"v":18.923271239401487,"d":"18.9"}},{"$f":"IF($K$8>=$K$9,\"\",cal!S38)","v":{"v":16.775896668998776,"d":"16.8"}},{"$f":"IF($K$8>=$K$9,\"\",cal!T38)","v":{"v":0.8146072630477551,"d":"81%"}},{"$f":"IF($K$8>=$K$9,\"\",cal!U38)","v":{"v":1048.5357220807407,"d":"1049"}},{"$f":"IF($K$8>=$K$9,\"\",cal!V38)","v":{"v":0.227797262971212,"d":"0.23"}}]
[null,{"$f":"cal!B39","v":"Briza 22 (230V) height 54,5 cm, width 22 cm, length 125 cm (Type 06)"}]
[null,{"$f":"cal!B40","v":{"v":0.2,"d":"20%"}},{"$f":"cal!C40","v":2},{"$f":"IF($E$8<=$E$9,cal!$AC$6,cal!D40)","v":{"v":4291.017691579899,"d":"4291"}},{"$f":"IF($E$8<=$E$9,\"\",cal!E40)","v":369},{"$f":"IF($E$8<=$E$9,\"\",cal!F40)","v":{"v":1.5453521305701372,"d":"1.55"}},{"$f":"IF($K$8>=$K$9,cal!$AC$6,cal!G40)","v":{"v":787.4651303097044,"d":"787"}},{"$f":"IF($K$8>=$K$9,\"\",cal!H40)","v":{"v":787.4651303097044,"d":"787"}},{"$f":"IF($K$8>=$K$9,\"\",cal!I40)","v":339},{"$f":"IF($K$8>=$K$9,\"\",cal!J40)","v":{"v":1.321057401378075,"d":"1.32"}},{"$f":"cal!K40","v":{"v":28,"d":"28.0"}},{"$f":"cal!L40","v":{"v":36,"d":"36.0"}},{"$f":"cal!M40","v":{"v":7.244521390926631,"d":"7.2"}},{"$f":"cal!N40","v":{"v":333.863698,"d":"334"}},{"$f":"cal!O40","v":{"v":0.3372360585858586,"d":"0.3"}},{"$f":"IF($E$8<=$E$9,\"\",cal!P40)","v":{"v":57.72653279232437,"d":"57.7"}},{"$f":"IF($K$8>=$K$9,\"\",cal!R40)","v":{"v":19.98964250377915,"d":"20.0"}},{"$f":"IF($K$8>=$K$9,\"\",cal!S40)","v":{"v":17.13904323255153,"d":"17.1"}},{"$f":"IF($K$8>=$K$9,\"\",cal!T40)","v":{"v":0.762428945397192,"d":"76%"}},{"$f":"IF($K$8>=$K$9,\"\",cal!U40)","v":{"v":433.21562454042123,"d":"433"}},{"$f":"IF($K$8>=$K$9,\"\",cal!V40)","v":{"v":0.07811654026349361,"d":"0.08"}}]
[null,{"$f":"cal!B41","v":{"v":0.4,"d":"40%"}},{"$f":"cal!C41","v":4},{"$f":"IF($E$8<=$E$9,cal!$AC$7,cal!D41)","v":{"v":7376.496484577707,"d":"7376"}},{"$f":"IF($E$8<=$E$9,\"\",cal!E41)","v":634},{"$f":"IF($E$8<=$E$9,\"\",cal!F41)","v":{"v":4.204780840849393,"d":"4.20"}},{"$f":"IF($K$8>=$K$9,cal!$AC$8,cal!G41)","v":{"v":1367.09150506205,"d":"1367"}},{"$f":"IF($K$8>=$K$9,\"\",cal!H41)","v":{"v":1367.09150506205,"d":"1367"}},{"$f":"IF($K$8>=$K$9,\"\",cal!I41)","v":588},{"$f":"IF($K$8>=$K$9,\"\",cal!J41)","v":{"v":3.658029693502845,"d":"3.66"}},{"$f":"cal!K41","v":{"v":36,"d":"36.0"}},{"$f":"cal!L41","v":{"v":44,"d":"44.0"}},{"$f":"cal!M41","v":{"v":17.456415028346257,"d":"17.5"}},{"$f":"cal!N41","v":{"v":614.416243,"d":"614"}},{"$f":"cal!O41","v":{"v":0.6206224676767677,"d":"0.6"}},{"$f":"IF($E$8<=$E$9,\"\",cal!P41)","v":{"v":55.24059557860466,"d":"55.2"}},{"$f":"IF($K$8>=$K$9,\"\",cal!R41)","v":{"v":20.386780625775728,"d":"20.4"}},{"$f":"IF($K$8>=$K$9,\"\",cal!S41)","v":{"v":17.273083165092565,"d":"17.3"}},{"$f":"IF($K$8>=$K$9,\"\",cal!T41)","v":{"v":0.7439665671235521,"d":"74%"}},{"$f":"IF($K$8>=$K$9,\"\",cal!U41)","v":{"v":645.616528470606,"d":"646"}},{"$f":"IF($K$8>=$K$9,\"\",cal!V41)","v":{"v":0.1022809777866607,"d":"0.10"}}]
[null,{"$f":"cal!B42","v":{"v":0.5,"d":"50%"}},{"$f":"cal!C42","v":5},{"$f":"IF($E$8<=$E$9,\"\",cal!D42)","v":{"v":150.1817637989142,"d":"150"}},{"$f":"IF($E$8<=$E$9,\"\",cal!E42)","v":13},{"$f":"IF($E$8<=$E$9,\"\",cal!F42)","v":{"v":0.003175074008007952,"d":"0.00"}},{"$f":"IF($K$8>=$K$9,\"\",cal!G42)","v":{"v":60.77215315250204,"d":"61"}},{"$f":"IF($K$8>=$K$9,\"\",IF($M$4=\"High Perform. 208/230V (US/EU)\",cal!HK42,cal!H42))","v":{"v":60.77215315250204,"d":"61"}},{"$f":"IF($K$8>=$K$9,\"\",cal!I42)","v":26},{"$f":"IF($K$8>=$K$9,\"\",cal!J42)","v":{"v":0.01144107112666796,"d":"0.01"}},{"$f":"cal!K42","v":{"v":0,"d":"0.0"}},{"$f":"cal!L42","v":{"v":0,"d":"0.0"}},{"$f":"cal!M42","v":{"v":0,"d":"0.0"}},{"$f":"cal!N42","v":0},{"$f":"cal!O42","v":{"v":0,"d":"0.0"}},{"$f":"IF($E$8<=$E$9,\"\",cal!P42)","v":{"$error":"#DIV/0!"}},{"$f":"IF($K$8>=$K$9,\"\",cal!R42)","v":{"$error":"#DIV/0!"}},{"$f":"IF($K$8>=$K$9,\"\",cal!S42)","v":{"$error":"#DIV/0!"}},{"$f":"IF($K$8>=$K$9,\"\",cal!T42)","v":{"$error":"#DIV/0!"}},{"$f":"IF($K$8>=$K$9,\"\",cal!U42)","v":0},{"$f":"IF($K$8>=$K$9,\"\",cal!V42)","v":{"$error":"#DIV/0!"}}]
[null,{"$f":"cal!B43","v":{"v":0.6,"d":"60%"}},{"$f":"cal!C43","v":6},{"$f":"IF($E$8<=$E$9,\"\",cal!D43)","v":{"v":9594.988586267133,"d":"9595"}},{"$f":"IF($E$8<=$E$9,\"\",cal!E43)","v":825},{"$f":"IF($E$8<=$E$9,\"\",cal!F43)","v":{"v":6.8429733559153245,"d":"6.84"}},{"$f":"IF($K$8>=$K$9,\"\",cal!G43)","v":{"v":1812.3138199647178,"d":"1812"}},{"$f":"IF($K$8>=$K$9,\"\",IF($M$4=\"High Perform. 208/230V (US/EU)\",cal!HK43,cal!H43))","v":{"v":1812.3138199647178,"d":"1812"}},{"$f":"IF($K$8>=$K$9,\"\",cal!I43)","v":779},{"$f":"IF($K$8>=$K$9,\"\",cal!J43)","v":{"v":6.154110464529949,"d":"6.15"}},{"$f":"cal!K43","v":{"v":43,"d":"43.0"}},{"$f":"cal!L43","v":{"v":51,"d":"51.0"}},{"$f":"cal!M43","v":{"v":35.66096241004066,"d":"35.7"}},{"$f":"cal!N43","v":{"v":839.852548,"d":"840"}},{"$f":"cal!O43","v":{"v":0.8483359070707069,"d":"0.8"}},{"$f":"IF($E$8<=$E$9,\"\",cal!P43)","v":{"v":53.53491473549,"d":"53.5"}},{"$f":"IF($K$8>=$K$9,\"\",cal!R43)","v":{"v":20.586303703876375,"d":"20.6"}},{"$f":"IF($K$8>=$K$9,\"\",cal!S43)","v":{"v":17.340181998411264,"d":"17.3"}},{"$f":"IF($K$8>=$K$9,\"\",cal!T43)","v":{"v":0.7348813445576046,"d":"73%"}},{"$f":"IF($K$8>=$K$9,\"\",cal!U43)","v":{"v":827.9295578750758,"d":"828"}},{"$f":"IF($K$8>=$K$9,\"\",cal!V43)","v":{"v":0.15285952871354078,"d":"0.15"}}]
[null,{"$f":"cal!B44","v":{"v":0.7,"d":"70%"}},{"$f":"cal!C44","v":7},{"$f":"IF($E$8<=$E$9,\"\",cal!D44)","v":{"v":150.1817637989142,"d":"150"}},{"$f":"IF($E$8<=$E$9,\"\",cal!E44)","v":13},{"$f":"IF($E$8<=$E$9,\"\",cal!F44)","v":{"v":0.003175074008007952,"d":"0.00"}},{"$f":"IF($K$8>=$K$9,\"\",cal!G44)","v":{"v":60.77215315250204,"d":"61"}},{"$f":"IF($K$8>=$K$9,\"\",IF($M$4=\"High Perform. 208/230V (US/EU)\",cal!HK44,cal!H44))","v":{"v":60.77215315250204,"d":"61"}},{"$f":"IF($K$8>=$K$9,\"\",cal!I44)","v":26},{"$f":"IF($K$8>=$K$9,\"\",cal!J44)","v":{"v":0.01144107112666796,"d":"0.01"}},{"$f":"cal!K44","v":{"v":0,"d":"0.0"}},{"$f":"cal!L44","v":{"v":0,"d":"0.0"}},{"$f":"cal!M44","v":{"v":0,"d":"0.0"}},{"$f":"cal!N44","v":0},{"$f":"cal!O44","v":{"v":0,"d":"0.0"}},{"$f":"IF($E$8<=$E$9,\"\",cal!P44)","v":{"$error":"#DIV/0!"}},{"$f":"IF($K$8>=$K$9,\"\",cal!R44)","v":{"$error":"#DIV/0!"}},{"$f":"IF($K$8>=$K$9,\"\",cal!S44)","v":{"$error":"#DIV/0!"}},{"$f":"IF($K$8>=$K$9,\"\",cal!T44)","v":{"$error":"#DIV/0!"}},{"$f":"IF($K$8>=$K$9,\"\",cal!U44)","v":0},{"$f":"IF($K$8>=$K$9,\"\",cal!V44)","v":{"$error":"#DIV/0!"}}]
[null,{"$f":"cal!B45","v":{"v":0.8,"d":"80%"}},{"$f":"cal!C45","v":8},{"$f":"IF($E$8<=$E$9,\"\",cal!D45)","v":{"v":11633.709333979707,"d":"11634"}},{"$f":"IF($E$8<=$E$9,\"\",cal!E45)","v":1000},{"$f":"IF($E$8<=$E$9,\"\",cal!F45)","v":{"v":9.766783812364137,"d":"9.77"}},{"$f":"IF($K$8>=$K$9,\"\",cal!G45)","v":{"v":2251.0150320970106,"d":"2251"}},{"$f":"IF($K$8>=$K$9,\"\",IF($M$4=\"High Perform. 208/230V (US/EU)\",cal!HK45,cal!H45))","v":{"v":2251.0150320970106,"d":"2251"}},{"$f":"IF($K$8>=$K$9,\"\",cal!I45)","v":968},{"$f":"IF($K$8>=$K$9,\"\",cal!J45)","v":{"v":9.196657767510153,"d":"9.20"}},{"$f":"cal!K45","v":{"v":49,"d":"49.0"}},{"$f":"cal!L45","v":{"v":57,"d":"57.0"}},{"$f":"cal!M45","v":{"v":62.847337908541164,"d":"62.8"}},{"$f":"cal!N45","v":{"v":1071.6468,"d":"1072"}},{"$f":"cal!O45","v":{"v":1.0824715151515152,"d":"1.1"}},{"$f":"IF($E$8<=$E$9,\"\",cal!P45)","v":{"v":51.86561652728416,"d":"51.9"}},{"$f":"IF($K$8>=$K$9,\"\",cal!R45)","v":{"v":20.756835807330418,"d":"20.8"}},{"$f":"IF($K$8>=$K$9,\"\",cal!S45)","v":{"v":17.397403195646138,"d":"17.4"}},{"$f":"IF($K$8>=$K$9,\"\",cal!T45)","v":{"v":0.7272151413719579,"d":"73%"}},{"$f":"IF($K$8>=$K$9,\"\",cal!U45)","v":{"v":989.6661210384195,"d":"990"}},{"$f":"IF($K$8>=$K$9,\"\",cal!V45)","v":{"v":0.2111240536254559,"d":"0.21"}}]
[null,{"$f":"cal!B46","v":{"v":1,"d":"100%"}},{"$f":"cal!C46","v":10},{"$f":"IF($E$8<=$E$9,\"\",cal!D46)","v":{"v":12855.596219027644,"d":"12856"}},{"$f":"IF($E$8<=$E$9,\"\",cal!E46)","v":1105},{"$f":"IF($E$8<=$E$9,\"\",cal!F46)","v":{"v":11.747461684507567,"d":"11.75"}},{"$f":"IF($K$8>=$K$9,\"\",cal!G46)","v":{"v":2532.557050177167,"d":"2533"}},{"$f":"IF($K$8>=$K$9,\"\",cal!H46)","v":{"v":2532.557050177167,"d":"2533"}},{"$f":"IF($K$8>=$K$9,\"\",cal!I46)","v":1089},{"$f":"IF($K$8>=$K$9,\"\",cal!J46)","v":{"v":11.434823207772123,"d":"11.43"}},{"$f":"cal!K46","v":52.5},{"$f":"cal!L46","v":60.5},{"$f":"cal!M46","v":{"v":88.46964652577635,"d":"88.5"}},{"$f":"cal!N46","v":{"v":1226.07638,"d":"1226"}},{"$f":"cal!O46","v":{"v":1.2384609898989898,"d":"1.2"}},{"$f":"IF($E$8<=$E$9,\"\",cal!P46)","v":{"v":50.77729770401351,"d":"50.8"}},{"$f":"IF($K$8>=$K$9,\"\",cal!R46)","v":{"v":20.8606874382416,"d":"20.9"}},{"$f":"IF($K$8>=$K$9,\"\",cal!S46)","v":{"v":17.432192477371743,"d":"17.4"}},{"$f":"IF($K$8>=$K$9,\"\",cal!T46)","v":{"v":0.7225906636735239,"d":"72%"}},{"$f":"IF($K$8>=$K$9,\"\",cal!U46)","v":{"v":1089.5664374920361,"d":"1090"}},{"$f":"IF($K$8>=$K$9,\"\",cal!V46)","v":{"v":0.2597641816513869,"d":"0.26"}}]
[null,{"$f":"cal!B47","v":"Briza 22 (230V) height 54,5 cm, width 22 cm, length 155 cm (Type 08)"}]
[null,{"$f":"cal!B48","v":{"v":0.2,"d":"20%"}},{"$f":"cal!C48","v":2},{"$f":"IF($E$8<=$E$9,cal!$AC$6,cal!D48)","v":{"v":4329.266319278102,"d":"4329"}},{"$f":"IF($E$8<=$E$9,\"\",cal!E48)","v":372},{"$f":"IF($E$8<=$E$9,\"\",cal!F48)","v":{"v":1.2702460699469025,"d":"1.27"}},{"$f":"IF($K$8>=$K$9,cal!$AC$6,cal!G48)","v":{"v":851.0865493923309,"d":"851"}},{"$f":"IF($K$8>=$K$9,\"\",cal!H48)","v":{"v":851.0865493923309,"d":"851"}},{"$f":"IF($K$8>=$K$9,\"\",cal!I48)","v":366},{"$f":"IF($K$8>=$K$9,\"\",cal!J48)","v":{"v":1.2249426971189705,"d":"1.22"}},{"$f":"cal!K48","v":{"v":25,"d":"25.0"}},{"$f":"cal!L48","v":{"v":33,"d":"33.0"}},{"$f":"cal!M48","v":{"v":7.249867816056731,"d":"7.2"}},{"$f":"cal!N48","v":{"v":392.201869,"d":"392"}},{"$f":"cal!O48","v":{"v":0.31948669680677744,"d":"0.3"}},{"$f":"IF($E$8<=$E$9,\"\",cal!P48)","v":{"v":52.40115053884146,"d":"52.4"}},{"$f":"IF($K$8>=$K$9,\"\",cal!R48)","v":{"v":20.55026158425467,"d":"20.6"}},{"$f":"IF($K$8>=$K$9,\"\",cal!S48)","v":{"v":17.328073153165487,"d":"17.3"}},{"$f":"IF($K$8>=$K$9,\"\",cal!T48)","v":{"v":0.7365132262538178,"d":"74%"}},{"$f":"IF($K$8>=$K$9,\"\",cal!U48)","v":{"v":430.8612716089725,"d":"431"}},{"$f":"IF($K$8>=$K$9,\"\",cal!V48)","v":{"v":0.06654614931935532,"d":"0.07"}}]
[null,{"$f":"cal!B49","v":{"v":0.4,"d":"40%"}},{"$f":"cal!C49","v":4},{"$f":"IF($E$8<=$E$9,cal!$AC$7,cal!D49)","v":{"v":7707.378506952319,"d":"7707"}},{"$f":"IF($E$8<=$E$9,\"\",cal!E49)","v":663},{"$f":"IF($E$8<=$E$9,\"\",cal!F49)","v":{"v":4.617539207566194,"d":"4.62"}},{"$f":"IF($K$8>=$K$9,cal!$AC$8,cal!G49)","v":{"v":1532.5657350229121,"d":"1533"}},{"$f":"IF($K$8>=$K$9,\"\",cal!H49)","v":{"v":1532.5657350229121,"d":"1533"}},{"$f":"IF($K$8>=$K$9,\"\",cal!I49)","v":659},{"$f":"IF($K$8>=$K$9,\"\",cal!J49)","v":{"v":4.555550966362862,"d":"4.56"}},{"$f":"cal!K49","v":{"v":34,"d":"34.0"}},{"$f":"cal!L49","v":{"v":42,"d":"42.0"}},{"$f":"cal!M49","v":{"v":17.835695984517578,"d":"17.8"}},{"$f":"cal!N49","v":{"v":706.450383,"d":"706"}},{"$f":"cal!O49","v":{"v":0.5754727785923753,"d":"0.6"}},{"$f":"IF($E$8<=$E$9,\"\",cal!P49)","v":{"v":52.02438592548739,"d":"52.0"}},{"$f":"IF($K$8>=$K$9,\"\",cal!R49)","v":{"v":20.552141775749657,"d":"20.6"}},{"$f":"IF($K$8>=$K$9,\"\",cal!S49)","v":{"v":17.328704959738953,"d":"17.3"}},{"$f":"IF($K$8>=$K$9,\"\",cal!T49)","v":{"v":0.7364279958940718,"d":"74%"}},{"$f":"IF($K$8>=$K$9,\"\",cal!U49)","v":{"v":641.5232398664856,"d":"642"}},{"$f":"IF($K$8>=$K$9,\"\",cal!V49)","v":{"v":0.09088891037413917,"d":"0.09"}}]
[null,{"$f":"cal!B50","v":{"v":0.5,"d":"50%"}},{"$f":"cal!C50","v":5},{"$f":"IF($E$8<=$E$9,\"\",cal!D50)","v":{"v":-78.28486902933179,"d":"-78"}},{"$f":"IF($E$8<=$E$9,\"\",cal!E50)","v":-7},{"$f":"IF($E$8<=$E$9,\"\",cal!F50)","v":{"$error":"#NUM!"}},{"$f":"IF($K$8>=$K$9,\"\",cal!G50)","v":{"v":-32.84190222242113,"d":"-33"}},{"$f":"IF($K$8>=$K$9,\"\",IF($M$4=\"High Perform. 208/230V (US/EU)\",cal!HK50,cal!H50))","v":{"v":-32.84190222242113,"d":"-33"}},{"$f":"IF($K$8>=$K$9,\"\",cal!I50)","v":-14},{"$f":"IF($K$8>=$K$9,\"\",cal!J50)","v":{"$error":"#NUM!"}},{"$f":"cal!K50","v":{"v":0,"d":"0.0"}},{"$f":"cal!L50","v":{"v":0,"d":"0.0"}},{"$f":"cal!M50","v":{"v":0,"d":"0.0"}},{"$f":"cal!N50","v":0},{"$f":"cal!O50","v":{"v":0,"d":"0.0"}},{"$f":"IF($E$8<=$E$9,\"\",cal!P50)","v":{"$error":"#DIV/0!"}},{"$f":"IF($K$8>=$K$9,\"\",cal!R50)","v":{"$error":"#DIV/0!"}},{"$f":"IF($K$8>=$K$9,\"\",cal!S50)","v":{"$error":"#DIV/0!"}},{"$f":"IF($K$8>=$K$9,\"\",cal!T50)","v":{"$error":"#DIV/0!"}},{"$f":"IF($K$8>=$K$9,\"\",cal!U50)","v":0},{"$f":"IF($K$8>=$K$9,\"\",cal!V50)","v":{"$error":"#DIV/0!"}}]
[null,{"$f":"cal!B51","v":{"v":0.6,"d":"60%"}},{"$f":"cal!C51","v":6},{"$f":"IF($E$8<=$E$9,\"\",cal!D51)","v":{"v":10638.371355643016,"d":"10638"}},{"$f":"IF($E$8<=$E$9,\"\",cal!E51)","v":915},{"$f":"IF($E$8<=$E$9,\"\",cal!F51)","v":{"v":9.481628757980802,"d":"9.48"}},{"$f":"IF($K$8>=$K$9,\"\",cal!G51)","v":{"v":2127.0413856362497,"d":"2127"}},{"$f":"IF($K$8>=$K$9,\"\",IF($M$4=\"High Perform. 208/230V (US/EU)\",cal!HK51,cal!H51))","v":{"v":2127.0413856362497,"d":"2127"}},{"$f":"IF($K$8>=$K$9,\"\",cal!I51)","v":914},{"$f":"IF($K$8>=$K$9,\"\",cal!J51)","v":{"v":9.458500684121743,"d":"9.46"}},{"$f":"cal!K51","v":{"v":41,"d":"41.0"}},{"$f":"cal!L51","v":{"v":49,"d":"49.0"}},{"$f":"cal!M51","v":{"v":37.073992288499525,"d":"37.1"}},{"$f":"cal!N51","v":{"v":990.001542,"d":"990"}},{"$f":"cal!O51","v":{"v":0.8064528690127076,"d":"0.8"}},{"$f":"IF($E$8<=$E$9,\"\",cal!P51)","v":{"v":51.542423857001864,"d":"51.5"}},{"$f":"IF($K$8>=$K$9,\"\",cal!R51)","v":{"v":20.614158982639005,"d":"20.6"}},{"$f":"IF($K$8>=$K$9,\"\",cal!S51)","v":{"v":17.34953675005941,"d":"17.3"}},{"$f":"IF($K$8>=$K$9,\"\",cal!T51)","v":{"v":0.7336229276297737,"d":"73%"}},{"$f":"IF($K$8>=$K$9,\"\",cal!U51)","v":{"v":835.3484046756057,"d":"835"}},{"$f":"IF($K$8>=$K$9,\"\",cal!V51)","v":{"v":0.1348143074292285,"d":"0.13"}}]
[null,{"$f":"cal!B52","v":{"v":0.7,"d":"70%"}},{"$f":"cal!C52","v":7},{"$f":"IF($E$8<=$E$9,\"\",cal!D52)","v":{"v":-78.28486902933179,"d":"-78"}},{"$f":"IF($E$8<=$E$9,\"\",cal!E52)","v":-7},{"$f":"IF($E$8<=$E$9,\"\",cal!F52)","v":{"$error":"#NUM!"}},{"$f":"IF($K$8>=$K$9,\"\",cal!G52)","v":{"v":-32.84190222242113,"d":"-33"}},{"$f":"IF($K$8>=$K$9,\"\",IF($M$4=\"High Perform. 208/230V (US/EU)\",cal!HK52,cal!H52))","v":{"v":-32.84190222242113,"d":"-33"}},{"$f":"IF($K$8>=$K$9,\"\",cal!I52)","v":-14},{"$f":"IF($K$8>=$K$9,\"\",cal!J52)","v":{"$error":"#NUM!"}},{"$f":"cal!K52","v":{"v":0,"d":"0.0"}},{"$f":"cal!L52","v":{"v":0,"d":"0.0"}},{"$f":"cal!M52","v":{"v":0,"d":"0.0"}},{"$f":"cal!N52","v":0},{"$f":"cal!O52","v":{"v":0,"d":"0.0"}},{"$f":"IF($E$8<=$E$9,\"\",cal!P52)","v":{"$error":"#DIV/0!"}},{"$f":"IF($K$8>=$K$9,\"\",cal!R52)","v":{"$error":"#DIV/0!"}},{"$f":"IF($K$8>=$K$9,\"\",cal!S52)","v":{"$error":"#DIV/0!"}},{"$f":"IF($K$8>=$K$9,\"\",cal!T52)","v":{"$error":"#DIV/0!"}},{"$f":"IF($K$8>=$K$9,\"\",cal!U52)","v":0},{"$f":"IF($K$8>=$K$9,\"\",cal!V52)","v":{"$error":"#DIV/0!"}}]
[null,{"$f":"cal!B53","v":{"v":0.8,"d":"80%"}},{"$f":"cal!C53","v":8},{"$f":"IF($E$8<=$E$9,\"\",cal!D53)","v":{"v":13249.920177568205,"d":"13250"}},{"$f":"IF($E$8<=$E$9,\"\",cal!E53)","v":1139},{"$f":"IF($E$8<=$E$9,\"\",cal!F53)","v":{"v":15.462761700679485,"d":"15.46"}},{"$f":"IF($K$8>=$K$9,\"\",cal!G53)","v":{"v":2659.531773998441,"d":"2660"}},{"$f":"IF($K$8>=$K$9,\"\",IF($M$4=\"High Perform. 208/230V (US/EU)\",cal!HK53,cal!H53))","v":{"v":2659.531773998441,"d":"2660"}},{"$f":"IF($K$8>=$K$9,\"\",cal!I53)","v":1143},{"$f":"IF($K$8>=$K$9,\"\",cal!J53)","v":{"v":15.584305711329021,"d":"15.58"}},{"$f":"cal!K53","v":{"v":47,"d":"47.0"}},{"$f":"cal!L53","v":{"v":55,"d":"55.0"}},{"$f":"cal!M53","v":{"v":65.78114400748828,"d":"65.8"}},{"$f":"cal!N53","v":{"v":1252.21545,"d":"1252"}},{"$f":"cal!O53","v":{"v":1.0200516862170086,"d":"1.0"}},{"$f":"IF($E$8<=$E$9,\"\",cal!P53)","v":{"v":51.059180469714676,"d":"51.1"}},{"$f":"IF($K$8>=$K$9,\"\",cal!R53)","v":{"v":20.687459775071233,"d":"20.7"}},{"$f":"IF($K$8>=$K$9,\"\",cal!S53)","v":{"v":17.374138623148855,"d":"17.4"}},{"$f":"IF($K$8>=$K$9,\"\",cal!T53)","v":{"v":0.7303229967103656,"d":"73%"}},{"$f":"IF($K$8>=$K$9,\"\",cal!U53)","v":{"v":998.5100266806237,"d":"999"}},{"$f":"IF($K$8>=$K$9,\"\",cal!V53)","v":{"v":0.18911451573845206,"d":"0.19"}}]
[null,{"$f":"cal!B54","v":{"v":1,"d":"100%"}},{"$f":"cal!C54","v":10},{"$f":"IF($E$8<=$E$9,\"\",cal!D54)","v":{"v":15024.990994875396,"d":"15025"}},{"$f":"IF($E$8<=$E$9,\"\",cal!E54)","v":1292},{"$f":"IF($E$8<=$E$9,\"\",cal!F54)","v":{"v":20.48999112883085,"d":"20.49"}},{"$f":"IF($K$8>=$K$9,\"\",cal!G54)","v":{"v":3023.1352867120613,"d":"3023"}},{"$f":"IF($K$8>=$K$9,\"\",cal!H54)","v":{"v":3023.1352867120613,"d":"3023"}},{"$f":"IF($K$8>=$K$9,\"\",cal!I54)","v":1300},{"$f":"IF($K$8>=$K$9,\"\",cal!J54)","v":{"v":20.774434419645953,"d":"20.77"}},{"$f":"cal!K54","v":{"v":51,"d":"51.0"}},{"$f":"cal!L54","v":{"v":59,"d":"59.0"}},{"$f":"cal!M54","v":{"v":95.03387554408134,"d":"95.0"}},{"$f":"cal!N54","v":{"v":1436.13516,"d":"1436"}},{"$f":"cal!O54","v":{"v":1.169872238514174,"d":"1.2"}},{"$f":"IF($E$8<=$E$9,\"\",cal!P54)","v":{"v":50.709637756320284,"d":"50.7"}},{"$f":"IF($K$8>=$K$9,\"\",cal!R54)","v":{"v":20.743372478217854,"d":"20.7"}},{"$f":"IF($K$8>=$K$9,\"\",cal!S54)","v":{"v":17.392889922423276,"d":"17.4"}},{"$f":"IF($K$8>=$K$9,\"\",cal!T54)","v":{"v":0.727817095162741,"d":"73%"}},{"$f":"IF($K$8>=$K$9,\"\",cal!U54)","v":{"v":1126.110007110515,"d":"1126"}},{"$f":"IF($K$8>=$K$9,\"\",cal!V54)","v":{"v":0.2382240623916574,"d":"0.24"}}]
[null,{"$f":"cal!B55","v":"Briza 22 (230V) height 54,5 cm, width 22 cm, length 190 cm (Type 10)"}]
[null,{"$f":"cal!B56","v":{"v":0.2,"d":"20%"}},{"$f":"cal!C56","v":2},{"$f":"IF($E$8<=$E$9,cal!$AC$6,cal!D56)","v":{"v":7001.651370405772,"d":"7002"}},{"$f":"IF($E$8<=$E$9,\"\",cal!E56)","v":602},{"$f":"IF($E$8<=$E$9,\"\",cal!F56)","v":{"v":3.8851789025636574,"d":"3.89"}},{"$f":"IF($K$8>=$K$9,cal!$AC$6,cal!G56)","v":{"v":1449.7076355441104,"d":"1450"}},{"$f":"IF($K$8>=$K$9,\"\",cal!H56)","v":{"v":1449.7076355441104,"d":"1450"}},{"$f":"IF($K$8>=$K$9,\"\",cal!I56)","v":623},{"$f":"IF($K$8>=$K$9,\"\",cal!J56)","v":{"v":4.135526212292623,"d":"4.14"}},{"$f":"cal!K56","v":31.5},{"$f":"cal!L56","v":39.5},{"$f":"cal!M56","v":{"v":11.09810395803566,"d":"11.1"}},{"$f":"cal!N56","v":{"v":548.888779,"d":"549"}},{"$f":"cal!O56","v":{"v":0.364758625066454,"d":"0.4"}},{"$f":"IF($E$8<=$E$9,\"\",cal!P56)","v":{"v":57.443110362034005,"d":"57.4"}},{"$f":"IF($K$8>=$K$9,\"\",cal!R56)","v":{"v":19.14991956153699,"d":"19.1"}},{"$f":"IF($K$8>=$K$9,\"\",cal!S56)","v":{"v":16.853478410130663,"d":"16.9"}},{"$f":"IF($K$8>=$K$9,\"\",cal!T56)","v":{"v":0.8031893880966785,"d":"80%"}},{"$f":"IF($K$8>=$K$9,\"\",cal!U56)","v":{"v":430.1229121550759,"d":"430"}},{"$f":"IF($K$8>=$K$9,\"\",cal!V56)","v":{"v":0.0727891984268973,"d":"0.07"}}]
[null,{"$f":"cal!B57","v":{"v":0.4,"d":"40%"}},{"$f":"cal!C57","v":4},{"$f":"IF($E$8<=$E$9,cal!$AC$7,cal!D57)","v":{"v":12038.565742887798,"d":"12039"}},{"$f":"IF($E$8<=$E$9,\"\",cal!E57)","v":1035},{"$f":"IF($E$8<=$E$9,\"\",cal!F57)","v":{"v":10.423354050605386,"d":"10.42"}},{"$f":"IF($K$8>=$K$9,cal!$AC$8,cal!G57)","v":{"v":2486.1664735304334,"d":"2486"}},{"$f":"IF($K$8>=$K$9,\"\",cal!H57)","v":{"v":2486.1664735304334,"d":"2486"}},{"$f":"IF($K$8>=$K$9,\"\",cal!I57)","v":1069},{"$f":"IF($K$8>=$K$9,\"\",cal!J57)","v":{"v":11.05532767842789,"d":"11.06"}},{"$f":"cal!K57","v":{"v":39,"d":"39.0"}},{"$f":"cal!L57","v":{"v":47,"d":"47.0"}},{"$f":"cal!M57","v":{"v":25.91716504040877,"d":"25.9"}},{"$f":"cal!N57","v":{"v":972.290465,"d":"972"}},{"$f":"cal!O57","v":{"v":0.6461260400053164,"d":"0.6"}},{"$f":"IF($E$8<=$E$9,\"\",cal!P57)","v":{"v":56.34414949334048,"d":"56.3"}},{"$f":"IF($K$8>=$K$9,\"\",cal!R57)","v":{"v":19.400024154861924,"d":"19.4"}},{"$f":"IF($K$8>=$K$9,\"\",cal!S57)","v":{"v":16.938838704327367,"d":"16.9"}},{"$f":"IF($K$8>=$K$9,\"\",cal!T57)","v":{"v":0.7907983450233794,"d":"79%"}},{"$f":"IF($K$8>=$K$9,\"\",cal!U57)","v":{"v":694.892389557053,"d":"695"}},{"$f":"IF($K$8>=$K$9,\"\",cal!V57)","v":{"v":0.09596082395549521,"d":"0.10"}}]
[null,{"$f":"cal!B58","v":{"v":0.5,"d":"50%"}},{"$f":"cal!C58","v":5},{"$f":"IF($E$8<=$E$9,\"\",cal!D58)","v":{"v":5.30344505500896,"d":"5"}},{"$f":"IF($E$8<=$E$9,\"\",cal!E58)","v":0},{"$f":"IF($E$8<=$E$9,\"\",cal!F58)","v":{"v":0,"d":"0.00"}},{"$f":"IF($K$8>=$K$9,\"\",cal!G58)","v":{"v":-4.90942723687469,"d":"-5"}},{"$f":"IF($K$8>=$K$9,\"\",IF($M$4=\"High Perform. 208/230V (US/EU)\",cal!HK58,cal!H58))","v":{"v":-4.90942723687469,"d":"-5"}},{"$f":"IF($K$8>=$K$9,\"\",cal!I58)","v":-2},{"$f":"IF($K$8>=$K$9,\"\",cal!J58)","v":{"$error":"#NUM!"}},{"$f":"cal!K58","v":{"v":0,"d":"0.0"}},{"$f":"cal!L58","v":{"v":0,"d":"0.0"}},{"$f":"cal!M58","v":{"v":0,"d":"0.0"}},{"$f":"cal!N58","v":0},{"$f":"cal!O58","v":{"v":0,"d":"0.0"}},{"$f":"IF($E$8<=$E$9,\"\",cal!P58)","v":{"$error":"#DIV/0!"}},{"$f":"IF($K$8>=$K$9,\"\",cal!R58)","v":{"$error":"#DIV/0!"}},{"$f":"IF($K$8>=$K$9,\"\",cal!S58)","v":{"$error":"#DIV/0!"}},{"$f":"IF($K$8>=$K$9,\"\",cal!T58)","v":{"$error":"#DIV/0!"}},{"$f":"IF($K$8>=$K$9,\"\",cal!U58)","v":0},{"$f":"IF($K$8>=$K$9,\"\",cal!V58)","v":{"$error":"#DIV/0!"}}]
[null,{"$f":"cal!B59","v":{"v":0.6,"d":"60%"}},{"$f":"cal!C59","v":6},{"$f":"IF($E$8<=$E$9,\"\",cal!D59)","v":{"v":16232.95184372751,"d":"16233"}},{"$f":"IF($E$8<=$E$9,\"\",cal!E59)","v":1396},{"$f":"IF($E$8<=$E$9,\"\",cal!F59)","v":{"v":17.974505497771883,"d":"17.97"}},{"$f":"IF($K$8>=$K$9,\"\",cal!G59)","v":{"v":3340.878052237484,"d":"3341"}},{"$f":"IF($K$8>=$K$9,\"\",IF($M$4=\"High Perform. 208/230V (US/EU)\",cal!HK59,cal!H59))","v":{"v":3340.878052237484,"d":"3341"}},{"$f":"IF($K$8>=$K$9,\"\",cal!I59)","v":1436},{"$f":"IF($K$8>=$K$9,\"\",cal!J59)","v":{"v":18.92346581294144,"d":"18.92"}},{"$f":"cal!K59","v":46.5},{"$f":"cal!L59","v":54.5},{"$f":"cal!M59","v":{"v":52.7864636521146,"d":"52.8"}},{"$f":"cal!N59","v":{"v":1346.83436,"d":"1347"}},{"$f":"cal!O59","v":{"v":0.8950254917597024,"d":"0.9"}},{"$f":"IF($E$8<=$E$9,\"\",cal!P59)","v":{"v":55.378474382176755,"d":"55.4"}},{"$f":"IF($K$8>=$K$9,\"\",cal!R59)","v":{"v":19.6273355382134,"d":"19.6"}},{"$f":"IF($K$8>=$K$9,\"\",cal!S59)","v":{"v":17.016193007572845,"d":"17.0"}},{"$f":"IF($K$8>=$K$9,\"\",cal!T59)","v":{"v":0.7797228975092394,"d":"78%"}},{"$f":"IF($K$8>=$K$9,\"\",cal!U59)","v":{"v":836.3169687415364,"d":"836"}},{"$f":"IF($K$8>=$K$9,\"\",cal!V59)","v":{"v":0.14109475878504654,"d":"0.14"}}]
[null,{"$f":"cal!B60","v":{"v":0.7,"d":"70%"}},{"$f":"cal!C60","v":7},{"$f":"IF($E$8<=$E$9,\"\",cal!D60)","v":{"v":5.30344505500896,"d":"5"}},{"$f":"IF($E$8<=$E$9,\"\",cal!E60)","v":0},{"$f":"IF($E$8<=$E$9,\"\",cal!F60)","v":{"v":0,"d":"0.00"}},{"$f":"IF($K$8>=$K$9,\"\",cal!G60)","v":{"v":-4.90942723687469,"d":"-5"}},{"$f":"IF($K$8>=$K$9,\"\",IF($M$4=\"High Perform. 208/230V (US/EU)\",cal!HK60,cal!H60))","v":{"v":-4.90942723687469,"d":"-5"}},{"$f":"IF($K$8>=$K$9,\"\",cal!I60)","v":-2},{"$f":"IF($K$8>=$K$9,\"\",cal!J60)","v":{"$error":"#NUM!"}},{"$f":"cal!K60","v":{"v":0,"d":"0.0"}},{"$f":"cal!L60","v":{"v":0,"d":"0.0"}},{"$f":"cal!M60","v":{"v":0,"d":"0.0"}},{"$f":"cal!N60","v":0},{"$f":"cal!O60","v":{"v":0,"d":"0.0"}},{"$f":"IF($E$8<=$E$9,\"\",cal!P60)","v":{"$error":"#DIV/0!"}},{"$f":"IF($K$8>=$K$9,\"\",cal!R60)","v":{"$error":"#DIV/0!"}},{"$f":"IF($K$8>=$K$9,\"\",cal!S60)","v":{"$error":"#DIV/0!"}},{"$f":"IF($K$8>=$K$9,\"\",cal!T60)","v":{"$error":"#DIV/0!"}},{"$f":"IF($K$8>=$K$9,\"\",cal!U60)","v":0},{"$f":"IF($K$8>=$K$9,\"\",cal!V60)","v":{"$error":"#DIV/0!"}}]
[null,{"$f":"cal!B61","v":{"v":0.8,"d":"80%"}},{"$f":"cal!C61","v":8},{"$f":"IF($E$8<=$E$9,\"\",cal!D61)","v":{"v":19967.90567147687,"d":"19968"}},{"$f":"IF($E$8<=$E$9,\"\",cal!E61)","v":1717},{"$f":"IF($E$8<=$E$9,\"\",cal!F61)","v":{"v":26.202986598368852,"d":"26.20"}},{"$f":"IF($K$8>=$K$9,\"\",cal!G61)","v":{"v":4094.3007616661316,"d":"4094"}},{"$f":"IF($K$8>=$K$9,\"\",IF($M$4=\"High Perform. 208/230V (US/EU)\",cal!HK61,cal!H61))","v":{"v":4094.3007616661316,"d":"4094"}},{"$f":"IF($K$8>=$K$9,\"\",cal!I61)","v":1760},{"$f":"IF($K$8>=$K$9,\"\",cal!J61)","v":{"v":27.410330159722072,"d":"27.41"}},{"$f":"cal!K61","v":{"v":52,"d":"52.0"}},{"$f":"cal!L61","v":{"v":60,"d":"60.0"}},{"$f":"cal!M61","v":{"v":92.99122092657511,"d":"93.0"}},{"$f":"cal!N61","v":{"v":1700.45593,"d":"1700"}},{"$f":"cal!O61","v":{"v":1.1300212187666137,"d":"1.1"}},{"$f":"IF($E$8<=$E$9,\"\",cal!P61)","v":{"v":54.46854280736155,"d":"54.5"}},{"$f":"IF($K$8>=$K$9,\"\",cal!R61)","v":{"v":19.843636461799832,"d":"19.8"}},{"$f":"IF($K$8>=$K$9,\"\",cal!S61)","v":{"v":17.08960112192305,"d":"17.1"}},{"$f":"IF($K$8>=$K$9,\"\",cal!T61)","v":{"v":0.7693457659485332,"d":"77%"}},{"$f":"IF($K$8>=$K$9,\"\",cal!U61)","v":{"v":963.9587740249005,"d":"964"}},{"$f":"IF($K$8>=$K$9,\"\",cal!V61)","v":{"v":0.1968697861729768,"d":"0.20"}}]
[null,{"$f":"cal!B62","v":{"v":1,"d":"100%"}},{"$f":"cal!C62","v":10},{"$f":"IF($E$8<=$E$9,\"\",cal!D62)","v":{"v":22199.735301168173,"d":"22200"}},{"$f":"IF($E$8<=$E$9,\"\",cal!E62)","v":1909},{"$f":"IF($E$8<=$E$9,\"\",cal!F62)","v":{"v":31.78253897131682,"d":"31.78"}},{"$f":"IF($K$8>=$K$9,\"\",cal!G62)","v":{"v":4540.478394254161,"d":"4540"}},{"$f":"IF($K$8>=$K$9,\"\",cal!H62)","v":{"v":4540.478394254161,"d":"4540"}},{"$f":"IF($K$8>=$K$9,\"\",cal!I62)","v":1952},{"$f":"IF($K$8>=$K$9,\"\",cal!J62)","v":{"v":33.09833777764766,"d":"33.10"}},{"$f":"cal!K62","v":{"v":55,"d":"55.0"}},{"$f":"cal!L62","v":{"v":63,"d":"63.0"}},{"$f":"cal!M62","v":{"v":131.5320102475324,"d":"131.5"}},{"$f":"cal!N62","v":{"v":1922.33329,"d":"1922"}},{"$f":"cal!O62","v":{"v":1.277467630249867,"d":"1.3"}},{"$f":"IF($E$8<=$E$9,\"\",cal!P62)","v":{"v":53.89806416407508,"d":"53.9"}},{"$f":"IF($K$8>=$K$9,\"\",cal!R62)","v":{"v":19.97977616287026,"d":"20.0"}},{"$f":"IF($K$8>=$K$9,\"\",cal!S62)","v":{"v":17.135704956637436,"d":"17.1"}},{"$f":"IF($K$8>=$K$9,\"\",cal!T62)","v":{"v":0.7628941373276372,"d":"76%"}},{"$f":"IF($K$8>=$K$9,\"\",cal!U62)","v":{"v":1100.4639023864406,"d":"1100"}},{"$f":"IF($K$8>=$K$9,\"\",cal!V62)","v":{"v":0.24632317369435802,"d":"0.25"}}]
[null,{"$f":"cal!B63","v":"*Values according to EN 1397 equipped with a G2 filter."},{"$nulls":18},"v2023-01-31"]
[null,{"$f":"cal!B64","v":"**Sound power according to ISO 3741:2010"}]
[null,{"$f":"cal!B65","v":"***Sound pressure with an assumed room damping of 8dB(A)"}]
[null,{"$f":"cal!B66","v":"****Calculated RH directly after the heat exchanger, assumed with a location-independent surface temperature."}]

{"sheet":"cal","index":1,"n_rows":89,"n_cols":244,"rows_kept":89,"hidden":true,"merged":[[4,6,4,9],[5,6,5,9],[6,15,6,16],[6,17,6,18],[7,12,7,13],[7,15,10,16],[7,17,10,18],[8,12,8,13],[8,23,10,23],[9,1,9,3],[9,6,9,9],[10,1,10,3],[10,6,10,9],[10,12,10,13],[11,1,11,3],[11,6,11,9],[11,12,11,13],[12,1,12,3],[12,6,12,9],[12,147,13,150],[12,151,13,154],[12,156,13,159],[12,160,13,163],[13,28,13,43],[13,44,13,59],[14,23,14,27],[14,28,14,31],[14,32,14,35],[14,36,14,39],[14,40,14,43],[14,44,14,47],[14,48,14,51],[14,52,14,55],[14,56,14,59],[14,62,14,64],[14,65,14,70],[14,71,14,76],[14,77,14,90],[14,91,14,104],[14,105,14,118],[14,119,14,132],[14,133,14,146],[15,77,15,82],[15,83,15,87],[15,88,15,90],[15,91,15,96],[15,97,15,101],[15,102,15,104],[15,105,15,110],[15,111,15,115],[15,116,15,118],[15,119,15,124],[15,125,15,129],[15,130,15,132],[15,133,15,138],[15,139,15,143],[15,144,15,146],[15,164,16,164],[15,183,16,183],[15,184,16,184],[15,185,16,185],[15,186,16,186],[15,187,16,187],[15,188,16,188],[15,189,16,189],[15,190,16,190],[15,191,16,191],[15,192,16,192],[15,193,16,193],[15,194,16,194],[15,195,16,195],[15,196,16,196],[15,197,16,197],[15,198,16,198],[15,199,16,199],[15,200,16,200],[15,201,16,201],[15,202,16,202],[15,203,16,203],[15,204,16,204],[15,205,16,205],[15,206,16,206],[15,207,16,207],[15,208,16,208],[15,209,16,209],[15,210,16,210],[15,211,16,211],[15,212,16,212],[15,213,16,213],[15,216,16,216],[15,217,16,217],[15,218,16,218],[16,1,16,12],[16,13,16,21],[16,62,16,64],[16,65,16,67],[16,68,16,70],[16,71,16,73],[16,74,16,76],[16,147,16,155],[16,156,16,159],[16,162,16,163],[16,219,16,236],[17,211,22,211],[22,1,22,12],[22,13,22,21],[22,77,22,82],[22,83,22,87],[22,88,22,90],[22,91,22,104],[22,105,22,118],[22,119,22,132],[22,133,22,146],[22,147,22,155],[22,156,22,159],[22,162,22,163],[22,219,22,236],[30,1,30,21],[30,77,30,82],[30,83,30,87],[30,88,30,90],[30,91,30,104],[30,105,30,118],[30,119,30,132],[30,133,30,146],[30,147,30,155],[30,156,30,159],[30,162,30,163],[30,219,30,236],[38,1,38,21],[38,77,38,82],[38,83,38,87],[38,88,38,90],[38,91,38,104],[38,105,38,118],[38,119,38,132],[38,133,38,146],[38,147,38,155],[38,156,38,159],[38,162,38,163],[38,219,38,236],[46,1,46,21],[46,77,46,82],[46,83,46,87],[46,88,46,90],[46,91,46,104],[46,105,46,118],[46,119,46,132],[46,133,46,146],[46,147,46,155],[46,156,46,159],[46,162,46,163],[46,219,46,236],[54,1,54,21],[54,77,54,82],[54,83,54,87],[54,88,54,90],[54,91,54,104],[54,105,54,118],[54,119,54,132],[54,133,54,146],[54,147,54,155],[54,156,54,159],[54,162,54,163],[54,219,54,236],[62,77,62,82],[62,83,62,87]]}
[{"$nulls":8},"Nederlands","English","Deutsch","Français","Norsk","Español","Svenska","Čeština","ExtraTaal1","ExtraTaal2","ExtraTaal3",{"$nulls":12},{"$f":"IF(LangNo=1,cal!$K$2,IF(LangNo=2,cal!$M$2,IF(LangNo=3,cal!$O$2,IF(LangNo=4,cal!$Q$2,IF(LangNo=5,cal!$I$2,IF(LangNo=6,cal!$S$2,IF(LangNo=7,cal!$I$2,IF(LangNo=8,cal!$U$2,IF(LangNo=9,cal!$S$2,IF(LangNo=10,cal!$S$2,IF(LangNo=11,cal!$S$2,)))))))))))","v":"Built-in"},{"$nulls":4},{"$f":"CONCATENATE(\"Briza 22 2-\",$AC$9)","v":"Briza 22 2-pipe"},"120V (US) - LOW FLOW"]
[{"$nulls":8},"Innebygd","Med hus","Inbouw","Met omkasting","Built-in","With casing","Einbau","Mit verkleidung","Intégré","Avec caisson","Empotrado","con carcasa","Vestavba","s pouzdrem",null,"Selection Case",null,{"$f":"CONCATENATE(AK5,AL5,Z6)","v":"121"},null,null,"T,kantel dry,wet",null,null,{"$f":"IF(LangNo=1,cal!$L$2,IF(LangNo=2,cal!$N$2,IF(LangNo=3,cal!$P$2,IF(LangNo=4,cal!$R$2,IF(LangNo=5,cal!$J$2,IF(LangNo=6,cal!$T$2,IF(LangNo=7,cal!$J$2,IF(LangNo=8,cal!$V$2,IF(LangNo=9,cal!$T$2,IF(LangNo=10,cal!$T$2,IF(LangNo=11,cal!$T$2,)))))))))))","v":"With casing"},null,null,{"$f":"IF(LangNo=1,AI7,IF(LangNo=2,AI8,IF(LangNo=3,AI9,IF(LangNo=4,AI10,IF(LangNo=5,AI11,IF(LangNo=6,AI12,IF(LangNo=7,AI11,IF(LangNo=8,AI13,IF(LangNo=9,AI7,IF(LangNo=10,AI7,IF(LangNo=11,AI7,)))))))))))","v":"Fresh water"},null,{"$f":"CONCATENATE(\"Briza 22 4-\",$AC$9)","v":"Briza 22 4-pipe"},"Standard 120V (US)",null,null,{"$f":"AI2","v":"Fresh water"},{"$f":"AI3","v":"Eth. Glycol"},{"$f":"AI4","v":"Prop. Glycol"},"Choice 1","Choice 2",{"$nulls":3},{"$f":"AI2","v":"Fresh water"},{"$f":"AI3","v":"Eth. Glycol"},{"$f":"AI4","v":"Prop. Glycol"},"Choice 1","Choice 2",null,"T02",{"$f":"IF(LangNo=1,NL!U24,IF(LangNo=2,EN!U24,IF(LangNo=3,DE!U24,IF(LangNo=4,FR!U24,IF(LangNo=5,NR!U24,IF(LangNo=6,SP!U24,IF(LangNo=7,SW!U24,IF(LangNo=8,TS!U24,IF(LangNo=9,ExtraTaal1!U24,IF(LangNo=10,ExtraTaal2!U24,IF(LangNo=11,ExtraTaal3!U24,)))))))))))","v":"Ceiling model"},{"$f":"NL!U24","v":"Plafondmodel"},{"$f":"EN!U24","v":"Ceiling model"},{"$f":"DE!U24","v":"Deckenmodell"},{"$f":"FR!U24","v":"Modèle de plafond"},{"$f":"NR!U24","v":"Takmodell"},{"$f":"SP!U24","v":"Modelo de techo"},"Casing added height",null,null,{"$f":"62.5-54.5","v":8},"mm"]
[{"$nulls":25},2,null,null,{"$f":"(237.3*LN((RH*EXP(17.27*(Tl_cool/(Tl_cool+237.3))))))/(17.27-LN((RH*EXP(17.27*(Tl_cool/(Tl_cool+237.3))))))","v":15.69066559142683},"°C",{"$nulls":4},"Eth. Glycol",null,{"$f":"CONCATENATE(\"Briza 26 2-\",$AC$9)","v":"Briza 26 2-pipe"},"Standard 230V (EU)",null,{"v":0,"d":"0%"},1,1,1,{"$f":"IF(AdditNo=1,$AO3,IF(AdditNo=2,$AP3,IF(AdditNo=3,$AQ3)))","v":1},{"$f":"IF('Briza 22 & 26'!$M$3=cal!$AN$3,cal!$AR$3,IF('Briza 22 & 26'!$M$3=cal!$AN$4,cal!$AR$4,IF('Briza 22 & 26'!$M$3=cal!$AN$5,cal!$AR$5,IF('Briza 22 & 26'!$M$3=cal!$AN$6,cal!$AR$6,IF('Briza 22 & 26'!$M$3=cal!$AN$7,cal!$AR$7,IF('Briza 22 & 26'!$M$3=cal!$AN$8,cal!$AR$8,))))))","v":1},null,null,{"$f":"AN3","v":{"v":0,"d":"0%"}},15,15,15,{"$f":"IF(AdditNo=1,$AW3,IF(AdditNo=2,$AX3,IF(AdditNo=3,$AY3)))","v":15},{"$f":"IF('Briza 22 & 26'!$M$3=cal!$AN$3,cal!$AZ$3,IF('Briza 22 & 26'!$M$3=cal!$AN$4,cal!$AZ$4,IF('Briza 22 & 26'!$M$3=cal!$AN$5,cal!$AZ$5,IF('Briza 22 & 26'!$M$3=cal!$AN$6,cal!$AZ$6,IF('Briza 22 & 26'!$M$3=cal!$AN$7,cal!$AZ$7,IF('Briza 22 & 26'!$M$3=cal!$AN$8,cal!$AZ$8,))))))","v":15},null,"T03",{"$f":"IF(LangNo=1,NL!U25,IF(LangNo=2,EN!U25,IF(LangNo=3,DE!U25,IF(LangNo=4,FR!U25,IF(LangNo=5,NR!U25,IF(LangNo=6,SP!U25,IF(LangNo=7,SW!U25,IF(LangNo=8,TS!U25,IF(LangNo=9,ExtraTaal1!U25,IF(LangNo=10,ExtraTaal2!U25,IF(LangNo=11,ExtraTaal3!U25,)))))))))))","v":"Wall model"},{"$f":"NL!U25","v":"Muurmodel"},{"$f":"EN!U25","v":"Wall model"},{"$f":"DE!U25","v":"Wandmodell"},{"$f":"FR!U25","v":"Modèle mural"},{"$f":"NR!U25","v":"Veggmodell"},{"$f":"SP!U25","v":"Modelo de pared"},"Casing added width",null,null,1.15,"mm"]
[null,{"$f":"IF(LangNo=1,NL!A2,IF(LangNo=2,EN!A2,IF(LangNo=3,DE!A2,IF(LangNo=4,FR!A2,IF(LangNo=5,NR!A2,IF(LangNo=6,SP!A2,IF(LangNo=7,SW!A2,IF(LangNo=8,TS!A2,IF(LangNo=9,ExtraTaal1!A2,IF(LangNo=10,ExtraTaal2!A2,IF(LangNo=11,ExtraTaal3!A2,)))))))))))","v":"Formulary"},{"$nulls":23},{"$f":"IF('Briza 22 & 26'!$K$3=cal!$AI$7,1,IF('Briza 22 & 26'!$K$3=cal!$AI$8,1,IF('Briza 22 & 26'!$K$3=cal!$AI$9,1,IF('Briza 22 & 26'!$K$3=cal!$AI$10,1,IF('Briza 22 & 26'!$K$3=cal!$AI$11,1,IF('Briza 22 & 26'!$K$3=cal!$AI$12,1,IF('Briza 22 & 26'!$K$3=cal!$AI$13,1,IF('Briza 22 & 26'!$K$3=cal!$AI$3,2,IF('Briza 22 & 26'!$K$3=cal!$AI$4,3,)))))))))","v":1},{"$nulls":8},"Prop. Glycol",null,{"$f":"CONCATENATE(\"Briza 26 4-\",$AC$9)","v":"Briza 26 4-pipe"},"High Perform. 208/230V (US/EU)",null,{"v":0.2,"d":"20%"},1,0.95,0.98,{"$f":"IF(AdditNo=1,$AO4,IF(AdditNo=2,$AP4,IF(AdditNo=3,$AQ4)))","v":1},{"$nulls":3},{"$f":"AN4","v":{"v":0.2,"d":"20%"}},15,0,0,{"$f":"IF(AdditNo=1,$AW4,IF(AdditNo=2,$AX4,IF(AdditNo=3,$AY4)))","v":15},{"$f":"(BA3*1.8)+32","v":59},null,"T04",null,{"$f":"SW!U24","v":"Takmodell"},{"$f":"TS!U24","v":"Stropní model"},{"$nulls":6},"Casing added length",{"$f":"17.5*2","v":35},"mm"]
[{"$nulls":6},{"$f":"IF(LangNo=1,NL!G3,IF(LangNo=2,EN!G3,IF(LangNo=3,DE!G3,IF(LangNo=4,FR!G3,IF(LangNo=5,NR!G3,IF(LangNo=6,SP!G3,IF(LangNo=7,SW!G3,IF(LangNo=8,TS!G3,IF(LangNo=9,ExtraTaal1!G3,IF(LangNo=10,ExtraTaal2!G3,IF(LangNo=11,ExtraTaal3!G3,)))))))))))","v":"Hydronic mix:"},{"$f":"IF(LangNo=1,NL!G3,IF(LangNo=2,EN!G3,IF(LangNo=3,DE!G3,IF(LangNo=4,FR!G3,IF(LangNo=5,NR!G3,IF(LangNo=6,SP!G3,IF(LangNo=7,SW!G3,IF(LangNo=8,TS!G3,IF(LangNo=9,ExtraTaal1!G3,IF(LangNo=10,ExtraTaal2!G3,IF(LangNo=11,ExtraTaal3!G3,)))))))))))","v":"Hydronic mix:"},{"$f":"IF(LangNo=1,NL!H3,IF(LangNo=2,EN!H3,IF(LangNo=3,DE!H3,IF(LangNo=4,FR!H3,IF(LangNo=5,NR!H3,IF(LangNo=6,SP!H3,IF(LangNo=7,SW!H3,IF(LangNo=8,TS!H3,IF(LangNo=9,ExtraTaal1!H3,IF(LangNo=10,ExtraTaal2!H3,IF(LangNo=11,ExtraTaal3!H3,)))))))))))","v":0},{"$f":"IF(LangNo=1,NL!I3,IF(LangNo=2,EN!I3,IF(LangNo=3,DE!I3,IF(LangNo=4,FR!I3,IF(LangNo=5,NR!I3,IF(LangNo=6,SP!I3,IF(LangNo=7,SW!I3,IF(LangNo=8,TS!I3,IF(LangNo=9,ExtraTaal1!I3,IF(LangNo=10,ExtraTaal2!I3,IF(LangNo=11,ExtraTaal3!I3,)))))))))))","v":0},{"$nulls":15},1,null,null,{"$f":"IF(LangNo=1,NL!$U16,IF(LangNo=2,EN!$U16,IF(LangNo=3,DE!$U16,IF(LangNo=4,FR!$U16,IF(LangNo=5,NR!$U16,IF(LangNo=6,SP!$U16,IF(LangNo=7,SW!$U16,IF(LangNo=8,TS!$U16,IF(LangNo=9,ExtraTaal1!$U16,IF(LangNo=10,ExtraTaal2!$U16,IF(LangNo=11,ExtraTaal3!$U16,)))))))))))","v":"Δp high!"},null,null,{"$f":"IF(LangNo=1,NL!W16,IF(LangNo=2,EN!W16,IF(LangNo=3,DE!W16,IF(LangNo=4,FR!W16,IF(LangNo=5,NR!W16,IF(LangNo=6,SP!W16,IF(LangNo=7,SW!W16,IF(LangNo=8,TS!W16,IF(LangNo=9,ExtraTaal1!W16,IF(LangNo=10,ExtraTaal2!W16,IF(LangNo=11,ExtraTaal3!W16,)))))))))))","v":"Copy all data"},{"$nulls":4},{"$f":"IF('Briza 22 & 26'!$K$4=cal!$AK$1,1,IF('Briza 22 & 26'!$K$4=cal!$AK$2,2,IF('Briza 22 & 26'!$K$4=cal!$AK$3,3,IF('Briza 22 & 26'!$K$4=cal!$AK$4,4,))))","v":1},{"$f":"IF('Briza 22 & 26'!$M$4=cal!$AL$1,1,IF('Briza 22 & 26'!$M$4=cal!$AL$3,2,IF('Briza 22 & 26'!$M$4=cal!$AL$4,3,IF('Briza 22 & 26'!$M$4=cal!$AL$2,4,))))","v":2},null,{"v":0.3,"d":"30%"},1,0.91,0.96,{"$f":"IF(AdditNo=1,$AO5,IF(AdditNo=2,$AP5,IF(AdditNo=3,$AQ5)))","v":1},{"$nulls":3},{"$f":"AN5","v":{"v":0.3,"d":"30%"}},15,{"$f":"-5","v":-5},{"$f":"-5","v":-5},{"$f":"IF(AdditNo=1,$AW5,IF(AdditNo=2,$AX5,IF(AdditNo=3,$AY5)))","v":15},null,null,"T06",null,{"$f":"SW!U25","v":"Väggmodell"},{"$f":"TS!U25","v":"Nástěnný model"},{"$nulls":4},"h","cf_hoogte_Qtot"]
[null,{"$f":"IF(LangNo=1,NL!A4,IF(LangNo=2,EN!A4,IF(LangNo=3,DE!A4,IF(LangNo=4,FR!A4,IF(LangNo=5,NR!A4,IF(LangNo=6,SP!A4,IF(LangNo=7,SW!A4,IF(LangNo=8,TS!A4,IF(LangNo=9,ExtraTaal1!A4,IF(LangNo=10,ExtraTaal2!A4,IF(LangNo=11,ExtraTaal3!A4,)))))))))))","v":"Conditions"},{"$nulls":4},{"$f":"IF(LangNo=1,NL!G4,IF(LangNo=2,EN!G4,IF(LangNo=3,DE!G4,IF(LangNo=4,FR!G4,IF(LangNo=5,NR!G4,IF(LangNo=6,SP!G4,IF(LangNo=7,SW!G4,IF(LangNo=8,TS!G4,IF(LangNo=9,ExtraTaal1!G4,IF(LangNo=10,ExtraTaal2!G4,IF(LangNo=11,ExtraTaal3!G4,)))))))))))","v":"Device - Ventilator - Utilization:"},{"$f":"IF(LangNo=1,NL!G4,IF(LangNo=2,EN!G4,IF(LangNo=3,DE!G4,IF(LangNo=4,FR!G4,IF(LangNo=5,NR!G4,IF(LangNo=6,SP!G4,IF(LangNo=7,SW!G4,IF(LangNo=8,TS!G4,IF(LangNo=9,ExtraTaal1!G4,IF(LangNo=10,ExtraTaal2!G4,IF(LangNo=11,ExtraTaal3!G4,)))))))))))","v":"Device - Ventilator - Utilization:"},{"$f":"IF(LangNo=1,NL!H4,IF(LangNo=2,EN!H4,IF(LangNo=3,DE!H4,IF(LangNo=4,FR!H4,IF(LangNo=5,NR!H4,IF(LangNo=6,SP!H4,IF(LangNo=7,SW!H4,IF(LangNo=8,TS!H4,IF(LangNo=9,ExtraTaal1!H4,IF(LangNo=10,ExtraTaal2!H4,IF(LangNo=11,ExtraTaal3!H4,)))))))))))","v":0},{"$f":"IF(LangNo=1,NL!I4,IF(LangNo=2,EN!I4,IF(LangNo=3,DE!I4,IF(LangNo=4,FR!I4,IF(LangNo=5,NR!I4,IF(LangNo=6,SP!I4,IF(LangNo=7,SW!I4,IF(LangNo=8,TS!I4,IF(LangNo=9,ExtraTaal1!I4,IF(LangNo=10,ExtraTaal2!I4,IF(LangNo=11,ExtraTaal3!I4,)))))))))))","v":0},{"$nulls":15},{"$f":"IF('Briza 22 & 26'!$P$4=cal!$K$2,1,IF('Briza 22 & 26'!$P$4=cal!$M$2,1,IF('Briza 22 & 26'!$P$4=cal!$O$2,1,IF('Briza 22 & 26'!$P$4=cal!$Q$2,1,IF('Briza 22 & 26'!$P$4=cal!$I$2,1,IF('Briza 22 & 26'!$P$4=cal!$S$2,1,IF('Briza 22 & 26'!$P$4=cal!$U$2,1,IF('Briza 22 & 26'!$P$4=cal!$L$2,2,IF('Briza 22 & 26'!$P$4=cal!$N$2,2,IF('Briza 22 & 26'!$P$4=cal!$P$2,2,IF('Briza 22 & 26'!$P$4=cal!$R$2,2,IF('Briza 22 & 26'!$P$4=cal!$J$2,2,IF('Briza 22 & 26'!$P$4=cal!$T$2,2,IF('Briza 22 & 26'!$P$4=cal!$V$2,2,))))))))))))))","v":1},null,null,{"$f":"IF(LangNo=1,NL!$U17,IF(LangNo=2,EN!$U17,IF(LangNo=3,DE!$U17,IF(LangNo=4,FR!$U17,IF(LangNo=5,NR!$U17,IF(LangNo=6,SP!$U17,IF(LangNo=7,SW!$U17,IF(LangNo=8,TS!$U17,IF(LangNo=9,ExtraTaal1!$U17,IF(LangNo=10,ExtraTaal2!$U17,IF(LangNo=11,ExtraTaal3!$U17,)))))))))))","v":"Temp."},null,null,{"$f":"IF(LangNo=1,NL!W17,IF(LangNo=2,EN!W17,IF(LangNo=3,DE!W17,IF(LangNo=4,FR!W17,IF(LangNo=5,NR!W17,IF(LangNo=6,SP!W17,IF(LangNo=7,SW!W17,IF(LangNo=8,TS!W17,IF(LangNo=9,ExtraTaal1!W17,IF(LangNo=10,ExtraTaal2!W17,IF(LangNo=11,ExtraTaal3!W17,)))))))))))","v":"SI-units"},{"$nulls":7},{"v":0.4,"d":"40%"},1,0.88,0.93,{"$f":"IF(AdditNo=1,$AO6,IF(AdditNo=2,$AP6,IF(AdditNo=3,$AQ6)))","v":1},{"$nulls":3},{"$f":"AN6","v":{"v":0.4,"d":"40%"}},15,{"$f":"-15","v":-15},-15,{"$f":"IF(AdditNo=1,$AW6,IF(AdditNo=2,$AX6,IF(AdditNo=3,$AY6)))","v":15},null,null,"T08",{"$nulls":7},{"$f":"IF(UnitsNo=1,Geg_Altit/1000,IF(UnitsNo=2,Geg_Altit*0.0003048))","v":0},{"$f":"-0.000265264729874266*BK6^6+0.000957582908802335*BK6^5+0.00470250661483425*BK6^4-0.0298716926548353*BK6^3+0.0557086806557086*BK6^2-0.0484008125693582*BK6+1","v":{"v":1,"d":"1.000"}}]
[{"$nulls":15},{"$f":"IF(LangNo=1,NL!Q7,IF(LangNo=2,EN!Q7,IF(LangNo=3,DE!Q7,IF(LangNo=4,FR!Q7,IF(LangNo=5,NR!Q7,IF(LangNo=6,SP!Q7,IF(LangNo=7,SW!Q7,IF(LangNo=8,TS!Q7,IF(LangNo=9,ExtraTaal1!Q7,IF(LangNo=10,ExtraTaal2!Q7,IF(LangNo=11,ExtraTaal3!Q7,)))))))))))","v":"Unit conversion"},{"$f":"IF(LangNo=1,NL!P5,IF(LangNo=2,EN!P5,IF(LangNo=3,DE!P5,IF(LangNo=4,FR!P5,IF(LangNo=5,NR!P5,IF(LangNo=6,SP!P5,IF(LangNo=7,SW!P5,IF(LangNo=8,TS!P5,IF(LangNo=9,ExtraTaal1!P5,IF(LangNo=10,ExtraTaal2!P5,IF(LangNo=11,ExtraTaal3!P5,)))))))))))","v":0},{"$f":"IF(LangNo=1,NL!S7,IF(LangNo=2,EN!S7,IF(LangNo=3,DE!S7,IF(LangNo=4,FR!S7,IF(LangNo=5,NR!S7,IF(LangNo=6,SP!S7,IF(LangNo=7,SW!S7,IF(LangNo=8,TS!S7,IF(LangNo=9,ExtraTaal1!S7,IF(LangNo=10,ExtraTaal2!S7,IF(LangNo=11,ExtraTaal3!S7,)))))))))))","v":"Known variables"},{"$f":"IF(LangNo=1,NL!R5,IF(LangNo=2,EN!R5,IF(LangNo=3,DE!R5,IF(LangNo=4,FR!R5,IF(LangNo=5,NR!R5,IF(LangNo=6,SP!R5,IF(LangNo=7,SW!R5,IF(LangNo=8,TS!R5,IF(LangNo=9,ExtraTaal1!R5,IF(LangNo=10,ExtraTaal2!R5,IF(LangNo=11,ExtraTaal3!R5,)))))))))))","v":0},{"$nulls":6},{"$f":"IF('Briza 22 & 26'!$K$2=cal!$I$1,1,IF('Briza 22 & 26'!$K$2=cal!$J$1,2,IF('Briza 22 & 26'!$K$2=cal!K1,3,IF('Briza 22 & 26'!$K$2=cal!L1,4,IF('Briza 22 & 26'!$K$2=cal!M1,5,IF('Briza 22 & 26'!$K$2=cal!N1,6,IF('Briza 22 & 26'!$K$2=cal!O1,7,IF('Briza 22 & 26'!$K$2=cal!P1,8,IF('Briza 22 & 26'!$K$2=cal!Q1,9,IF('Briza 22 & 26'!$K$2=cal!R1,10,IF('Briza 22 & 26'!$K$2=cal!S1,11,)))))))))))","v":2},null,null,{"$f":"IF(LangNo=1,NL!$U18,IF(LangNo=2,EN!$U18,IF(LangNo=3,DE!$U18,IF(LangNo=4,FR!$U18,IF(LangNo=5,NR!$U18,IF(LangNo=6,SP!$U18,IF(LangNo=7,SW!$U18,IF(LangNo=8,TS!$U18,IF(LangNo=9,ExtraTaal1!$U18,IF(LangNo=10,ExtraTaal2!$U18,IF(LangNo=11,ExtraTaal3!$U18,)))))))))))","v":"heating!"},null,null,{"$f":"IF(LangNo=1,NL!W18,IF(LangNo=2,EN!W18,IF(LangNo=3,DE!W18,IF(LangNo=4,FR!W18,IF(LangNo=5,NR!W18,IF(LangNo=6,SP!W18,IF(LangNo=7,SW!W18,IF(LangNo=8,TS!W18,IF(LangNo=9,ExtraTaal1!W18,IF(LangNo=10,ExtraTaal2!W18,IF(LangNo=11,ExtraTaal3!W18,)))))))))))","v":"Imperial-units"},null,null,"Zuiver water",null,{"$f":"IF($BK$17=\"11\",\"Briza 22 (120V)\",IF($BK$17=\"21\",\"Briza 22 (120V)\",IF($BK$17=\"12\",\"Briza 22 (230V)\",IF($BK$17=\"22\",\"Briza 22 (230V)\",IF($BK$17=\"13\",\"Briza 22 HP\",IF($BK$17=\"23\",\"Briza 22 HP\",IF($BK$17=\"14\",\"Briza 22 (120V-HP)\",IF($BK$17=\"24\",\"Briza 22 (120V-HP)\",IF($BK$17=\"31\",\"Briza 26 (120V)\",IF($BK$17=\"41\",\"Briza 26 (120V)\",IF($BK$17=\"32\",\"Briza 26 (230V)\",IF($BK$17=\"42\",\"Briza 26 (230V)\",IF($BK$17=\"33\",\"Briza 26 HP\",IF($BK$17=\"43\",\"Briza 26 HP\",IF($BK$17=\"34\",\"Briza 26 (120V-HP)\",IF($BK$17=\"44\",\"Briza 26 (120V-HP)\",))))))))))))))))","v":"Briza 22 (230V)"},null,null,{"v":0.5,"d":"50%"},1,0.84,0.9,{"$f":"IF(AdditNo=1,$AO7,IF(AdditNo=2,$AP7,IF(AdditNo=3,$AQ7)))","v":1},{"$nulls":3},{"$f":"AN7","v":{"v":0.5,"d":"50%"}},15,-25,-25,{"$f":"IF(AdditNo=1,$AW7,IF(AdditNo=2,$AX7,IF(AdditNo=3,$AY7)))","v":15},null,null,"T10"]
[null,{"$f":"IF(LangNo=1,NL!A6,IF(LangNo=2,EN!A6,IF(LangNo=3,DE!A6,IF(LangNo=4,FR!A6,IF(LangNo=5,NR!A6,IF(LangNo=6,SP!A6,IF(LangNo=7,SW!A6,IF(LangNo=8,TS!A6,IF(LangNo=9,ExtraTaal1!A6,IF(LangNo=10,ExtraTaal2!A6,IF(LangNo=11,ExtraTaal3!A6,)))))))))))","v":"Temperatures"},{"$nulls":10},{"$f":"IF(LangNo=1,NL!L6,IF(LangNo=2,EN!L6,IF(LangNo=3,DE!L6,IF(LangNo=4,FR!L6,IF(LangNo=5,NR!L6,IF(LangNo=6,SP!L6,IF(LangNo=7,SW!L6,IF(LangNo=8,TS!L6,IF(LangNo=9,ExtraTaal1!L6,IF(LangNo=10,ExtraTaal2!L6,IF(LangNo=11,ExtraTaal3!L6,)))))))))))","v":"Static pressure"},{"$f":"IF(LangNo=1,NL!M6,IF(LangNo=2,EN!M6,IF(LangNo=3,DE!M6,IF(LangNo=4,FR!M6,IF(LangNo=5,NR!M6,IF(LangNo=6,SP!M6,IF(LangNo=7,SW!M6,IF(LangNo=8,TS!M6,IF(LangNo=9,ExtraTaal1!M6,IF(LangNo=10,ExtraTaal2!M6,IF(LangNo=11,ExtraTaal3!M6,)))))))))))","v":0},{"$nulls":11},{"$f":"IF('Briza 22 & 26'!$R$4=cal!BE2,1,IF('Briza 22 & 26'!$R$4=cal!BF2,1,IF('Briza 22 & 26'!$R$4=cal!BG2,1,IF('Briza 22 & 26'!$R$4=cal!BH2,1,IF('Briza 22 & 26'!$R$4=cal!BI2,1,IF('Briza 22 & 26'!$R$4=cal!BJ2,1,IF('Briza 22 & 26'!$R$4=cal!BE3,2,IF('Briza 22 & 26'!$R$4=cal!BF3,2,IF('Briza 22 & 26'!$R$4=cal!BG3,2,IF('Briza 22 & 26'!$R$4=cal!BH3,2,IF('Briza 22 & 26'!$R$4=cal!BI3,2,IF('Briza 22 & 26'!$R$4=cal!BJ3,2,))))))))))))","v":0},null,null,{"$f":"IF(LangNo=1,NL!$U19,IF(LangNo=2,EN!$U19,IF(LangNo=3,DE!$U19,IF(LangNo=4,FR!$U19,IF(LangNo=5,NR!$U19,IF(LangNo=6,SP!$U19,IF(LangNo=7,SW!$U19,IF(LangNo=8,TS!$U19,IF(LangNo=9,ExtraTaal1!$U19,IF(LangNo=10,ExtraTaal2!$U19,IF(LangNo=11,ExtraTaal3!$U19,)))))))))))","v":"cooling!"},null,null,{"$f":"IF(LangNo=1,NL!W19,IF(LangNo=2,EN!W19,IF(LangNo=3,DE!W19,IF(LangNo=4,FR!W19,IF(LangNo=5,NR!W19,IF(LangNo=6,SP!W19,IF(LangNo=7,SW!W19,IF(LangNo=8,TS!W19,IF(LangNo=9,ExtraTaal1!W19,IF(LangNo=10,ExtraTaal2!W19,IF(LangNo=11,ExtraTaal3!W19,)))))))))))","v":"T,wb & RH"},null,null,"Fresh water",{"$nulls":4},{"v":1,"d":"100%"},1,null,null,1,{"$nulls":3},{"v":1,"d":"100%"},15,null,null,15]
[null,{"$f":"IF(LangNo=1,NL!A7,IF(LangNo=2,EN!A7,IF(LangNo=3,DE!A7,IF(LangNo=4,FR!A7,IF(LangNo=5,NR!A7,IF(LangNo=6,SP!A7,IF(LangNo=7,SW!A7,IF(LangNo=8,TS!A7,IF(LangNo=9,ExtraTaal1!A7,IF(LangNo=10,ExtraTaal2!A7,IF(LangNo=11,ExtraTaal3!A7,)))))))))))","v":"Heating:"},{"$nulls":4},{"$f":"IF(LangNo=1,NL!F7,IF(LangNo=2,EN!F7,IF(LangNo=3,DE!F7,IF(LangNo=4,FR!F7,IF(LangNo=5,NR!F7,IF(LangNo=6,SP!F7,IF(LangNo=7,SW!F7,IF(LangNo=8,TS!F7,IF(LangNo=9,ExtraTaal1!F7,IF(LangNo=10,ExtraTaal2!F7,IF(LangNo=11,ExtraTaal3!F7,)))))))))))","v":"Cooling:"},{"$nulls":5},{"$f":"IF(UnitsNo=1,'Briza 22 & 26'!$M$9,IF(UnitsNo=2,'Briza 22 & 26'!$M$9*249.08890833333,))","v":{"v":0,"d":"0.000"}},{"$nulls":8},"Temp",null,"Flow loss casing",null,1,null,null,{"$f":"IF(LangNo=1,\"pijp\",IF(LangNo=2,\"pipe\",IF(LangNo=3,\"rohr\",IF(LangNo=4,\"conduite\",IF(LangNo=5,\"rør\",IF(LangNo=6,\"tubos\",IF(LangNo=7,\"ror\",IF(LangNo=8,\"trubka\",IF(LangNo=9,\"ExtraTaal1\",IF(LangNo=10,\"ExtraTaal2\",IF(LangNo=11,\"ExtraTaal3\",)))))))))))","v":"pipe"},null,null,{"$f":"IF(LangNo=1,NL!W20,IF(LangNo=2,EN!W20,IF(LangNo=3,DE!W20,IF(LangNo=4,FR!W20,IF(LangNo=5,NR!W20,IF(LangNo=6,SP!W20,IF(LangNo=7,SW!W20,IF(LangNo=8,TS!W20,IF(LangNo=9,ExtraTaal1!W20,IF(LangNo=10,ExtraTaal2!W20,IF(LangNo=11,ExtraTaal3!W20,)))))))))))","v":"T,db & RH"},null,null,"Reines Wasser",null,{"$f":"IF(LangNo=1,NL!W16,IF(LangNo=2,EN!W16,IF(LangNo=3,DE!W16,IF(LangNo=4,FR!W16,IF(LangNo=5,NR!W16,IF(LangNo=6,SP!W16,IF(LangNo=7,SW!W16,IF(LangNo=8,TS!W16,IF(LangNo=9,ExtraTaal1!W16,IF(LangNo=10,ExtraTaal2!W16,IF(LangNo=11,ExtraTaal3!W16,)))))))))))","v":"Copy all data"},null,null,"BPF",{"$nulls":20},"Temp",null,"dP"]
[null,{"$f":"IF(LangNo=1,NL!A8,IF(LangNo=2,EN!A8,IF(LangNo=3,DE!A8,IF(LangNo=4,FR!A8,IF(LangNo=5,NR!A8,IF(LangNo=6,SP!A8,IF(LangNo=7,SW!A8,IF(LangNo=8,TS!A8,IF(LangNo=9,ExtraTaal1!A8,IF(LangNo=10,ExtraTaal2!A8,IF(LangNo=11,ExtraTaal3!A8,)))))))))))","v":"Supply water"},{"$f":"IF(LangNo=1,NL!B8,IF(LangNo=2,EN!B8,IF(LangNo=3,DE!B8,IF(LangNo=4,FR!B8,IF(LangNo=5,NR!B8,IF(LangNo=6,SP!B8,IF(LangNo=7,SW!B8,IF(LangNo=8,TS!B8,IF(LangNo=9,ExtraTaal1!B8,IF(LangNo=10,ExtraTaal2!B8,IF(LangNo=11,ExtraTaal3!B8,)))))))))))","v":0},{"$f":"IF(LangNo=1,NL!C8,IF(LangNo=2,EN!C8,IF(LangNo=3,DE!C8,IF(LangNo=4,FR!C8,IF(LangNo=5,NR!C8,IF(LangNo=6,SP!C8,IF(LangNo=7,SW!C8,IF(LangNo=8,TS!C8,IF(LangNo=9,ExtraTaal1!C8,IF(LangNo=10,ExtraTaal2!C8,IF(LangNo=11,ExtraTaal3!C8,)))))))))))","v":0},{"$f":"'Briza 22 & 26'!E8","v":65},{"$f":"IF(UnitsNo=1,\"°C\",IF(UnitsNo=2,\"°F\"))","v":"°C"},{"$f":"B10","v":"Supply water"},{"$f":"IF(LangNo=1,NL!G8,IF(LangNo=2,EN!G8,IF(LangNo=3,DE!G8,IF(LangNo=4,FR!G8,IF(LangNo=5,NR!G8,IF(LangNo=6,SP!G8,))))))","v":0},{"$f":"IF(LangNo=1,NL!H8,IF(LangNo=2,EN!H8,IF(LangNo=3,DE!H8,IF(LangNo=4,FR!H8,IF(LangNo=5,NR!H8,IF(LangNo=6,SP!H8,))))))","v":0},{"$f":"IF(LangNo=1,NL!I8,IF(LangNo=2,EN!I8,IF(LangNo=3,DE!I8,IF(LangNo=4,FR!I8,IF(LangNo=5,NR!I8,IF(LangNo=6,SP!I8,))))))","v":0},{"$f":"'Briza 22 & 26'!K8","v":16},{"$nulls":10},{"$f":"IF(UnitsNo=1,$E10,IF(UnitsNo=2,($E10-Celc2)/Celc1))","v":{"v":65,"d":"65.00"}},{"$nulls":6},{"$f":"IF(LangNo=1,NL!$U10,IF(LangNo=2,EN!$U10,IF(LangNo=3,DE!$U10,IF(LangNo=4,FR!$U10,IF(LangNo=5,NR!$U10,IF(LangNo=6,SP!$U10,IF(LangNo=7,SW!$U10,IF(LangNo=8,TS!$U10,IF(LangNo=9,ExtraTaal1!$U10,IF(LangNo=10,ExtraTaal2!$U10,IF(LangNo=11,ExtraTaal3!$U10,)))))))))))","v":"Desired flow rate"},null,null,{"$f":"IF(LangNo=1,NL!W21,IF(LangNo=2,EN!W21,IF(LangNo=3,DE!W21,IF(LangNo=4,FR!W21,IF(LangNo=5,NR!W21,IF(LangNo=6,SP!W21,IF(LangNo=7,SW!W21,IF(LangNo=8,TS!W21,IF(LangNo=9,ExtraTaal1!W21,IF(LangNo=10,ExtraTaal2!W21,IF(LangNo=11,ExtraTaal3!W21,)))))))))))","v":"T,db & T,wb"},null,null,"Eau pure",null,{"$f":"IF(LangNo=1,NL!W17,IF(LangNo=2,EN!W17,IF(LangNo=3,DE!W17,IF(LangNo=4,FR!W17,IF(LangNo=5,NR!W17,IF(LangNo=6,SP!W17,IF(LangNo=7,SW!W17,IF(LangNo=8,TS!W17,IF(LangNo=9,ExtraTaal1!W17,IF(LangNo=10,ExtraTaal2!W17,IF(LangNo=11,ExtraTaal3!W17,)))))))))))","v":"SI-units"},null,null,1.2,{"$nulls":20},{"$f":"IF(UnitsNo=1,$K10,IF(UnitsNo=2,($K10-Celc2)/Celc1))","v":{"v":16,"d":"16.00"}},null,{"$f":"IF(UnitsNo=1,M9/10,IF(UnitsNo=2,M9*24.90889083))","v":{"v":0,"d":"0.00"}}]
[null,{"$f":"IF(LangNo=1,NL!A9,IF(LangNo=2,EN!A9,IF(LangNo=3,DE!A9,IF(LangNo=4,FR!A9,IF(LangNo=5,NR!A9,IF(LangNo=6,SP!A9,IF(LangNo=7,SW!A9,IF(LangNo=8,TS!A9,IF(LangNo=9,ExtraTaal1!A9,IF(LangNo=10,ExtraTaal2!A9,IF(LangNo=11,ExtraTaal3!A9,)))))))))))","v":"Return water"},{"$f":"IF(LangNo=1,NL!B9,IF(LangNo=2,EN!B9,IF(LangNo=3,DE!B9,IF(LangNo=4,FR!B9,IF(LangNo=5,NR!B9,IF(LangNo=6,SP!B9,IF(LangNo=7,SW!B9,IF(LangNo=8,TS!B9,IF(LangNo=9,ExtraTaal1!B9,IF(LangNo=10,ExtraTaal2!B9,IF(LangNo=11,ExtraTaal3!B9,)))))))))))","v":0},{"$f":"IF(LangNo=1,NL!C9,IF(LangNo=2,EN!C9,IF(LangNo=3,DE!C9,IF(LangNo=4,FR!C9,IF(LangNo=5,NR!C9,IF(LangNo=6,SP!C9,IF(LangNo=7,SW!C9,IF(LangNo=8,TS!C9,IF(LangNo=9,ExtraTaal1!C9,IF(LangNo=10,ExtraTaal2!C9,IF(LangNo=11,ExtraTaal3!C9,)))))))))))","v":0},{"$f":"'Briza 22 & 26'!E9","v":55},{"$f":"F10","v":"°C"},{"$f":"B11","v":"Return water"},{"$f":"IF(LangNo=1,NL!G9,IF(LangNo=2,EN!G9,IF(LangNo=3,DE!G9,IF(LangNo=4,FR!G9,IF(LangNo=5,NR!G9,IF(LangNo=6,SP!G9,))))))","v":0},{"$f":"IF(LangNo=1,NL!H9,IF(LangNo=2,EN!H9,IF(LangNo=3,DE!H9,IF(LangNo=4,FR!H9,IF(LangNo=5,NR!H9,IF(LangNo=6,SP!H9,))))))","v":0},{"$f":"IF(LangNo=1,NL!I9,IF(LangNo=2,EN!I9,IF(LangNo=3,DE!I9,IF(LangNo=4,FR!I9,IF(LangNo=5,NR!I9,IF(LangNo=6,SP!I9,))))))","v":0},{"$f":"'Briza 22 & 26'!K9","v":18},null,{"$f":"IF(LangNo=1,NL!L9,IF(LangNo=2,EN!L9,IF(LangNo=3,DE!L9,IF(LangNo=4,FR!L9,IF(LangNo=5,NR!L9,IF(LangNo=6,SP!L9,IF(LangNo=7,SW!L9,IF(LangNo=8,TS!L9,IF(LangNo=9,ExtraTaal1!L9,IF(LangNo=10,ExtraTaal2!L9,IF(LangNo=11,ExtraTaal3!L9,)))))))))))","v":"Altitude"},{"$f":"IF(LangNo=1,NL!M9,IF(LangNo=2,EN!M9,IF(LangNo=3,DE!M9,IF(LangNo=4,FR!M9,IF(LangNo=5,NR!M9,IF(LangNo=6,SP!M9,IF(LangNo=7,SW!M9,IF(LangNo=8,TS!M9,IF(LangNo=9,ExtraTaal1!M9,IF(LangNo=10,ExtraTaal2!M9,IF(LangNo=11,ExtraTaal3!M9,)))))))))))","v":0},{"$nulls":7},{"$f":"IF(UnitsNo=1,$E11,IF(UnitsNo=2,($E11-Celc2)/Celc1))","v":{"v":55,"d":"55.00"}},{"$nulls":6},{"$f":"IF(LangNo=1,NL!$U11,IF(LangNo=2,EN!$U11,IF(LangNo=3,DE!$U11,IF(LangNo=4,FR!$U11,IF(LangNo=5,NR!$U11,IF(LangNo=6,SP!$U11,IF(LangNo=7,SW!$U11,IF(LangNo=8,TS!$U11,IF(LangNo=9,ExtraTaal1!$U11,IF(LangNo=10,ExtraTaal2!$U11,IF(LangNo=11,ExtraTaal3!$U11,)))))))))))","v":"To calculate on"},null,null,{"$f":"IF(LangNo=1,NL!W22,IF(LangNo=2,EN!W22,IF(LangNo=3,DE!W22,IF(LangNo=4,FR!W22,IF(LangNo=5,NR!W22,IF(LangNo=6,SP!W22,IF(LangNo=7,SW!W22,IF(LangNo=8,TS!W22,IF(LangNo=9,ExtraTaal1!W22,IF(LangNo=10,ExtraTaal2!W22,IF(LangNo=11,ExtraTaal3!W22,)))))))))))","v":"Only on request!"},null,null,"Ferskvann",null,{"$f":"IF(LangNo=1,NL!W18,IF(LangNo=2,EN!W18,IF(LangNo=3,DE!W18,IF(LangNo=4,FR!W18,IF(LangNo=5,NR!W18,IF(LangNo=6,SP!W18,IF(LangNo=7,SW!W18,IF(LangNo=8,TS!W18,IF(LangNo=9,ExtraTaal1!W18,IF(LangNo=10,ExtraTaal2!W18,IF(LangNo=11,ExtraTaal3!W18,)))))))))))","v":"Imperial-units"},{"$nulls":23},{"$f":"IF(UnitsNo=1,$K11,IF(UnitsNo=2,($K11-Celc2)/Celc1))","v":{"v":18,"d":"18.00"}},null,"p_atm"]
[null,{"$f":"IF(LangNo=1,NL!A10,IF(LangNo=2,EN!A10,IF(LangNo=3,DE!A10,IF(LangNo=4,FR!A10,IF(LangNo=5,NR!A10,IF(LangNo=6,SP!A10,IF(LangNo=7,SW!A10,IF(LangNo=8,TS!A10,IF(LangNo=9,ExtraTaal1!A10,IF(LangNo=10,ExtraTaal2!A10,IF(LangNo=11,ExtraTaal3!A10,)))))))))))","v":"Entering air (dry bulb)"},{"$f":"IF(LangNo=1,NL!B10,IF(LangNo=2,EN!B10,IF(LangNo=3,DE!B10,IF(LangNo=4,FR!B10,IF(LangNo=5,NR!B10,IF(LangNo=6,SP!B10,IF(LangNo=7,SW!B10,IF(LangNo=8,TS!B10,IF(LangNo=9,ExtraTaal1!B10,IF(LangNo=10,ExtraTaal2!B10,IF(LangNo=11,ExtraTaal3!B10,)))))))))))","v":0},{"$f":"IF(LangNo=1,NL!C10,IF(LangNo=2,EN!C10,IF(LangNo=3,DE!C10,IF(LangNo=4,FR!C10,IF(LangNo=5,NR!C10,IF(LangNo=6,SP!C10,IF(LangNo=7,SW!C10,IF(LangNo=8,TS!C10,IF(LangNo=9,ExtraTaal1!C10,IF(LangNo=10,ExtraTaal2!C10,IF(LangNo=11,ExtraTaal3!C10,)))))))))))","v":0},{"$f":"'Briza 22 & 26'!E10","v":20},{"$f":"F10","v":"°C"},"Entering air (dry bulb)",{"$f":"IF(LangNo=1,NL!G10,IF(LangNo=2,EN!G10,IF(LangNo=3,DE!G10,IF(LangNo=4,FR!G10,IF(LangNo=5,NR!G10,IF(LangNo=6,SP!G10,))))))","v":0},{"$f":"IF(LangNo=1,NL!H10,IF(LangNo=2,EN!H10,IF(LangNo=3,DE!H10,IF(LangNo=4,FR!H10,IF(LangNo=5,NR!H10,IF(LangNo=6,SP!H10,))))))","v":0},{"$f":"IF(LangNo=1,NL!I10,IF(LangNo=2,EN!I10,IF(LangNo=3,DE!I10,IF(LangNo=4,FR!I10,IF(LangNo=5,NR!I10,IF(LangNo=6,SP!I10,))))))","v":0},{"$f":"'Briza 22 & 26'!K10","v":27},null,{"$f":"'Briza 22 & 26'!M11:N11","v":0},{"$nulls":8},{"$f":"IF(UnitsNo=1,$E12,IF(UnitsNo=2,($E12-Celc2)/Celc1))","v":{"v":20,"d":"20.00"}},null,{"$f":"IF(CaseNo=1,1,IF(CaseNo=2,0.868616242602513))","v":1},{"$nulls":4},{"$f":"IF(UnitsNo=1,\"[l/h]\",\"[GPM]\")","v":"[l/h]"},null,null,{"$f":"IF(LangNo=1,NL!W23,IF(LangNo=2,EN!W23,IF(LangNo=3,DE!W23,IF(LangNo=4,FR!W23,IF(LangNo=5,NR!W23,IF(LangNo=6,SP!W23,IF(LangNo=7,SW!W23,IF(LangNo=8,TS!W23,IF(LangNo=9,ExtraTaal1!W23,IF(LangNo=10,ExtraTaal2!W23,IF(LangNo=11,ExtraTaal3!W23,)))))))))))","v":"Product not available with casing!"},null,null,"Agua dulce",{"$nulls":25},{"$f":"IF(UnitsNo=1,$K12,IF(UnitsNo=2,($K12-Celc2)/Celc1))","v":{"v":27,"d":"27.00"}},null,{"$f":"IF(UnitsNo=1,(101325*(1-((0.0065*Geg_Altit)/288.15))^((9.81*0.028964)/(8.31447*0.0065))),IF(UnitsNo=2,(101325*(1-((0.0065*(Geg_Altit*0.3048))/288.15))^((9.81*0.028964)/(8.31447*0.0065)))))","v":101325}]
[null,{"$f":"IF(LangNo=1,NL!A11,IF(LangNo=2,EN!A11,IF(LangNo=3,DE!A11,IF(LangNo=4,FR!A11,IF(LangNo=5,NR!A11,IF(LangNo=6,SP!A11,IF(LangNo=7,SW!A11,IF(LangNo=8,TS!A11,IF(LangNo=9,ExtraTaal1!A11,IF(LangNo=10,ExtraTaal2!A11,IF(LangNo=11,ExtraTaal3!A11,)))))))))))","v":"Entering air (wet bulb)"},{"$f":"IF(LangNo=1,NL!B11,IF(LangNo=2,EN!B11,IF(LangNo=3,DE!B11,IF(LangNo=4,FR!B11,IF(LangNo=5,NR!B11,IF(LangNo=6,SP!B11,IF(LangNo=7,SW!B11,IF(LangNo=8,TS!B11,IF(LangNo=9,ExtraTaal1!B11,IF(LangNo=10,ExtraTaal2!B11,IF(LangNo=11,ExtraTaal3!B11,)))))))))))","v":0},{"$f":"IF(LangNo=1,NL!C11,IF(LangNo=2,EN!C11,IF(LangNo=3,DE!C11,IF(LangNo=4,FR!C11,IF(LangNo=5,NR!C11,IF(LangNo=6,SP!C11,IF(LangNo=7,SW!C11,IF(LangNo=8,TS!C11,IF(LangNo=9,ExtraTaal1!C11,IF(LangNo=10,ExtraTaal2!C11,IF(LangNo=11,ExtraTaal3!C11,)))))))))))","v":0},null,null,{"$f":"B13","v":"Entering air (wet bulb)"},{"$f":"IF(LangNo=1,NL!G11,IF(LangNo=2,EN!G11,IF(LangNo=3,DE!G11,IF(LangNo=4,FR!G11,IF(LangNo=5,NR!G11,IF(LangNo=6,SP!G11,))))))","v":0},{"$f":"IF(LangNo=1,NL!H11,IF(LangNo=2,EN!H11,IF(LangNo=3,DE!H11,IF(LangNo=4,FR!H11,IF(LangNo=5,NR!H11,IF(LangNo=6,SP!H11,))))))","v":0},{"$f":"IF(LangNo=1,NL!I11,IF(LangNo=2,EN!I11,IF(LangNo=3,DE!I11,IF(LangNo=4,FR!I11,IF(LangNo=5,NR!I11,IF(LangNo=6,SP!I11,))))))","v":0},{"$f":"'Briza 22 & 26'!K11","v":{"v":19.415087041495514,"d":"19.4"}},{"$nulls":10},{"$f":"IF(UnitsNo=1,$E13,IF(UnitsNo=2,($E13-Celc2)/Celc1))","v":{"v":0,"d":"0.00"}},{"$nulls":12},"Sladká voda",{"$nulls":25},{"$f":"IF(UnitsNo=1,$K13,IF(UnitsNo=2,($K13-Celc2)/Celc1))","v":{"v":19.415087041495514,"d":"19.42"}},{"$nulls":86},"BRIZA 22",{"$nulls":3},"BRIZA 26",{"$nulls":4},"BRIZA 22",{"$nulls":3},"BRIZA 26"]
[{"$nulls":4},{"v":0.5,"d":"50%"},{"$f":"'Briza 22 & 26'!$E$11","v":{"v":0,"d":"0.0"}},{"$f":"IF(LangNo=1,NL!F11,IF(LangNo=2,EN!F11,IF(LangNo=3,DE!F11,IF(LangNo=4,FR!F11,IF(LangNo=5,NR!F11,IF(LangNo=6,SP!F11,IF(LangNo=7,SW!F11,IF(LangNo=8,TS!F11,IF(LangNo=9,ExtraTaal1!F11,IF(LangNo=10,ExtraTaal2!F11,IF(LangNo=11,ExtraTaal3!F11,)))))))))))","v":"Relative humidity"},{"$nulls":3},{"$f":"'Briza 22 & 26'!K12","v":{"v":0.5,"d":"50%"}},{"$nulls":17},"BRIZA 22",{"$nulls":15},"BRIZA 26"]
[{"$nulls":3},{"$f":"IF(UnitsNo=1,1,IF(UnitsNo=2,3.412141633))","v":{"v":1,"d":"1.0000"}},{"$f":"IF(UnitsNo=1,1,IF(UnitsNo=2,0.004403))","v":{"v":1,"d":"1.0000"}},{"$f":"IF(UnitsNo=1,1,IF(UnitsNo=2,0.334562))","v":{"v":1,"d":"1.0000"}},null,{"$f":"IF(UnitsNo=1,5,9)","v":{"v":5,"d":"5.0000"}},null,null,{"$f":"IF(UnitsNo=2,1,IF(UnitsNo=1,0.588575))","v":{"v":0.588575,"d":"0.5886"}},{"$f":"IF(UnitsNo=1,0.000334444444444444,IF(UnitsNo=2,0.000568224721372))","v":0.000334444444444444},{"$f":"IF(UnitsNo=1,1,IF(UnitsNo=2,196.85039370079))","v":{"v":1,"d":"1.0000"}},{"$f":"IF(UnitsNo=1,1,IF(UnitsNo=2,0.588575))","v":{"v":1,"d":"1.0000"}},{"$f":"IF(UnitsNo=1,1,IF(UnitsNo=2,1.8))","v":{"v":1,"d":"1.0000"}},null,{"$f":"IF(UnitsNo=1,0,IF(UnitsNo=2,32))","v":{"v":0,"d":"0.0000"}},{"$f":"IF(UnitsNo=1,1,IF(UnitsNo=2,0.393700787))","v":1},{"$nulls":4},{"v":0.875,"d":"87.5%"},"CALC",{"$nulls":4},"115V",{"$nulls":3},"115V-HP",{"$nulls":3},"230V",{"$nulls":3},"230V-HP",{"$nulls":3},"115V",{"$nulls":3},"115V-HP",{"$nulls":3},"230V",{"$nulls":3},"230V-HP",{"$nulls":5},"CALC",null,null,"BRIZA 22",{"$nulls":5},"BRIZA 26",{"$nulls":5},"CALC",{"$nulls":13},"115V",{"$nulls":13},"115V-HP",{"$nulls":13},"230V",{"$nulls":13},"230V-HP",{"$nulls":13},"115V","115HP","230V","230HP","115V","115HP","230V","230HP","CALC","115V","115HP","230V","230HP","115V","115HP","230V","230HP"]
[null,{"$f":"IF(LangNo=1,NL!A14,IF(LangNo=2,EN!A14,IF(LangNo=3,DE!A14,IF(LangNo=4,FR!A14,IF(LangNo=5,NR!A14,IF(LangNo=6,SP!A14,IF(LangNo=7,SW!A14,IF(LangNo=8,TS!A14,IF(LangNo=9,ExtraTaal1!A14,IF(LangNo=10,ExtraTaal2!A14,IF(LangNo=11,ExtraTaal3!A14,)))))))))))","v":"Speed level"},{"$f":"IF(LangNo=1,NL!B14,IF(LangNo=2,EN!B14,IF(LangNo=3,DE!B14,IF(LangNo=4,FR!B14,IF(LangNo=5,NR!B14,IF(LangNo=6,SP!B14,IF(LangNo=7,SW!B14,IF(LangNo=8,TS!B14,IF(LangNo=9,ExtraTaal1!B14,IF(LangNo=10,ExtraTaal2!B14,IF(LangNo=11,ExtraTaal3!B14,)))))))))))","v":"Control voltage [V]"},{"$f":"IF(LangNo=1,NL!C14,IF(LangNo=2,EN!C14,IF(LangNo=3,DE!C14,IF(LangNo=4,FR!C14,IF(LangNo=5,NR!C14,IF(LangNo=6,SP!C14,IF(LangNo=7,SW!C14,IF(LangNo=8,TS!C14,IF(LangNo=9,ExtraTaal1!C14,IF(LangNo=10,ExtraTaal2!C14,IF(LangNo=11,ExtraTaal3!C14,)))))))))))","v":"Heat output * 65/55/20 [W]"},{"$f":"IF(LangNo=1,NL!D14,IF(LangNo=2,EN!D14,IF(LangNo=3,DE!D14,IF(LangNo=4,FR!D14,IF(LangNo=5,NR!D14,IF(LangNo=6,SP!D14,IF(LangNo=7,SW!D14,IF(LangNo=8,TS!D14,IF(LangNo=9,ExtraTaal1!D14,IF(LangNo=10,ExtraTaal2!D14,IF(LangNo=11,ExtraTaal3!D14,)))))))))))","v":"Water flowrate, heating [l/h]"},{"$f":"IF(LangNo=1,NL!E14,IF(LangNo=2,EN!E14,IF(LangNo=3,DE!E14,IF(LangNo=4,FR!E14,IF(LangNo=5,NR!E14,IF(LangNo=6,SP!E14,IF(LangNo=7,SW!E14,IF(LangNo=8,TS!E14,IF(LangNo=9,ExtraTaal1!E14,IF(LangNo=10,ExtraTaal2!E14,IF(LangNo=11,ExtraTaal3!E14,)))))))))))","v":"Water side pressure loss [kPa]"},{"$f":"IF(LangNo=1,NL!F14,IF(LangNo=2,EN!F14,IF(LangNo=3,DE!F14,IF(LangNo=4,FR!F14,IF(LangNo=5,NR!F14,IF(LangNo=6,SP!F14,IF(LangNo=7,SW!F14,IF(LangNo=8,TS!F14,IF(LangNo=9,ExtraTaal1!F14,IF(LangNo=10,ExtraTaal2!F14,IF(LangNo=11,ExtraTaal3!F14,)))))))))))","v":"Sens. cooling capacity * 16/18/27 [W]"},{"$f":"IF(LangNo=1,NL!G14,IF(LangNo=2,EN!G14,IF(LangNo=3,DE!G14,IF(LangNo=4,FR!G14,IF(LangNo=5,NR!G14,IF(LangNo=6,SP!G14,IF(LangNo=7,SW!G14,IF(LangNo=8,TS!G14,IF(LangNo=9,ExtraTaal1!G14,IF(LangNo=10,ExtraTaal2!G14,IF(LangNo=11,ExtraTaal3!G14,)))))))))))","v":"Tot. cooling capacity 16/18/27 [W]"},{"$f":"IF(LangNo=1,NL!H14,IF(LangNo=2,EN!H14,IF(LangNo=3,DE!H14,IF(LangNo=4,FR!H14,IF(LangNo=5,NR!H14,IF(LangNo=6,SP!H14,IF(LangNo=7,SW!H14,IF(LangNo=8,TS!H14,IF(LangNo=9,ExtraTaal1!H14,IF(LangNo=10,ExtraTaal2!H14,IF(LangNo=11,ExtraTaal3!H14,)))))))))))","v":"Water flowrate, cooling [l/h]"},{"$f":"IF(LangNo=1,NL!I14,IF(LangNo=2,EN!I14,IF(LangNo=3,DE!I14,IF(LangNo=4,FR!I14,IF(LangNo=5,NR!I14,IF(LangNo=6,SP!I14,IF(LangNo=7,SW!I14,IF(LangNo=8,TS!I14,IF(LangNo=9,ExtraTaal1!I14,IF(LangNo=10,ExtraTaal2!I14,IF(LangNo=11,ExtraTaal3!I14,)))))))))))","v":"Water side pressure loss [kPa]"},{"$f":"IF(LangNo=1,NL!J14,IF(LangNo=2,EN!J14,IF(LangNo=3,DE!J14,IF(LangNo=4,FR!J14,IF(LangNo=5,NR!J14,IF(LangNo=6,SP!J14,IF(LangNo=7,SW!J14,IF(LangNo=8,TS!J14,IF(LangNo=9,ExtraTaal1!J14,IF(LangNo=10,ExtraTaal2!J14,IF(LangNo=11,ExtraTaal3!J14,)))))))))))","v":"Sound pressure *** [dB(A)]"},{"$f":"IF(LangNo=1,NL!K14,IF(LangNo=2,EN!K14,IF(LangNo=3,DE!K14,IF(LangNo=4,FR!K14,IF(LangNo=5,NR!K14,IF(LangNo=6,SP!K14,IF(LangNo=7,SW!K14,IF(LangNo=8,TS!K14,IF(LangNo=9,ExtraTaal1!K14,IF(LangNo=10,ExtraTaal2!K14,IF(LangNo=11,ExtraTaal3!K14,)))))))))))","v":"Sound power ** [dB(A)]"},{"$f":"IF(LangNo=1,NL!L14,IF(LangNo=2,EN!L14,IF(LangNo=3,DE!L14,IF(LangNo=4,FR!L14,IF(LangNo=5,NR!L14,IF(LangNo=6,SP!L14,IF(LangNo=7,SW!L14,IF(LangNo=8,TS!L14,IF(LangNo=9,ExtraTaal1!L14,IF(LangNo=10,ExtraTaal2!L14,IF(LangNo=11,ExtraTaal3!L14,)))))))))))","v":"Electrical power [W]"},{"$f":"IF(LangNo=1,NL!M14,IF(LangNo=2,EN!M14,IF(LangNo=3,DE!M14,IF(LangNo=4,FR!M14,IF(LangNo=5,NR!M14,IF(LangNo=6,SP!M14,IF(LangNo=7,SW!M14,IF(LangNo=8,TS!M14,IF(LangNo=9,ExtraTaal1!M14,IF(LangNo=10,ExtraTaal2!M14,IF(LangNo=11,ExtraTaal3!M14,)))))))))))","v":"Air flowrate [m³/h]"},{"$f":"IF(LangNo=1,NL!N14,IF(LangNo=2,EN!N14,IF(LangNo=3,DE!N14,IF(LangNo=4,FR!N14,IF(LangNo=5,NR!N14,IF(LangNo=6,SP!N14,IF(LangNo=7,SW!N14,IF(LangNo=8,TS!N14,IF(LangNo=9,ExtraTaal1!N14,IF(LangNo=10,ExtraTaal2!N14,IF(LangNo=11,ExtraTaal3!N14,)))))))))))","v":"Face velocity [m/s]"},{"$f":"IF(LangNo=1,NL!O14,IF(LangNo=2,EN!O14,IF(LangNo=3,DE!O14,IF(LangNo=4,FR!O14,IF(LangNo=5,NR!O14,IF(LangNo=6,SP!O14,IF(LangNo=7,SW!O14,IF(LangNo=8,TS!O14,IF(LangNo=9,ExtraTaal1!O14,IF(LangNo=10,ExtraTaal2!O14,IF(LangNo=11,ExtraTaal3!O14,)))))))))))","v":"Air exhaust temp. heating [°C]"},{"$f":"IF(LangNo=1,NL!P14,IF(LangNo=2,EN!P14,IF(LangNo=3,DE!P14,IF(LangNo=4,FR!P14,IF(LangNo=5,NR!P14,IF(LangNo=6,SP!P14,IF(LangNo=7,SW!P14,IF(LangNo=8,TS!P14,IF(LangNo=9,ExtraTaal1!P14,IF(LangNo=10,ExtraTaal2!P14,IF(LangNo=11,ExtraTaal3!P14,)))))))))))","v":"Air exhaust temp. heating (wet bulb) [°C]"},{"$f":"IF(LangNo=1,NL!Q14,IF(LangNo=2,EN!Q14,IF(LangNo=3,DE!Q14,IF(LangNo=4,FR!Q14,IF(LangNo=5,NR!Q14,IF(LangNo=6,SP!Q14,IF(LangNo=7,SW!Q14,IF(LangNo=8,TS!Q14,IF(LangNo=9,ExtraTaal1!Q14,IF(LangNo=10,ExtraTaal2!Q14,IF(LangNo=11,ExtraTaal3!Q14,)))))))))))","v":"Air exhaust temp. cooling (dry bulb) [°C]"},{"$f":"IF(LangNo=1,NL!R14,IF(LangNo=2,EN!R14,IF(LangNo=3,DE!R14,IF(LangNo=4,FR!R14,IF(LangNo=5,NR!R14,IF(LangNo=6,SP!R14,IF(LangNo=7,SW!R14,IF(LangNo=8,TS!R14,IF(LangNo=9,ExtraTaal1!R14,IF(LangNo=10,ExtraTaal2!R14,IF(LangNo=11,ExtraTaal3!R14,)))))))))))","v":"Air exhaust temp. cooling (wet bulb) [°C]"},{"$f":"IF(LangNo=1,NL!S14,IF(LangNo=2,EN!S14,IF(LangNo=3,DE!S14,IF(LangNo=4,FR!S14,IF(LangNo=5,NR!S14,IF(LangNo=6,SP!S14,IF(LangNo=7,SW!S14,IF(LangNo=8,TS!S14,IF(LangNo=9,ExtraTaal1!S14,IF(LangNo=10,ExtraTaal2!S14,IF(LangNo=11,ExtraTaal3!S14,)))))))))))&\" ****\"","v":"Rel. humid. cooled air [%] ****"},{"$f":"IF(LangNo=1,NL!T14,IF(LangNo=2,EN!T14,IF(LangNo=3,DE!T14,IF(LangNo=4,FR!T14,IF(LangNo=5,NR!T14,IF(LangNo=6,SP!T14,IF(LangNo=7,SW!T14,IF(LangNo=8,TS!T14,IF(LangNo=9,ExtraTaal1!T14,IF(LangNo=10,ExtraTaal2!T14,IF(LangNo=11,ExtraTaal3!T14,)))))))))))","v":"fan rotation frequency [revolutions/minute]"},{"$f":"IF(LangNo=1,NL!U14,IF(LangNo=2,EN!U14,IF(LangNo=3,DE!U14,IF(LangNo=4,FR!U14,IF(LangNo=5,NR!U14,IF(LangNo=6,SP!U14,IF(LangNo=7,SW!U14,IF(LangNo=8,TS!U14,IF(LangNo=9,ExtraTaal1!U14,IF(LangNo=10,ExtraTaal2!U14,IF(LangNo=11,ExtraTaal3!U14,)))))))))))&\" [J/l]\"","v":"Specific fan power [J/l]"},{"v":0.05,"d":"5%"},"Heating 2p","Cooling","Heating 4p","n-calc","p-limit","Heating 2p","Cooling","Heating 4p","p-limit","Heating 2p","Cooling","Heating 4p","p-limit","Heating 2p","Cooling","Heating 4p","p-limit","Heating 2p","Cooling","Heating 4p","p-limit","Heating 2p","Cooling","Heating 4p","p-limit","Heating 2p","Cooling","Heating 4p","p-limit","Heating 2p","Cooling","Heating 4p","p-limit","Heating 2p","Cooling","Heating 4p","p-limit",null,null,"Q_h_cal","Q_c_cal","dP_H2O","Q_h_cal","Q_c_cal","dP_H20","Q_h_cal","Q_c_cal","dP_H2O","Q_h_cal","Q_c_cal","dP_H20","Q_h_cal","Q_c_cal","dP_H2O","Ventilatorcurve",{"$nulls":5},"Powercurve",{"$nulls":4},"Toerental",null,null,"Ventilatorcurve","Ventilatorcurve",{"$nulls":4},"Powercurve",{"$nulls":4},"Toerental",null,null,"Ventilatorcurve","Ventilatorcurve",{"$nulls":4},"Powercurve",{"$nulls":4},"Toerental",null,null,"Ventilatorcurve","Ventilatorcurve",{"$nulls":4},"Powercurve",{"$nulls":4},"Toerental",null,null,"Ventilatorcurve",{"$nulls":5},"Powercurve",{"$nulls":4},"Toerental",null,null,"Geluidsvermogen [dB(A)]","Geluidsvermogen [dB(A)]","Geluidsvermogen [dB(A)]","Geluidsvermogen [dB(A)]","Geluidsvermogen [dB(A)]","Geluidsvermogen [dB(A)]","Geluidsvermogen [dB(A)]","Geluidsvermogen [dB(A)]","Uitblaastemp,WW koeling [°C]","Uitblaastemp,WW koeling [°C]","Uitblaastemp,WW koeling [°C]","Uitblaastemp,WW koeling [°C]","Uitblaastemp,WW koeling [°C]","Uitblaastemp,WW koeling [°C]","Uitblaastemp,WW koeling [°C]","Uitblaastemp,WW koeling [°C]","Uitblaastemp,WW koeling [°C]",null,"Factor Standard BR22","Factor HP BR22","Factor HP BR26","V% (werkpunt)","Standard,max (luchtdebiet)","HP,max (luchtdebiet)","C% (kantelpunt)","V (werkdebiet)","V%-C% (werkpunt verschil)","V,max-C% (maximaal verschil)","Procentueel verschil","Standaard exhaust temp","HP-22 exhaust temp ifv regime","Verschil HP-22","HP-26 exhaust temp ifv regime","Verschil HP-26","Nieuwe exhaust temp HP-22","Nieuwe exhaust temp HP-26",null,"Tkantel",null,"Diff Qc",null,"Pvs,heat,in","Pvs,heat,out","Pv,heat,in","Pv,heat,out","X,heat,in","X,heat,out","h,heat,in","h,heat,out","RH,heat,out",null,"Pvs,cool,in","Pvs,cool,out","Pv,cool,in","Pv,cool,out","Pv,cool,out,BLOW","X,cool,in","X,cool,out","X,cool,out,BLOW","h,cool,in","h,cool,out","h,cool,out,BLOW","T,wb,cool,in","T,wb,cool,in","old cooling","luchtdebiet op 0 PA","sensible cooling","Uitblaastemp,WW koeling [°C]","Uitblaastemp,WW koeling [°C]","total cooling","percentage","new cooling with dp","Factor Standard BR22","Factor HP BR22","Factor HP BR26","V% (werkpunt)","Standard,max (luchtdebiet)","HP,max (luchtdebiet)","C% (kantelpunt)","V (werkdebiet)","V%-C% (werkpunt verschil)","V,max-C% (maximaal verschil)","Procentueel verschil","Standaard exhaust temp","HP-22 exhaust temp ifv regime","Verschil HP-22","HP-26 exhaust temp ifv regime","Verschil HP-26","Nieuwe exhaust temp HP-22","Nieuwe exhaust temp HP-26"]
[null,{"$f":"IF(LangNo=1,NL!A15,IF(LangNo=2,EN!A15,IF(LangNo=3,DE!A15,IF(LangNo=4,FR!A15,IF(LangNo=5,NR!A15,IF(LangNo=6,SP!A15,IF(LangNo=7,SW!A15,IF(LangNo=8,TS!A15,IF(LangNo=9,ExtraTaal1!A15,IF(LangNo=10,ExtraTaal2!A15,IF(LangNo=11,ExtraTaal3!A15,)))))))))))","v":"Briza 22 (230V) height 54,5 cm, width 22 cm, length 55 cm (Type 02)"},{"$f":"IF(LangNo=1,NL!B15,IF(LangNo=2,EN!B15,IF(LangNo=3,DE!B15,IF(LangNo=4,FR!B15,IF(LangNo=5,NR!B15,IF(LangNo=6,SP!B15,IF(LangNo=7,SW!B15,IF(LangNo=8,TS!B15,IF(LangNo=9,ExtraTaal1!B15,IF(LangNo=10,ExtraTaal2!B15,IF(LangNo=11,ExtraTaal3!B15,)))))))))))","v":0},{"$f":"IF(LangNo=1,NL!C15,IF(LangNo=2,EN!C15,IF(LangNo=3,DE!C15,IF(LangNo=4,FR!C15,IF(LangNo=5,NR!C15,IF(LangNo=6,SP!C15,IF(LangNo=7,SW!C15,IF(LangNo=8,TS!C15,IF(LangNo=9,ExtraTaal1!C15,IF(LangNo=10,ExtraTaal2!C15,IF(LangNo=11,ExtraTaal3!C15,)))))))))))","v":0},{"$f":"IF(LangNo=1,NL!D15,IF(LangNo=2,EN!D15,IF(LangNo=3,DE!D15,IF(LangNo=4,FR!D15,IF(LangNo=5,NR!D15,IF(LangNo=6,SP!D15,IF(LangNo=7,SW!D15,IF(LangNo=8,TS!D15,IF(LangNo=9,ExtraTaal1!D15,IF(LangNo=10,ExtraTaal2!D15,IF(LangNo=11,ExtraTaal3!D15,)))))))))))","v":0},{"$f":"IF(LangNo=1,NL!E15,IF(LangNo=2,EN!E15,IF(LangNo=3,DE!E15,IF(LangNo=4,FR!E15,IF(LangNo=5,NR!E15,IF(LangNo=6,SP!E15,IF(LangNo=7,SW!E15,IF(LangNo=8,TS!E15,IF(LangNo=9,ExtraTaal1!E15,IF(LangNo=10,ExtraTaal2!E15,IF(LangNo=11,ExtraTaal3!E15,)))))))))))","v":0},{"$f":"IF(LangNo=1,NL!F15,IF(LangNo=2,EN!F15,IF(LangNo=3,DE!F15,IF(LangNo=4,FR!F15,IF(LangNo=5,NR!F15,IF(LangNo=6,SP!F15,IF(LangNo=7,SW!F15,IF(LangNo=8,TS!F15,IF(LangNo=9,ExtraTaal1!F15,IF(LangNo=10,ExtraTaal2!F15,IF(LangNo=11,ExtraTaal3!F15,)))))))))))","v":0},{"$f":"IF(LangNo=1,NL!G15,IF(LangNo=2,EN!G15,IF(LangNo=3,DE!G15,IF(LangNo=4,FR!G15,IF(LangNo=5,NR!G15,IF(LangNo=6,SP!G15,IF(LangNo=7,SW!G15,IF(LangNo=8,TS!G15,IF(LangNo=9,ExtraTaal1!G15,IF(LangNo=10,ExtraTaal2!G15,IF(LangNo=11,ExtraTaal3!G15,)))))))))))","v":0},{"$f":"IF(LangNo=1,NL!H15,IF(LangNo=2,EN!H15,IF(LangNo=3,DE!H15,IF(LangNo=4,FR!H15,IF(LangNo=5,NR!H15,IF(LangNo=6,SP!H15,IF(LangNo=7,SW!H15,IF(LangNo=8,TS!H15,IF(LangNo=9,ExtraTaal1!H15,IF(LangNo=10,ExtraTaal2!H15,IF(LangNo=11,ExtraTaal3!H15,)))))))))))","v":0},{"$f":"IF(LangNo=1,NL!I15,IF(LangNo=2,EN!I15,IF(LangNo=3,DE!I15,IF(LangNo=4,FR!I15,IF(LangNo=5,NR!I15,IF(LangNo=6,SP!I15,IF(LangNo=7,SW!I15,IF(LangNo=8,TS!I15,IF(LangNo=9,ExtraTaal1!I15,IF(LangNo=10,ExtraTaal2!I15,IF(LangNo=11,ExtraTaal3!I15,)))))))))))","v":0},{"$f":"IF(LangNo=1,NL!J15,IF(LangNo=2,EN!J15,IF(LangNo=3,DE!J15,IF(LangNo=4,FR!J15,IF(LangNo=5,NR!J15,IF(LangNo=6,SP!J15,IF(LangNo=7,SW!J15,IF(LangNo=8,TS!J15,IF(LangNo=9,ExtraTaal1!J15,IF(LangNo=10,ExtraTaal2!J15,IF(LangNo=11,ExtraTaal3!J15,)))))))))))","v":0},{"$f":"IF(LangNo=1,NL!K15,IF(LangNo=2,EN!K15,IF(LangNo=3,DE!K15,IF(LangNo=4,FR!K15,IF(LangNo=5,NR!K15,IF(LangNo=6,SP!K15,IF(LangNo=7,SW!K15,IF(LangNo=8,TS!K15,IF(LangNo=9,ExtraTaal1!K15,IF(LangNo=10,ExtraTaal2!K15,IF(LangNo=11,ExtraTaal3!K15,)))))))))))","v":0},{"$f":"IF(LangNo=1,NL!L15,IF(LangNo=2,EN!L15,IF(LangNo=3,DE!L15,IF(LangNo=4,FR!L15,IF(LangNo=5,NR!L15,IF(LangNo=6,SP!L15,IF(LangNo=7,SW!L15,IF(LangNo=8,TS!L15,IF(LangNo=9,ExtraTaal1!L15,IF(LangNo=10,ExtraTaal2!L15,IF(LangNo=11,ExtraTaal3!L15,)))))))))))","v":0},{"$nulls":9},"W/cube",{"$nulls":3},{"$f":"IF($BK$17=\"11\",X17,IF($BK$17=\"21\",Z17,IF($BK$17=\"12\",X17,IF($BK$17=\"22\",Z17,IF($BK$17=\"13\",X17,IF($BK$17=\"23\",Z17,IF($BK$17=\"14\",X17,IF($BK$17=\"24\",Z17,IF($BK$17=\"31\",X17,IF($BK$17=\"41\",Z17,IF($BK$17=\"32\",X17,IF($BK$17=\"42\",Z17,IF($BK$17=\"33\",X17,IF($BK$17=\"43\",Z17,IF($BK$17=\"34\",X17,IF($BK$17=\"44\",Z17,))))))))))))))))","v":0},{"$f":"IF($BK$17=\"11\",AF17,IF($BK$17=\"21\",AF17,IF($BK$17=\"12\",AN17,IF($BK$17=\"22\",AN17,IF($BK$17=\"13\",AR17,IF($BK$17=\"23\",AR17,IF($BK$17=\"14\",AJ17,IF($BK$17=\"24\",AJ17,IF($BK$17=\"31\",AV17,IF($BK$17=\"41\",AV17,IF($BK$17=\"32\",BD17,IF($BK$17=\"42\",BD17,IF($BK$17=\"33\",BH17,IF($BK$17=\"43\",BH17,IF($BK$17=\"34\",AZ17,IF($BK$17=\"44\",AZ17,))))))))))))))))","v":"m³/h"},"n-value","n-value","n-value","m³/h","n-value","n-value","n-value","m³/h","n-value","n-value","n-value","m³/h","n-value","n-value","n-value","m³/h","n-value","n-value","n-value","m³/h","n-value","n-value","n-value","m³/h","n-value","n-value","n-value","m³/h","n-value","n-value","n-value","m³/h",null,null,{"$f":"CONCATENATE(AK5,AL5)","v":"12"},null,null,"Briza 22 2P",null,null,"Briza 22 4P",null,null,"Briza 26 2P",null,null,"Briza 26 4P",null,null,"x5","x4","x3","x2","x1","x0","w4","w3","w2","w1","w0","z2","z1","z0","x5","x4","x3","x2","x1","x0","w4","w3","w2","w1","w0","z2","z1","z0","x5","x4","x3","x2","x1","x0","w4","w3","w2","w1","w0","z2","z1","z0","x5","x4","x3","x2","x1","x0","w4","w3","w2","w1","w0","z2","z1","z0","x5","x4","x3","x2","x1","x0","w4","w3","w2","w1","w0","z2","z1","z0","T02",{"$nulls":8},{"$f":"+ER17","v":"T02"},{"$nulls":57},"Standaard","HP",{"$nulls":3},"T02"]
[null,{"v":0.2,"d":"20%"},2,{"$f":"IF(Geg_dP<AB18,((($BK$18*($N18/Cubics)^4+$BK$19*($N18/Cubics)^3+$BK$20*($N18/Cubics)^2+$BK$21*($N18/Cubics)^1+$BK$22)*(CF_Regime_Heat_noExp^$AA18)))*CF_Addit*Watts*CF_Altit,Lim_dP)","v":{"v":1758.4563964140746,"d":"1758"}},{"$f":"IF(Geg_dP<$AB18,ROUND((($D18/Watts)/((Tv_heat-Tr_heat)*1.163))*FlowH2O,IF(UnitsNo=1,0,IF(UnitsNo=2,2))),\"\")","v":151},{"$f":"IF(Geg_dP<$AB18,IF((($BM$18*(E18/FlowH2O)^$BM$19))*kPa>0,(($BM$18*(E18/FlowH2O)^$BM$19))*kPa,0),\"\")","v":{"v":0.5910093296337543,"d":"0.6"}},{"$f":"IF(Geg_dP<$AB18,((($BL$18*($N18/Cubics)^4+$BL$19*($N18/Cubics)^3+$BL$20*($N18/Cubics)^2+$BL$21*($N18/Cubics)^1+$BL$22)*((CF_Regime_Cool_noExp)^$Y18)))*CF_Addit*Watts*CF_Altit,Lim_dP)","v":{"v":366.9946962996415,"d":"367"}},{"$f":"IF(Geg_dP<$AB18,((G18/Watts)/(IF((237.3*LN((RH*EXP(17.27*(Tl_cool/(Tl_cool+237.3))))))/(17.27-LN((RH*EXP(17.27*(Tl_cool/(Tl_cool+237.3))))))<EZ18,1,IF(1/(1+((2258*((0.622/((101325/(1*611*EXP(17.27*(EZ18/(EZ18+237.3))))))-1)*1000-(0.622/((101325/(RH*611*EXP(17.27*(Tl_cool/(Tl_cool+237.3))))))-1)*1000))/(1005*(Tavg_cold-Tl_cool))))>1,1,1/(1+((2258*((0.622/((101325/(1*611*EXP(17.27*(EZ18/(EZ18+237.3))))))-1)*1000-(0.622/((101325/(RH*611*EXP(17.27*(Tl_cool/(Tl_cool+237.3))))))-1)*1000))/(1005*(Tavg_cold-Tl_cool))))))))*Watts,\"\")","v":{"v":366.9946962996415,"d":"367"}},{"$f":"IF(Geg_dP<AB18,ROUND(((H18/Watts)/((Tr_cool-Tv_cool)*1.163))*FlowH2O,IF(UnitsNo=1,0,IF(UnitsNo=2,2))),\"\")","v":158},{"$f":"IF(Geg_dP<$AB18,IF((($BM$21*(I18/Watts)^$BM$22))*kPa>0,(($BM$21*(I18/FlowH2O)^$BM$22))*kPa,0),\"\")","v":{"v":0.6423283007940608,"d":"0.6"}},{"$f":"IF(Geg_dP<AB18,IF($L18-8<0,0,$L18-8),\"\")","v":25.5},{"$f":"IF(Geg_dP<$AB18,IF(CalcNo=\"12\",$ET18,IF(CalcNo=\"22\",$ET18,IF(CalcNo=\"13\",$EU18,IF(CalcNo=\"23\",$EU18,IF(CalcNo=\"11\",$ER18,IF(CalcNo=\"21\",$ER18,IF(CalcNo=\"14\",$ES18,IF(CalcNo=\"24\",$ES18,IF(CalcNo=\"32\",$EX18,IF(CalcNo=\"42\",$EX18,IF(CalcNo=\"33\",$EY18,IF(CalcNo=\"43\",$EY18,IF(CalcNo=\"31\",$EV18,IF(CalcNo=\"41\",$EV18,IF(CalcNo=\"34\",$EW18,IF(CalcNo=\"44\",$EW18,)))))))))))))))),\"\")","v":33.5},{"$f":"IF(Geg_dP<$AB18,($CF18*(($N18/Cubics)^4))+($CG18*(($N18/Cubics)^3))+($CH18*(($N18/Cubics)^2))+($CI18*($N18/Cubics))+$CJ18,\"\")","v":{"v":3.664947735102877,"d":"3.7"}},{"$f":"IF(Geg_dP<$AB18,(BZ18*Geg_dP^5+CA18*Geg_dP^4+CB18*Geg_dP^3+CC18*Geg_dP^2+CD18*Geg_dP+CE18)*CF_Case*Cubics,\"\")","v":{"v":133.768339,"d":"134"}},{"$f":"IF(Geg_dP<$AB18,(($N18/Cubics)/3600)/(($BJ$23/100)*($BP$23/100))*FeetMins,\"\")","v":{"v":0.3070898507805325,"d":"0.31"}},{"$f":"IF(Geg_dP<$AB18,((($D18/Watts)/(((p_atm*0.028964)/(8.31447*(20+273.15)))*(($N18/3600)/Cubics)*(1005+1870*((0.622)/(((p_atm)/($E$14*pvs_heat_in))-1)))))+Tl_heat)*Celc1+Celc2,\"\")","v":{"v":58.58638182466632,"d":"58.6"}},{"$f":"IF(Geg_dP<$AB18,(27.8*LN(($GN18+36)/45.5))*Celc1+Celc2,\"\")","v":{"v":25.483385849371835,"d":"25.5"}},{"$f":"IF(Geg_dP<$AB18,(Tl_cool-(($G18/Watts)/(1006*$N18*kgss)))*Celc1+Celc2,\"\")","v":{"v":18.845741281251485,"d":"18.8"}},{"$f":"IF(Geg_dP<$AB18,IF((27.8*LN(($HA18+36)/45.5))*Celc1+Celc2>R18,R18,(27.8*LN(($HA18+36)/45.5))*Celc1+Celc2),\"\")","v":{"v":16.774904168824342,"d":"16.8"}},{"$f":"IF(Geg_dP<$AB18,IF($H18>$G18,1,IF(($GT18/$GR18)<0,0,$GT18/$GR18)),\"\")","v":{"v":0.8207400255232986,"d":"82%"}},{"$f":"IF(Geg_dP<$AB18,$CK18*($N18/Cubics)^2+$CL18*($N18/Cubics)^1+$CM18,\"\")","v":{"v":480.7675172425503,"d":"481"}},{"$f":"M18/((N18/Cubics)/3.6)","v":{"v":0.09863179841360187,"d":"0.10"}},{"$f":"(G18/Watts)/(N18/Cubics)","v":{"v":2.7435094062104,"d":"2.744"}},{"$f":"IF($BK$17=\"11\",AC18,IF($BK$17=\"21\",AC18,IF($BK$17=\"12\",AK18,IF($BK$17=\"22\",AK18,IF($BK$17=\"13\",AO18,IF($BK$17=\"23\",AO18,IF($BK$17=\"14\",AG18,IF($BK$17=\"24\",AG18,IF($BK$17=\"31\",AS18,IF($BK$17=\"41\",AS18,IF($BK$17=\"32\",BA18,IF($BK$17=\"42\",BA18,IF($BK$17=\"33\",BE18,IF($BK$17=\"43\",BE18,IF($BK$17=\"34\",AW18,IF($BK$17=\"44\",AW18,))))))))))))))))","v":1.02106},{"$f":"IF($BK$17=\"11\",AD18,IF($BK$17=\"21\",AD18,IF($BK$17=\"12\",AL18,IF($BK$17=\"22\",AL18,IF($BK$17=\"13\",AP18,IF($BK$17=\"23\",AP18,IF($BK$17=\"14\",AH18,IF($BK$17=\"24\",AH18,IF($BK$17=\"31\",AT18,IF($BK$17=\"41\",AT18,IF($BK$17=\"32\",BB18,IF($BK$17=\"42\",BB18,IF($BK$17=\"33\",BF18,IF($BK$17=\"43\",BF18,IF($BK$17=\"34\",AX18,IF($BK$17=\"44\",AX18,))))))))))))))))","v":1.10028},1.13249,{"$f":"IF($BK$17=\"11\",X18,IF($BK$17=\"21\",Z18,IF($BK$17=\"12\",X18,IF($BK$17=\"22\",Z18,IF($BK$17=\"13\",X18,IF($BK$17=\"23\",Z18,IF($BK$17=\"14\",X18,IF($BK$17=\"24\",Z18,IF($BK$17=\"31\",X18,IF($BK$17=\"41\",Z18,IF($BK$17=\"32\",X18,IF($BK$17=\"42\",Z18,IF($BK$17=\"33\",X18,IF($BK$17=\"43\",Z18,IF($BK$17=\"34\",X18,IF($BK$17=\"44\",Z18,))))))))))))))))","v":1.02106},{"$f":"IF($BK$17=\"11\",AF18,IF($BK$17=\"21\",AF18,IF($BK$17=\"12\",AN18,IF($BK$17=\"22\",AN18,IF($BK$17=\"13\",AR18,IF($BK$17=\"23\",AR18,IF($BK$17=\"14\",AJ18,IF($BK$17=\"24\",AJ18,IF($BK$17=\"31\",AV18,IF($BK$17=\"41\",AV18,IF($BK$17=\"32\",BD18,IF($BK$17=\"42\",BD18,IF($BK$17=\"33\",BH18,IF($BK$17=\"43\",BH18,IF($BK$17=\"34\",AZ18,IF($BK$17=\"44\",AZ18,))))))))))))))))","v":11},1.02106,1.10028,1.13249,{"v":10,"d":"10.00"},1.02106,1.10028,1.13249,{"v":11,"d":"11.00"},1.02106,1.10028,1.13249,{"v":11,"d":"11.00"},{"$nulls":3},1000,{"$nulls":3},1000,{"$nulls":3},1000,{"$nulls":3},1000,{"$nulls":3},1000,null,null,{"$f":"IF($BK$17=\"11\",BN18,IF($BK$17=\"21\",BQ18,IF($BK$17=\"12\",BN18,IF($BK$17=\"22\",BQ18,IF($BK$17=\"13\",0,IF($BK$17=\"23\",0,IF($BK$17=\"14\",BN18,IF($BK$17=\"24\",BQ18,IF($BK$17=\"31\",BT18,IF($BK$17=\"41\",BW18,IF($BK$17=\"32\",BT18,IF($BK$17=\"42\",BW18,IF($BK$17=\"33\",BT18,IF($BK$17=\"43\",BW18,IF($BK$17=\"34\",BT18,IF($BK$17=\"44\",BW18,))))))))))))))))","v":{"v":0,"d":"0.00E+00"}},{"v":0,"d":"0.00E+00"},{"v":5.856967585387631E-5,"d":"5.86E-05"},null,null,{"$f":"BP21","v":{"v":5.856967585387631E-5,"d":"5.86E-05"}},null,{"$f":"BO18","v":0},{"v":5.4889834782669749E-4,"d":"5.49E-04"},0,0,0,0,0,0,{"$f":"IF($BK$17=\"11\",CN18,IF($BK$17=\"21\",CN18,IF($BK$17=\"12\",DP18,IF($BK$17=\"22\",DP18,IF($BK$17=\"13\",ED18,IF($BK$17=\"23\",ED18,IF($BK$17=\"14\",DB18,IF($BK$17=\"24\",DB18,IF($BK$17=\"31\",0,IF($BK$17=\"41\",0,IF($BK$17=\"32\",0,IF($BK$17=\"42\",0,IF($BK$17=\"33\",0,IF($BK$17=\"43\",0,IF($BK$17=\"34\",DB18,IF($BK$17=\"44\",DB18,))))))))))))))))","v":{"v":0,"d":"0.00E+00"}},{"v":0.00141512045,"d":"1.42E-03"},{"v":-0.0393016056,"d":"-3.93E-02"},{"v":0.173500294,"d":"1.74E-01"},{"v":-7.9339441,"d":"-7.93E+00"},{"v":133.768339,"d":"1.34E+02"},{"$f":"IF($BK$17=\"11\",CT18,IF($BK$17=\"21\",CT18,IF($BK$17=\"12\",DV18,IF($BK$17=\"22\",DV18,IF($BK$17=\"13\",EJ18,IF($BK$17=\"23\",EJ18,IF($BK$17=\"14\",DH18,IF($BK$17=\"24\",DH18,IF($BK$17=\"31\",0,IF($BK$17=\"41\",0,IF($BK$17=\"32\",0,IF($BK$17=\"42\",0,IF($BK$17=\"33\",0,IF($BK$17=\"43\",0,IF($BK$17=\"34\",DH18,IF($BK$17=\"44\",DH18,))))))))))))))))","v":{"v":0,"d":"0.00E+00"}},{"v":-2.22290258E-7,"d":"-2.22E-07"},{"v":4.8167501e-05,"d":"4.82E-05"},{"v":0.00293267785,"d":"2.93E-03"},{"$f":"IF($BK$17=\"11\",CX18,IF($BK$17=\"21\",CX18,IF($BK$17=\"12\",DZ18,IF($BK$17=\"22\",DZ18,IF($BK$17=\"13\",EN18,IF($BK$17=\"23\",EN18,IF($BK$17=\"14\",DL18,IF($BK$17=\"24\",DL18,IF($BK$17=\"31\",0,IF($BK$17=\"41\",0,IF($BK$17=\"32\",0,IF($BK$17=\"42\",0,IF($BK$17=\"33\",0,IF($BK$17=\"43\",0,IF($BK$17=\"34\",DL18,IF($BK$17=\"44\",DL18,))))))))))))))))","v":{"v":2.94282483,"d":"2.94E+00"}},{"v":0.000485609906,"d":"4.86E-04"},{"v":-0.609011824,"d":"-6.09E-01"},{"v":553.544529,"d":"5.54E+02"},null,{"v":0.00447851041,"d":"4.48E-03"},{"v":-0.108337664,"d":"-1.08E-01"},{"v":0.682536279,"d":"6.83E-01"},{"v":-9.94254378,"d":"-9.94E+00"},{"v":97.8873551,"d":"9.79E+01"},null,{"v":-5.80152699e-07,"d":"-5.80E-07"},{"v":1.0073709E-4,"d":"1.01E-04"},{"v":0.000895544438,"d":"8.96E-04"},{"v":2.39362617,"d":"2.39E+00"},{"v":-0.0003660752,"d":"-3.66E-04"},{"v":-0.291272687,"d":"-2.91E-01"},{"v":481.971629,"d":"4.82E+02"},null,{"v":-1.4135991E-3,"d":"-1.41E-03"},{"v":-0.00210955461,"d":"-2.11E-03"},{"v":0.0814827589,"d":"8.15E-02"},{"v":-10.389731,"d":"-1.04E+01"},{"v":142.571774,"d":"1.43E+02"},null,{"v":3.97632919e-09,"d":"3.98E-09"},{"v":-1.82320137e-06,"d":"-1.82E-06"},{"v":0.00646072856,"d":"6.46E-03"},{"v":2.76564188,"d":"2.77E+00"},{"v":1.14875471E-4,"d":"1.15E-04"},{"v":-0.296776033,"d":"-2.97E-01"},{"v":520.801889,"d":"5.21E+02"},null,{"v":0.00141512045,"d":"1.42E-03"},{"v":-0.0393016056,"d":"-3.93E-02"},{"v":0.173500294,"d":"1.74E-01"},{"v":-7.9339441,"d":"-7.93E+00"},{"v":133.768339,"d":"1.34E+02"},null,{"v":-2.22290258E-7,"d":"-2.22E-07"},{"v":4.8167501e-05,"d":"4.82E-05"},{"v":0.00293267785,"d":"2.93E-03"},{"v":2.94282483,"d":"2.94E+00"},{"$f":" 0.000485609906","v":{"v":0.000485609906,"d":"4.86E-04"}},{"v":-0.609011824,"d":"-6.09E-01"},{"v":553.544529,"d":"5.54E+02"},{"$nulls":14},33.5,null,33.5,{"$nulls":5},{"$f":"IF($BK$17=\"11\",FA18,IF($BK$17=\"21\",FA18,IF($BK$17=\"12\",FC18,IF($BK$17=\"22\",FC18,IF($BK$17=\"13\",FD18,IF($BK$17=\"23\",FD18,IF($BK$17=\"14\",FB18,IF($BK$17=\"24\",FB18,IF($BK$17=\"31\",FE18,IF($BK$17=\"41\",FE18,IF($BK$17=\"32\",FG18,IF($BK$17=\"42\",FG18,IF($BK$17=\"33\",FH18,IF($BK$17=\"43\",FH18,IF($BK$17=\"34\",FF18,IF($BK$17=\"44\",FF18,))))))))))))))))","v":17.5},{"$f":"Tavg_cold","v":17},{"$f":"IF($GC18<=$FC18,$FC18,IF($FM18<=$FP18,$FC18,$FZ18))","v":17.5},{"$f":"IF($N18>$FN18,Tavg_cold+(0.5*(Tr_cool-Tavg_cold)),Tavg_cold+($FJ18*(Tr_cool-Tavg_cold)))","v":17.5},{"$nulls":6},{"$f":"0.5*(1-((FN18-N18)/FN18))","v":0.5},{"$f":"(0.025*Tl_cool)+0.5","v":{"v":1.175,"d":"1.18"}},null,{"$f":"FQ18/FO18","v":{"v":0.5555555555555556,"d":"55.56%"}},{"$f":"DU18","v":{"v":133.768339,"d":"133.8"}},{"$f":"FN18*1.8","v":{"v":240.7830102,"d":"240.8"}},{"$f":"FN18/FO18","v":{"v":0.5555555555555556,"d":"55.56%"}},{"$f":"N18/Cubics","v":{"v":133.768339,"d":"133.77"}},{"$f":"IF(FQ18-(FP18*FO18)<=0,0,FQ18-(FP18*FO18))","v":{"v":0,"d":"0.00"}},{"$f":"FO18*(1-FP18)","v":{"v":107.0146712,"d":"107.01"}},{"$f":"IF((FR18/FS18)>1,1,FR18/FS18)","v":{"v":0,"d":"0.00%"}},{"$f":"FC18","v":{"v":17.5,"d":"17.50"}},{"$f":"Tr_cool*FK18","v":21.150000000000002},{"$f":"ABS(FV18-FU18)","v":{"v":3.650000000000002,"d":"3.65"}},null,null,{"$f":"IF(FM18<=FP18,FU18,FU18+(FT18*FW18))","v":{"v":17.5,"d":"17.50"}},null,null,{"$f":"(237.3*LN((RH*EXP(17.27*(Tl_cool/(Tl_cool+237.3))))))/(17.27-LN((RH*EXP(17.27*(Tl_cool/(Tl_cool+237.3))))))","v":15.69066559142683},null,{"$f":"(H18-G18)/H18","v":{"v":0,"d":"0.0%"}},null,{"$f":"(611*EXP(17.27*(Tl_heat/(Tl_heat+237.7))))","v":{"v":2334.1781978570243,"d":"2334.18"}},{"$f":"(611*EXP(17.27*((($P18-Celc2)/Celc1)/((($P18-Celc2)/Celc1)+237.7))))","v":{"v":18582.80042869533,"d":"18582.80"}},{"$f":"RH*$GG18","v":{"v":1167.0890989285122,"d":"1167.09"}},{"$f":"(GL18*p_atm)/(GL18+0.622)","v":{"v":1167.089098928512,"d":"1167.09"}},{"$f":"0.622*($GI18/(p_atm-$GI18))","v":{"v":7.2478490515896785E-3,"d":"0.01"}},{"$f":"GK18","v":{"v":7.2478490515896785E-3,"d":"0.01"}},{"$f":"(1.005*Tl_heat)+($GK18*(2500+(1.87*Tl_heat)))","v":{"v":38.49069218350365,"d":"38.49"}},{"$f":"(1.005*(($P18-Celc2)/Celc1))+($GL18*(2500+(1.87*(($P18-Celc2)/Celc1))))","v":{"v":77.79298558389908,"d":"77.79"}},{"$f":"GJ18/GH18","v":{"v":0.06280480186002038,"d":"6%"}},null,{"$f":"pvs_cool_in","v":{"v":3566.5076087433313,"d":"3566.51"}},{"$f":"(611*EXP(17.27*((($R18-Celc2)/Celc1)/((($R18-Celc2)/Celc1)+237.7))))","v":{"v":2172.738929400542,"d":"2172.74"}},{"$f":"RH*$GQ18","v":{"v":1783.2538043716656,"d":"1783.25"}},{"$f":"(GW18*p_atm)/(GW18+0.622)","v":{"v":1783.2538043716654,"d":"1783.25"}},{"$f":"T18*GR18","v":{"v":1783.2538043716654,"d":"1783.25"}},{"$f":"0.622*($GS18/(p_atm-$GS18))","v":{"v":0.011142901432925525,"d":"0.0111"}},{"$f":"IF(H18=G18,GV18,(0.53475935828878*($GZ18-(1.005*(($R18-Celc2)/Celc1))))/(1336.8983957219))","v":{"v":0.011142901432925525,"d":"0.0111"}},{"$f":"0.622*($GU18/(p_atm-$GU18))","v":{"v":0.011142901432925525,"d":"0.01"}},{"$f":"(1.005*Tl_cool)+($GV18*(2500+(1.87*Tl_cool)))","v":{"v":55.55485867566222,"d":"55.55"}},{"$f":"GY18-((((H18-G18)/Watts)/1000)/(N18/$L$15))","v":{"v":55.55485867566222,"d":"55.55"}},{"$f":"(1.005*(($R18-Celc2)/Celc1))+($GX18*(2500+(1.87*(($R18-Celc2)/Celc1))))","v":{"v":47.18991653414779,"d":"47.19"}},{"$f":"27.8*LN((GY18+36)/45.5)","v":{"v":19.438483217977073,"d":"19.44"}},{"$f":"27.8*LN((GZ18+36)/45.5)","v":{"v":19.438483217977073,"d":"19.44"}},null,{"$f":"IF(Geg_dP<$AB18,(BZ18*0^5+CA18*0^4+CB18*0^3+CC18*0^2+CD18*0+CE18)*CF_Case*Cubics,\"\")","v":133.768339},{"$f":"IF(Geg_dP<$AB18,((($BL$18*($HE18/Cubics)^4+$BL$19*($HE18/Cubics)^3+$BL$20*($HE18/Cubics)^2+$BL$21*($HE18/Cubics)^1+$BL$22)*((CF_Regime_Cool_noExp)^$Y18)))*CF_Addit*Watts*CF_Altit,Lim_dP)","v":366.9946962996415},{"$f":"IF($HE18>HP18,Tavg_cold+(0.5*(Tr_cool-Tavg_cold)),Tavg_cold+(HL18*(Tr_cool-Tavg_cold)))","v":17.5},{"$f":"IF($IE18<=$HG18,$HG18,IF($HO18<=$HR18,$HG18,$IB18))","v":17.5},{"$nulls":3},{"$f":"0.5*(1-((HP18-HE18)/HP18))","v":0.5},{"$f":"(0.025*Tl_cool)+0.5","v":{"v":1.175,"d":"1.18"}},null,{"$f":"HS18/HQ18","v":{"v":0.5555555555555556,"d":"55.56%"}},{"$f":"DU18","v":{"v":133.768339,"d":"133.8"}},{"$f":"HP18*1.8","v":{"v":240.7830102,"d":"240.8"}},{"$f":"HP18/HQ18","v":{"v":0.5555555555555556,"d":"55.56%"}},{"$f":"HE18/Cubics","v":{"v":133.768339,"d":"133.77"}},{"$f":"IF(HS18-(HR18*HQ18)<=0,0,HS18-(HR18*HQ18))","v":{"v":0,"d":"0.00"}},{"$f":"HQ18*(1-HR18)","v":{"v":107.0146712,"d":"107.01"}},{"$f":"IF((HT18/HU18)>1,1,HT18/HU18)","v":{"v":0,"d":"0.00%"}},{"$f":"FC18","v":{"v":17.5,"d":"17.50"}},{"$f":"Tr_cool*HM18","v":21.150000000000002},{"$f":"ABS(HX18-HW18)","v":{"v":3.650000000000002,"d":"3.65"}},null,null,{"$f":"IF(HO18<=HR18,HW18,HW18+(HV18*HY18))","v":{"v":17.5,"d":"17.50"}},null,null,{"$f":"(237.3*LN((RH*EXP(17.27*(Tl_cool/(Tl_cool+237.3))))))/(17.27-LN((RH*EXP(17.27*(Tl_cool/(Tl_cool+237.3))))))","v":15.69066559142683},null,{"$f":"(BG18-BF18)/BG18","v":{"$error":"#DIV/0!"}},null,{"$f":"(611*EXP(17.27*(Tl_heat/(Tl_heat+237.7))))","v":{"v":2334.1781978570243,"d":"2334.18"}},{"$f":"(611*EXP(17.27*((($P18-Celc2)/Celc1)/((($P18-Celc2)/Celc1)+237.7))))","v":{"v":18582.80042869533,"d":"18582.80"}}]
[null,{"v":0.4,"d":"40%"},4,{"$f":"IF(Geg_dP<AB19,((($BK$18*($N19/Cubics)^4+$BK$19*($N19/Cubics)^3+$BK$20*($N19/Cubics)^2+$BK$21*($N19/Cubics)^1+$BK$22)*((CF_Regime_Heat_noExp)^$AA19)))*CF_Addit*Watts*CF_Altit,Lim_dP)","v":{"v":3118.797946178422,"d":"3119"}},{"$f":"IF(Geg_dP<$AB19,ROUND((($D19/Watts)/((Tv_heat-Tr_heat)*1.163))*FlowH2O,IF(UnitsNo=1,0,IF(UnitsNo=2,2))),\"\")","v":268},{"$f":"IF(Geg_dP<$AB19,IF((($BM$18*(E19/FlowH2O)^$BM$19))*kPa>0,(($BM$18*(E19/FlowH2O)^$BM$19))*kPa,0),\"\")","v":{"v":1.6960074461691081,"d":"1.7"}},{"$f":"IF(Geg_dP<$AB19,((($BL$18*($N19/Cubics)^4+$BL$19*($N19/Cubics)^3+$BL$20*($N19/Cubics)^2+$BL$21*($N19/Cubics)^1+$BL$22)*((CF_Regime_Cool_noExp)^$Y19)))*CF_Addit*Watts*CF_Altit,Lim_dP)","v":{"v":658.639655767295,"d":"659"}},{"$f":"IF(Geg_dP<$AB19,((G19/Watts)/(IF((237.3*LN((RH*EXP(17.27*(Tl_cool/(Tl_cool+237.3))))))/(17.27-LN((RH*EXP(17.27*(Tl_cool/(Tl_cool+237.3))))))<EZ19,1,IF(1/(1+((2258*((0.622/((101325/(1*611*EXP(17.27*(EZ19/(EZ19+237.3))))))-1)*1000-(0.622/((101325/(RH*611*EXP(17.27*(Tl_cool/(Tl_cool+237.3))))))-1)*1000))/(1005*(Tavg_cold-Tl_cool))))>1,1,1/(1+((2258*((0.622/((101325/(1*611*EXP(17.27*(EZ19/(EZ19+237.3))))))-1)*1000-(0.622/((101325/(RH*611*EXP(17.27*(Tl_cool/(Tl_cool+237.3))))))-1)*1000))/(1005*(Tavg_cold-Tl_cool))))))))*Watts,\"\")","v":{"v":658.639655767295,"d":"659"}},{"$f":"IF(Geg_dP<AB19,ROUND(((H19/Watts)/((Tr_cool-Tv_cool)*1.163))*FlowH2O,IF(UnitsNo=1,0,IF(UnitsNo=2,2))),\"\")","v":283},{"$f":"IF(Geg_dP<$AB19,IF((($BM$21*(I19/FlowH2O)^$BM$22))*kPa>0,(($BM$21*(I19/FlowH2O)^$BM$22))*kPa,0),\"\")","v":{"v":1.8745119075616177,"d":"1.9"}},{"$f":"IF(Geg_dP<AB19,IF($L19-8<0,0,$L19-8),\"\")","v":{"v":35,"d":"35.0"}},{"$f":"IF(Geg_dP<$AB19,IF(CalcNo=\"12\",$ET19,IF(CalcNo=\"22\",$ET19,IF(CalcNo=\"13\",$EU19,IF(CalcNo=\"23\",$EU19,IF(CalcNo=\"11\",$ER19,IF(CalcNo=\"21\",$ER19,IF(CalcNo=\"14\",$ES19,IF(CalcNo=\"24\",$ES19,IF(CalcNo=\"32\",$EX19,IF(CalcNo=\"42\",$EX19,IF(CalcNo=\"33\",$EY19,IF(CalcNo=\"43\",$EY19,IF(CalcNo=\"31\",$EV19,IF(CalcNo=\"41\",$EV19,IF(CalcNo=\"34\",$EW19,IF(CalcNo=\"44\",$EW19,)))))))))))))))),\"\")","v":{"v":43,"d":"43.0"}},{"$f":"IF(Geg_dP<$AB19,($CF19*(($N19/Cubics)^4))+($CG19*(($N19/Cubics)^3))+($CH19*(($N19/Cubics)^2))+($CI19*($N19/Cubics))+$CJ19,\"\")","v":{"v":8.738482750281012,"d":"8.7"}},{"$f":"IF(Geg_dP<$AB19,(BZ19*Geg_dP^5+CA19*Geg_dP^4+CB19*Geg_dP^3+CC19*Geg_dP^2+CD19*Geg_dP+CE19)*CF_Case*Cubics,\"\")","v":{"v":254.186551,"d":"254"}},{"$f":"IF(Geg_dP<$AB19,(($N19/Cubics)/3600)/(($BJ$23/100)*($BP$23/100))*FeetMins,\"\")","v":{"v":0.5835320270890726,"d":"0.58"}},{"$f":"IF(Geg_dP<$AB19,((($D19/Watts)/(((p_atm*0.028964)/(8.31447*(20+273.15)))*(($N19/3600)/Cubics)*(1005+1870*((0.622)/(((p_atm)/($E$14*pvs_heat_in))-1)))))+Tl_heat)*Celc1+Celc2,\"\")","v":{"v":56.01558383693053,"d":"56.0"}},{"$f":"IF(Geg_dP<$AB19,(27.8*LN(($GN19+36)/45.5))*Celc1+Celc2,\"\")","v":{"v":24.83620380952435,"d":"24.8"}},{"$f":"IF(Geg_dP<$AB19,(Tl_cool-(($G19/Watts)/(1006*$N19*kgss)))*Celc1+Celc2,\"\")","v":{"v":19.298535103604365,"d":"19.3"}},{"$f":"IF(Geg_dP<$AB19,IF((27.8*LN(($HA19+36)/45.5))*Celc1+Celc2>R19,R19,(27.8*LN(($HA19+36)/45.5))*Celc1+Celc2),\"\")","v":{"v":16.90423224803864,"d":"16.9"}},{"$f":"IF(Geg_dP<$AB19,IF($H19>$G19,1,IF(($GT19/$GR19)<0,0,$GT19/$GR19)),\"\")","v":{"v":0.7958003440540874,"d":"80%"}},{"$f":"IF(Geg_dP<$AB19,$CK19*($N19/Cubics)^2+$CL19*($N19/Cubics)^1+$CM19,\"\")","v":{"v":729.9876975828838,"d":"730"}},{"$f":"M19/((N19/Cubics)/3.6)","v":{"v":0.12376161436256178,"d":"0.12"}},{"$f":"(G19/Watts)/(N19/Cubics)","v":{"v":2.5911664215755263,"d":"2.591"}},1.02106,1.10028,1.13249,{"$f":"IF($BK$17=\"11\",X19,IF($BK$17=\"21\",Z19,IF($BK$17=\"12\",X19,IF($BK$17=\"22\",Z19,IF($BK$17=\"13\",X19,IF($BK$17=\"23\",Z19,IF($BK$17=\"14\",X19,IF($BK$17=\"24\",Z19,IF($BK$17=\"31\",X19,IF($BK$17=\"41\",Z19,IF($BK$17=\"32\",X19,IF($BK$17=\"42\",Z19,IF($BK$17=\"33\",X19,IF($BK$17=\"43\",Z19,IF($BK$17=\"34\",X19,IF($BK$17=\"44\",Z19,))))))))))))))))","v":1.02106},{"$f":"IF($BK$17=\"11\",AF19,IF($BK$17=\"21\",AF19,IF($BK$17=\"12\",AN19,IF($BK$17=\"22\",AN19,IF($BK$17=\"13\",AR19,IF($BK$17=\"23\",AR19,IF($BK$17=\"14\",AJ19,IF($BK$17=\"24\",AJ19,IF($BK$17=\"31\",AV19,IF($BK$17=\"41\",AV19,IF($BK$17=\"32\",BD19,IF($BK$17=\"42\",BD19,IF($BK$17=\"33\",BH19,IF($BK$17=\"43\",BH19,IF($BK$17=\"34\",AZ19,IF($BK$17=\"44\",AZ19,))))))))))))))))","v":33.42},1.02106,1.10028,1.13249,{"v":31,"d":"31.00"},1.02106,1.10028,1.13249,{"v":43,"d":"43.00"},1.02106,1.10028,1.13249,33.42,{"$nulls":3},1000,{"$nulls":3},1000,{"$nulls":3},1000,{"$nulls":3},1000,{"$nulls":3},1000,null,null,{"v":1.47955615e-05,"d":"1.48E-05"},{"v":0,"d":"0.00E+00"},{"v":1.8375235778256551,"d":"1.84E+00"},{"v":1.47955615e-05,"d":"1.48E-05"},null,{"$f":"BP22","v":{"v":1.8375235778256551,"d":"1.84E+00"}},null,{"$f":"BO19","v":0},{"v":1.7962649934524995,"d":"1.80E+00"},0,0,0,0,0,0,{"v":0,"d":"0.00E+00"},{"v":5.34925665e-05,"d":"5.35E-05"},{"v":-0.00415543493,"d":"-4.16E-03"},{"v":0.0537698464,"d":"5.38E-02"},{"v":-6.03959351,"d":"-6.04E+00"},{"v":254.186551,"d":"2.54E+02"},{"v":0,"d":"0.00E+00"},{"v":-1.49807626e-07,"d":"-1.50E-07"},{"v":6.1215801E-5,"d":"6.12E-05"},{"v":0.00908726366,"d":"9.09E-03"},{"v":4.93374067,"d":"4.93E+00"},{"v":0.000281538507,"d":"2.82E-04"},{"v":-0.580749189,"d":"-5.81E-01"},{"v":859.415902,"d":"8.59E+02"},null,{"v":5.7711647E-5,"d":"5.77E-05"},{"v":-0.00418106822,"d":"-4.18E-03"},{"v":0.0592780782,"d":"5.93E-02"},{"v":-5.86534741,"d":"-5.87E+00"},{"v":201.774196,"d":"2.02E+02"},null,{"v":-2.43485656e-07,"d":"-2.43E-07"},{"v":8.29685928e-05,"d":"8.30E-05"},{"v":0.00725761945,"d":"7.26E-03"},{"v":4.27025634,"d":"4.27E+00"},{"v":-4.65911507E-5,"d":"-4.66E-05"},{"v":-0.425651894,"d":"-4.26E-01"},{"v":803.080243,"d":"8.03E+02"},null,{"v":-2.97988682e-05,"d":"-2.98E-05"},{"v":0.00218730768,"d":"2.19E-03"},{"v":-0.104642023,"d":"-1.05E-01"},{"v":-4.14660133,"d":"-4.15E+00"},{"v":312.667623,"d":"3.13E+02"},null,{"v":8.13744972e-09,"d":"8.14E-09"},{"v":-6.8757719e-06,"d":"-6.88E-06"},{"v":0.023181164,"d":"2.32E-02"},{"v":5.65191484,"d":"5.65E+00"},{"v":0.000225875187,"d":"2.26E-04"},{"v":-0.452402839,"d":"-4.52E-01"},{"v":962.557439,"d":"9.63E+02"},null,{"v":5.34925665e-05,"d":"5.35E-05"},{"v":-0.00415543493,"d":"-4.16E-03"},{"v":0.0537698464,"d":"5.38E-02"},{"v":-6.03959351,"d":"-6.04E+00"},{"v":254.186551,"d":"2.54E+02"},null,{"v":-1.49807626e-07,"d":"-1.50E-07"},{"v":6.1215801E-5,"d":"6.12E-05"},{"v":0.00908726366,"d":"9.09E-03"},{"v":4.93374067,"d":"4.93E+00"},{"v":0.000281538507,"d":"2.82E-04"},{"v":-0.580749189,"d":"-5.81E-01"},{"v":859.415902,"d":"8.59E+02"},{"$nulls":14},43,null,43,{"$nulls":5},{"$f":"IF($BK$17=\"11\",FA19,IF($BK$17=\"21\",FA19,IF($BK$17=\"12\",FC19,IF($BK$17=\"22\",FC19,IF($BK$17=\"13\",FD19,IF($BK$17=\"23\",FD19,IF($BK$17=\"14\",FB19,IF($BK$17=\"24\",FB19,IF($BK$17=\"31\",FE19,IF($BK$17=\"41\",FE19,IF($BK$17=\"32\",FG19,IF($BK$17=\"42\",FG19,IF($BK$17=\"33\",FH19,IF($BK$17=\"43\",FH19,IF($BK$17=\"34\",FF19,IF($BK$17=\"44\",FF19,))))))))))))))))","v":17.5},{"$f":"Tavg_cold","v":17},{"$f":"IF($GC19<=$FC19,$FC19,IF($FM19<=$FP19,$FC19,$FZ19))","v":17.5},{"$f":"IF($N19>$FN19,Tavg_cold+(0.5*(Tr_cool-Tavg_cold)),Tavg_cold+($FJ19*(Tr_cool-Tavg_cold)))","v":17.5},{"$nulls":6},{"$f":"0.5*(1-((FN19-N19)/FN19))","v":0.5},{"$f":"(0.025*Tl_cool)+0.5","v":{"v":1.175,"d":"1.18"}},null,{"$f":"FQ19/FO19","v":{"v":0.5555555555555556,"d":"55.56%"}},{"$f":"DU19","v":{"v":254.186551,"d":"254.2"}},{"$f":"FN19*1.8","v":{"v":457.5357918,"d":"457.5"}},{"$f":"FN19/FO19","v":{"v":0.5555555555555556,"d":"55.56%"}},{"$f":"N19/Cubics","v":{"v":254.186551,"d":"254.19"}},{"$f":"IF(FQ19-(FP19*FO19)<=0,0,FQ19-(FP19*FO19))","v":{"v":0,"d":"0.00"}},{"$f":"FO19*(1-FP19)","v":{"v":203.3492408,"d":"203.35"}},{"$f":"IF((FR19/FS19)>1,1,FR19/FS19)","v":{"v":0,"d":"0.00%"}},{"$f":"FC19","v":{"v":17.5,"d":"17.50"}},{"$f":"Tr_cool*FK19","v":21.150000000000002},{"$f":"ABS(FV19-FU19)","v":{"v":3.650000000000002,"d":"3.65"}},null,null,{"$f":"IF(FM19<=FP19,FU19,FU19+(FT19*FW19))","v":{"v":17.5,"d":"17.50"}},null,null,{"$f":"(237.3*LN((RH*EXP(17.27*(Tl_cool/(Tl_cool+237.3))))))/(17.27-LN((RH*EXP(17.27*(Tl_cool/(Tl_cool+237.3))))))","v":15.69066559142683},null,{"$f":"(H19-G19)/H19","v":{"v":0,"d":"0.0%"}},null,{"$f":"(611*EXP(17.27*(Tl_heat/(Tl_heat+237.7))))","v":{"v":2334.1781978570243,"d":"2334.18"}},{"$f":"(611*EXP(17.27*((($P19-Celc2)/Celc1)/((($P19-Celc2)/Celc1)+237.7))))","v":{"v":16460.559188165767,"d":"16460.56"}},{"$f":"RH*$GG19","v":{"v":1167.0890989285122,"d":"1167.09"}},{"$f":"(GL19*p_atm)/(GL19+0.622)","v":{"v":1167.089098928512,"d":"1167.09"}},{"$f":"0.622*($GI19/(p_atm-$GI19))","v":{"v":7.2478490515896785E-3,"d":"0.01"}},{"$f":"GK19","v":{"v":7.2478490515896785E-3,"d":"0.01"}},{"$f":"(1.005*Tl_heat)+($GK19*(2500+(1.87*Tl_heat)))","v":{"v":38.49069218350365,"d":"38.49"}},{"$f":"(1.005*(($P19-Celc2)/Celc1))+($GL19*(2500+(1.87*(($P19-Celc2)/Celc1))))","v":{"v":75.17449035295857,"d":"75.17"}},{"$f":"GJ19/GH19","v":{"v":0.07090215378391182,"d":"7%"}},null,{"$f":"(611*EXP(17.27*(Tl_cool/(Tl_cool+237.7))))","v":{"v":3557.0118570174286,"d":"3557.01"}},{"$f":"(611*EXP(17.27*((($R19-Celc2)/Celc1)/((($R19-Celc2)/Celc1)+237.7))))","v":{"v":2234.864488055356,"d":"2234.86"}},{"$f":"RH*$GQ19","v":{"v":1778.5059285087143,"d":"1778.51"}},{"$f":"(GW19*p_atm)/(GW19+0.622)","v":{"v":1778.5059285087143,"d":"1778.51"}},{"$f":"T19*GR19","v":{"v":1778.5059285087143,"d":"1778.51"}},{"$f":"0.622*($GS19/(p_atm-$GS19))","v":{"v":0.011112703645172665,"d":"0.0111"}},{"$f":"IF(H19=G19,GV19,(0.53475935828878*($GZ19-(1.005*(($R19-Celc2)/Celc1))))/(1336.8983957219))","v":{"v":0.011112703645172665,"d":"0.0111"}},{"$f":"0.622*($GU19/(p_atm-$GU19))","v":{"v":0.011112703645172665,"d":"0.01"}},{"$f":"(1.005*Tl_cool)+($GV19*(2500+(1.87*Tl_cool)))","v":{"v":55.47783951997643,"d":"55.48"}},{"$f":"GY19-((((H19-G19)/Watts)/1000)/(N19/$L$15))","v":{"v":55.47783951997643,"d":"55.48"}},{"$f":"(1.005*(($R19-Celc2)/Celc1))+($GX19*(2500+(1.87*(($R19-Celc2)/Celc1))))","v":{"v":47.57782503765769,"d":"47.58"}},{"$f":"27.8*LN((GY19+36)/45.5)","v":{"v":19.415087041495514,"d":"19.42"}},{"$f":"27.8*LN((GZ19+36)/45.5)","v":{"v":19.415087041495514,"d":"19.42"}},null,254.186551,658.639655767295,17.5,17.5,{"$nulls":3},{"$f":"0.5*(1-((HP19-HE19)/HP19))","v":0.5},{"$f":"(0.025*Tl_cool)+0.5","v":{"v":1.175,"d":"1.18"}},null,{"$f":"HS19/HQ19","v":{"v":0.5555555555555556,"d":"55.56%"}},{"$f":"DU19","v":{"v":254.186551,"d":"254.2"}},{"$f":"HP19*1.8","v":{"v":457.5357918,"d":"457.5"}},{"$f":"HP19/HQ19","v":{"v":0.5555555555555556,"d":"55.56%"}},{"v":254.186551,"d":"254.19"},{"$f":"IF(HS19-(HR19*HQ19)<=0,0,HS19-(HR19*HQ19))","v":{"v":0,"d":"0.00"}},{"$f":"HQ19*(1-HR19)","v":{"v":203.3492408,"d":"203.35"}},{"$f":"IF((HT19/HU19)>1,1,HT19/HU19)","v":{"v":0,"d":"0.00%"}},{"v":17.5,"d":"17.50"},{"$f":"Tr_cool*HM19","v":21.150000000000002},{"$f":"ABS(HX19-HW19)","v":{"v":3.650000000000002,"d":"3.65"}},null,null,{"$f":"IF(HO19<=HR19,HW19,HW19+(HV19*HY19))","v":{"v":17.5,"d":"17.50"}},null,null,{"$f":"(237.3*LN((RH*EXP(17.27*(Tl_cool/(Tl_cool+237.3))))))/(17.27-LN((RH*EXP(17.27*(Tl_cool/(Tl_cool+237.3))))))","v":15.69066559142683},null,{"$f":"(BG19-BF19)/BG19","v":{"$error":"#DIV/0!"}},null,{"$f":"(611*EXP(17.27*(Tl_heat/(Tl_heat+237.7))))","v":{"v":2334.1781978570243,"d":"2334.18"}},{"$f":"(611*EXP(17.27*((($P19-Celc2)/Celc1)/((($P19-Celc2)/Celc1)+237.7))))","v":{"v":16460.559188165767,"d":"16460.56"}}]
[null,{"v":0.6,"d":"60%"},6,{"$f":"IF(Geg_dP<AB20,((($BK$18*($N20/Cubics)^4+$BK$19*($N20/Cubics)^3+$BK$20*($N20/Cubics)^2+$BK$21*($N20/Cubics)^1+$BK$22)*((CF_Regime_Heat_noExp)^$AA20)))*CF_Addit*Watts*CF_Altit,Lim_dP)","v":{"v":4070.8243954552063,"d":"4071"}},{"$f":"IF(Geg_dP<$AB20,ROUND((($D20/Watts)/((Tv_heat-Tr_heat)*1.163))*FlowH2O,IF(UnitsNo=1,0,IF(UnitsNo=2,2))),\"\")","v":350},{"$f":"IF(Geg_dP<$AB20,IF((($BM$18*(E20/FlowH2O)^$BM$19))*kPa>0,(($BM$18*(E20/FlowH2O)^$BM$19))*kPa,0),\"\")","v":{"v":2.7698601082163314,"d":"2.8"}},{"$f":"IF(Geg_dP<$AB20,((($BL$18*($N20/Cubics)^4+$BL$19*($N20/Cubics)^3+$BL$20*($N20/Cubics)^2+$BL$21*($N20/Cubics)^1+$BL$22)*((CF_Regime_Cool_noExp)^$Y20)))*CF_Addit*Watts*CF_Altit,Lim_dP)","v":{"v":881.6515824013712,"d":"882"}},{"$f":"IF(Geg_dP<$AB20,((G20/Watts)/(IF((237.3*LN((RH*EXP(17.27*(Tl_cool/(Tl_cool+237.3))))))/(17.27-LN((RH*EXP(17.27*(Tl_cool/(Tl_cool+237.3))))))<EZ20,1,IF(1/(1+((2258*((0.622/((101325/(1*611*EXP(17.27*(EZ20/(EZ20+237.3))))))-1)*1000-(0.622/((101325/(RH*611*EXP(17.27*(Tl_cool/(Tl_cool+237.3))))))-1)*1000))/(1005*(Tavg_cold-Tl_cool))))>1,1,1/(1+((2258*((0.622/((101325/(1*611*EXP(17.27*(EZ20/(EZ20+237.3))))))-1)*1000-(0.622/((101325/(RH*611*EXP(17.27*(Tl_cool/(Tl_cool+237.3))))))-1)*1000))/(1005*(Tavg_cold-Tl_cool))))))))*Watts,\"\")","v":{"v":881.6515824013712,"d":"882"}},{"$f":"IF(Geg_dP<AB20,ROUND(((H20/Watts)/((Tr_cool-Tv_cool)*1.163))*FlowH2O,IF(UnitsNo=1,0,IF(UnitsNo=2,2))),\"\")","v":379},{"$f":"IF(Geg_dP<$AB20,IF((($BM$21*(I20/FlowH2O)^$BM$22))*kPa>0,(($BM$21*(I20/FlowH2O)^$BM$22))*kPa,0),\"\")","v":{"v":3.2061450575655126,"d":"3.2"}},{"$f":"IF(Geg_dP<AB20,IF($L20-8<0,0,$L20-8),\"\")","v":42.5},{"$f":"IF(Geg_dP<$AB20,IF(CalcNo=\"12\",$ET20,IF(CalcNo=\"22\",$ET20,IF(CalcNo=\"13\",$EU20,IF(CalcNo=\"23\",$EU20,IF(CalcNo=\"11\",$ER20,IF(CalcNo=\"21\",$ER20,IF(CalcNo=\"14\",$ES20,IF(CalcNo=\"24\",$ES20,IF(CalcNo=\"32\",$EX20,IF(CalcNo=\"42\",$EX20,IF(CalcNo=\"33\",$EY20,IF(CalcNo=\"43\",$EY20,IF(CalcNo=\"31\",$EV20,IF(CalcNo=\"41\",$EV20,IF(CalcNo=\"34\",$EW20,IF(CalcNo=\"44\",$EW20,)))))))))))))))),\"\")","v":50.5},{"$f":"IF(Geg_dP<$AB20,($CF20*(($N20/Cubics)^4))+($CG20*(($N20/Cubics)^3))+($CH20*(($N20/Cubics)^2))+($CI20*($N20/Cubics))+$CJ20,\"\")","v":{"v":17.200408392224332,"d":"17.2"}},{"$f":"IF(Geg_dP<$AB20,(BZ20*Geg_dP^5+CA20*Geg_dP^4+CB20*Geg_dP^3+CC20*Geg_dP^2+CD20*Geg_dP+CE20)*CF_Case*Cubics,\"\")","v":{"v":354.986764,"d":"355"}},{"$f":"IF(Geg_dP<$AB20,(($N20/Cubics)/3600)/(($BJ$23/100)*($BP$23/100))*FeetMins,\"\")","v":{"v":0.8149374747474747,"d":"0.81"}},{"$f":"IF(Geg_dP<$AB20,((($D20/Watts)/(((p_atm*0.028964)/(8.31447*(20+273.15)))*(($N20/3600)/Cubics)*(1005+1870*((0.622)/(((p_atm)/($E$14*pvs_heat_in))-1)))))+Tl_heat)*Celc1+Celc2,\"\")","v":{"v":53.66092113510995,"d":"53.7"}},{"$f":"IF(Geg_dP<$AB20,(27.8*LN(($GN20+36)/45.5))*Celc1+Celc2,\"\")","v":{"v":24.229915305750684,"d":"24.2"}},{"$f":"IF(Geg_dP<$AB20,(Tl_cool-(($G20/Watts)/(1006*$N20*kgss)))*Celc1+Celc2,\"\")","v":{"v":19.618189975634486,"d":"19.6"}},{"$f":"IF(Geg_dP<$AB20,IF((27.8*LN(($HA20+36)/45.5))*Celc1+Celc2>R20,R20,(27.8*LN(($HA20+36)/45.5))*Celc1+Celc2),\"\")","v":{"v":17.01308491519478,"d":"17.0"}},{"$f":"IF(Geg_dP<$AB20,IF($H20>$G20,1,IF(($GT20/$GR20)<0,0,$GT20/$GR20)),\"\")","v":{"v":0.7801651180875728,"d":"78%"}},{"$f":"IF(Geg_dP<$AB20,$CK20*($N20/Cubics)^2+$CL20*($N20/Cubics)^1+$CM20,\"\")","v":{"v":939.961693341587,"d":"940"}},{"$f":"M20/((N20/Cubics)/3.6)","v":{"v":0.17443318030868216,"d":"0.17"}},{"$f":"(G20/Watts)/(N20/Cubics)","v":{"v":2.483618184708913,"d":"2.484"}},1.02106,1.10028,1.13249,1.02106,64.62,1.02106,1.10028,1.13249,{"v":62,"d":"62.00"},1.02106,1.10028,1.13249,{"v":95,"d":"95.00"},1.02106,1.10028,1.13249,64.62,{"$nulls":3},1000,{"$nulls":3},1000,{"$nulls":3},1000,{"$nulls":3},1000,{"$nulls":3},1000,null,null,{"$f":"IF($BK$17=\"11\",BN20,IF($BK$17=\"21\",BQ20,IF($BK$17=\"12\",BN20,IF($BK$17=\"22\",BQ20,IF($BK$17=\"13\",0,IF($BK$17=\"23\",0,IF($BK$17=\"14\",BN20,IF($BK$17=\"24\",BQ20,IF($BK$17=\"31\",BT20,IF($BK$17=\"41\",BW20,IF($BK$17=\"32\",BT20,IF($BK$17=\"42\",BW20,IF($BK$17=\"33\",BT20,IF($BK$17=\"43\",BW20,IF($BK$17=\"34\",BT20,IF($BK$17=\"44\",BW20,))))))))))))))))","v":{"v":-0.0156502351,"d":"-1.57E-02"}},{"v":-0.00174635085,"d":"-1.75E-03"},null,{"v":-0.0156502351,"d":"-1.57E-02"},{"v":-0.00174635085,"d":"-1.75E-03"},null,{"v":-0.0010364306,"d":"-1.04E-03"},{"$f":"BO20","v":{"v":-0.00174635085,"d":"-1.75E-03"}},null,0,0,null,0,0,null,{"v":0,"d":"0.00E+00"},{"v":-7.34607543e-07,"d":"-7.35E-07"},{"v":7.11036703e-05,"d":"7.11E-05"},{"v":-0.0228461544,"d":"-2.28E-02"},{"v":-3.80748811,"d":"-3.81E+00"},{"v":354.986764,"d":"3.55E+02"},{"$f":"IF($BK$17=\"11\",CT20,IF($BK$17=\"21\",CT20,IF($BK$17=\"12\",DV20,IF($BK$17=\"22\",DV20,IF($BK$17=\"13\",EJ20,IF($BK$17=\"23\",EJ20,IF($BK$17=\"14\",DH20,IF($BK$17=\"24\",DH20,IF($BK$17=\"31\",0,IF($BK$17=\"41\",0,IF($BK$17=\"32\",0,IF($BK$17=\"42\",0,IF($BK$17=\"33\",0,IF($BK$17=\"43\",0,IF($BK$17=\"34\",DH20,IF($BK$17=\"44\",DH20,))))))))))))))))","v":{"v":0,"d":"0.00E+00"}},{"v":-1.20913463E-7,"d":"-1.21E-07"},{"v":6.85895791e-05,"d":"6.86E-05"},{"v":0.0170008603,"d":"1.70E-02"},{"v":7.93089812,"d":"7.93E+00"},{"v":2.85732059E-4,"d":"2.86E-04"},{"v":-0.71825251,"d":"-7.18E-01"},{"v":1158.92513,"d":"1.16E+03"},null,{"v":1.33205463E-5,"d":"1.33E-05"},{"v":-1.75343457E-3,"d":"-1.75E-03"},{"v":0.0547117967,"d":"5.47E-02"},{"v":-4.73480291,"d":"-4.73E+00"},{"v":301.619722,"d":"3.02E+02"},null,{"v":-1.74919929e-07,"d":"-1.75E-07"},{"v":8.70836658e-05,"d":"8.71E-05"},{"v":0.0153227764,"d":"1.53E-02"},{"v":7.22054775,"d":"7.22E+00"},{"v":0.000190673048,"d":"1.91E-04"},{"v":-0.631601917,"d":"-6.32E-01"},{"v":1119.09159,"d":"1.12E+03"},null,{"v":-2.4544425e-07,"d":"-2.45E-07"},{"v":1.63937074e-05,"d":"1.64E-05"},{"v":-0.020300458,"d":"-2.03E-02"},{"v":-2.80107883,"d":"-2.80E+00"},{"v":464.177143,"d":"4.64E+02"},null,{"v":-3.95809382e-08,"d":"-3.96E-08"},{"v":2.84559473E-5,"d":"2.85E-05"},{"v":0.0372722876,"d":"3.73E-02"},{"v":11.7859592,"d":"1.18E+01"},{"v":0.000182967293,"d":"1.83E-04"},{"v":-0.592811536,"d":"-5.93E-01"},{"v":1403.00739,"d":"1.40E+03"},null,{"v":-7.34607543e-07,"d":"-7.35E-07"},{"v":7.11036703e-05,"d":"7.11E-05"},{"v":-0.0228461544,"d":"-2.28E-02"},{"v":-3.80748811,"d":"-3.81E+00"},{"v":354.986764,"d":"3.55E+02"},null,{"v":-1.20913463E-7,"d":"-1.21E-07"},{"v":6.85895791e-05,"d":"6.86E-05"},{"v":0.0170008603,"d":"1.70E-02"},{"v":7.93089812,"d":"7.93E+00"},{"v":2.85732059E-4,"d":"2.86E-04"},{"v":-0.71825251,"d":"-7.18E-01"},{"v":1158.92513,"d":"1.16E+03"},{"$nulls":14},50.5,null,50.5,{"$nulls":5},{"$f":"IF($BK$17=\"11\",FA20,IF($BK$17=\"21\",FA20,IF($BK$17=\"12\",FC20,IF($BK$17=\"22\",FC20,IF($BK$17=\"13\",FD20,IF($BK$17=\"23\",FD20,IF($BK$17=\"14\",FB20,IF($BK$17=\"24\",FB20,IF($BK$17=\"31\",FE20,IF($BK$17=\"41\",FE20,IF($BK$17=\"32\",FG20,IF($BK$17=\"42\",FG20,IF($BK$17=\"33\",FH20,IF($BK$17=\"43\",FH20,IF($BK$17=\"34\",FF20,IF($BK$17=\"44\",FF20,))))))))))))))))","v":17.5},{"$f":"Tavg_cold","v":17},{"$f":"IF($GC20<=$FC20,$FC20,IF($FM20<=$FP20,$FC20,$FZ20))","v":17.5},{"$f":"IF($N20>$FN20,Tavg_cold+(0.5*(Tr_cool-Tavg_cold)),Tavg_cold+($FJ20*(Tr_cool-Tavg_cold)))","v":17.5},{"$nulls":6},{"$f":"0.5*(1-((FN20-N20)/FN20))","v":0.5},{"$f":"(0.025*Tl_cool)+0.5","v":{"v":1.175,"d":"1.18"}},null,{"$f":"FQ20/FO20","v":{"v":0.5555555555555555,"d":"55.56%"}},{"$f":"DU20","v":{"v":354.986764,"d":"355.0"}},{"$f":"FN20*1.8","v":{"v":638.9761752000001,"d":"639.0"}},{"$f":"FN20/FO20","v":{"v":0.5555555555555555,"d":"55.56%"}},{"$f":"N20/Cubics","v":{"v":354.986764,"d":"354.99"}},{"$f":"IF(FQ20-(FP20*FO20)<=0,0,FQ20-(FP20*FO20))","v":{"v":0,"d":"0.00"}},{"$f":"FO20*(1-FP20)","v":{"v":283.98941120000006,"d":"283.99"}},{"$f":"IF((FR20/FS20)>1,1,FR20/FS20)","v":{"v":0,"d":"0.00%"}},{"$f":"FC20","v":{"v":17.5,"d":"17.50"}},{"$f":"Tr_cool*FK20","v":21.150000000000002},{"$f":"ABS(FV20-FU20)","v":{"v":3.650000000000002,"d":"3.65"}},null,null,{"$f":"IF(FM20<=FP20,FU20,FU20+(FT20*FW20))","v":{"v":17.5,"d":"17.50"}},null,null,{"$f":"(237.3*LN((RH*EXP(17.27*(Tl_cool/(Tl_cool+237.3))))))/(17.27-LN((RH*EXP(17.27*(Tl_cool/(Tl_cool+237.3))))))","v":15.69066559142683},null,{"$f":"(H20-G20)/H20","v":{"v":0,"d":"0.0%"}},null,{"$f":"(611*EXP(17.27*(Tl_heat/(Tl_heat+237.7))))","v":{"v":2334.1781978570243,"d":"2334.18"}},{"$f":"(611*EXP(17.27*((($P20-Celc2)/Celc1)/((($P20-Celc2)/Celc1)+237.7))))","v":{"v":14702.47262541867,"d":"14702.47"}},{"$f":"RH*$GG20","v":{"v":1167.0890989285122,"d":"1167.09"}},{"$f":"(GL20*p_atm)/(GL20+0.622)","v":{"v":1167.089098928512,"d":"1167.09"}},{"$f":"0.622*($GI20/(p_atm-$GI20))","v":{"v":7.2478490515896785E-3,"d":"0.01"}},{"v":7.2478490515896785E-3,"d":"0.01"},{"$f":"(1.005*Tl_heat)+($GK20*(2500+(1.87*Tl_heat)))","v":{"v":38.49069218350365,"d":"38.49"}},{"$f":"(1.005*(($P20-Celc2)/Celc1))+($GL20*(2500+(1.87*(($P20-Celc2)/Celc1))))","v":{"v":72.77614046914641,"d":"72.78"}},{"v":0.07938046399833223,"d":"8%"},null,{"$f":"(611*EXP(17.27*(Tl_cool/(Tl_cool+237.7))))","v":{"v":3557.0118570174286,"d":"3557.01"}},{"$f":"(611*EXP(17.27*((($R20-Celc2)/Celc1)/((($R20-Celc2)/Celc1)+237.7))))","v":{"v":2279.6532263175072,"d":"2279.65"}},{"$f":"RH*$GQ20","v":{"v":1778.5059285087143,"d":"1778.51"}},{"$f":"(GW20*p_atm)/(GW20+0.622)","v":{"v":1778.5059285087143,"d":"1778.51"}},{"$f":"T20*GR20","v":{"v":1778.5059285087143,"d":"1778.51"}},{"$f":"0.622*($GS20/(p_atm-$GS20))","v":{"v":0.011112703645172665,"d":"0.0111"}},{"$f":"IF(H20=G20,GV20,(0.53475935828878*($GZ20-(1.005*(($R20-Celc2)/Celc1))))/(1336.8983957219))","v":{"v":0.011112703645172665,"d":"0.0111"}},{"$f":"0.622*($GU20/(p_atm-$GU20))","v":{"v":0.011112703645172665,"d":"0.01"}},{"$f":"(1.005*Tl_cool)+($GV20*(2500+(1.87*Tl_cool)))","v":{"v":55.47783951997643,"d":"55.48"}},{"$f":"GY20-((((H20-G20)/Watts)/1000)/(N20/$L$15))","v":{"v":55.47783951997643,"d":"55.48"}},{"$f":"(1.005*(($R20-Celc2)/Celc1))+($GX20*(2500+(1.87*(($R20-Celc2)/Celc1))))","v":{"v":47.90572085388915,"d":"47.91"}},{"v":19.415087041495514,"d":"19.42"},{"v":19.415087041495514,"d":"19.42"},null,354.986764,881.6515824013712,17.5,17.5,{"$nulls":3},{"$f":"0.5*(1-((HP20-HE20)/HP20))","v":0.5},{"$f":"(0.025*Tl_cool)+0.5","v":{"v":1.175,"d":"1.18"}},null,{"$f":"HS20/HQ20","v":{"v":0.5555555555555555,"d":"55.56%"}},{"$f":"DU20","v":{"v":354.986764,"d":"355.0"}},{"v":638.9761752000001,"d":"639.0"},{"$f":"HP20/HQ20","v":{"v":0.5555555555555555,"d":"55.56%"}},{"v":354.986764,"d":"354.99"},{"$f":"IF(HS20-(HR20*HQ20)<=0,0,HS20-(HR20*HQ20))","v":{"v":0,"d":"0.00"}},{"$f":"HQ20*(1-HR20)","v":{"v":283.98941120000006,"d":"283.99"}},{"$f":"IF((HT20/HU20)>1,1,HT20/HU20)","v":{"v":0,"d":"0.00%"}},{"v":17.5,"d":"17.50"},{"$f":"Tr_cool*HM20","v":21.150000000000002},{"$f":"ABS(HX20-HW20)","v":{"v":3.650000000000002,"d":"3.65"}},null,null,{"$f":"IF(HO20<=HR20,HW20,HW20+(HV20*HY20))","v":{"v":17.5,"d":"17.50"}},null,null,{"$f":"(237.3*LN((RH*EXP(17.27*(Tl_cool/(Tl_cool+237.3))))))/(17.27-LN((RH*EXP(17.27*(Tl_cool/(Tl_cool+237.3))))))","v":15.69066559142683},null,{"$f":"(BG20-BF20)/BG20","v":{"$error":"#DIV/0!"}},null,{"$f":"(611*EXP(17.27*(Tl_heat/(Tl_heat+237.7))))","v":{"v":2334.1781978570243,"d":"2334.18"}},{"$f":"(611*EXP(17.27*((($P20-Celc2)/Celc1)/((($P20-Celc2)/Celc1)+237.7))))","v":{"v":14702.47262541867,"d":"14702.47"}}]
[null,{"v":0.8,"d":"80%"},8,{"$f":"IF(Geg_dP<AB21,((($BK$18*($N21/Cubics)^4+$BK$19*($N21/Cubics)^3+$BK$20*($N21/Cubics)^2+$BK$21*($N21/Cubics)^1+$BK$22)*((CF_Regime_Heat_noExp)^$AA21)))*CF_Addit*Watts*CF_Altit,Lim_dP)","v":{"v":4970.630539772042,"d":"4971"}},{"$f":"IF(Geg_dP<$AB21,ROUND((($D21/Watts)/((Tv_heat-Tr_heat)*1.163))*FlowH2O,IF(UnitsNo=1,0,IF(UnitsNo=2,2))),\"\")","v":427},{"$f":"IF(Geg_dP<$AB21,IF((($BM$18*(E21/FlowH2O)^$BM$19))*kPa>0,(($BM$18*(E21/FlowH2O)^$BM$19))*kPa,0),\"\")","v":{"v":3.9915912378970946,"d":"4.0"}},{"$f":"IF(Geg_dP<$AB21,((($BL$18*($N21/Cubics)^4+$BL$19*($N21/Cubics)^3+$BL$20*($N21/Cubics)^2+$BL$21*($N21/Cubics)^1+$BL$22)*((CF_Regime_Cool_noExp)^$Y21)))*CF_Addit*Watts*CF_Altit,Lim_dP)","v":{"v":1074.5779201926093,"d":"1075"}},{"$f":"IF(Geg_dP<$AB21,((G21/Watts)/(IF((237.3*LN((RH*EXP(17.27*(Tl_cool/(Tl_cool+237.3))))))/(17.27-LN((RH*EXP(17.27*(Tl_cool/(Tl_cool+237.3))))))<EZ21,1,IF(1/(1+((2258*((0.622/((101325/(1*611*EXP(17.27*(EZ21/(EZ21+237.3))))))-1)*1000-(0.622/((101325/(RH*611*EXP(17.27*(Tl_cool/(Tl_cool+237.3))))))-1)*1000))/(1005*(Tavg_cold-Tl_cool))))>1,1,1/(1+((2258*((0.622/((101325/(1*611*EXP(17.27*(EZ21/(EZ21+237.3))))))-1)*1000-(0.622/((101325/(RH*611*EXP(17.27*(Tl_cool/(Tl_cool+237.3))))))-1)*1000))/(1005*(Tavg_cold-Tl_cool))))))))*Watts,\"\")","v":{"v":1074.5779201926093,"d":"1075"}},{"$f":"IF(Geg_dP<AB21,ROUND(((H21/Watts)/((Tr_cool-Tv_cool)*1.163))*FlowH2O,IF(UnitsNo=1,0,IF(UnitsNo=2,2))),\"\")","v":462},{"$f":"IF(Geg_dP<$AB21,IF((($BM$21*(I21/FlowH2O)^$BM$22))*kPa>0,(($BM$21*(I21/FlowH2O)^$BM$22))*kPa,0),\"\")","v":{"v":4.61333802466015,"d":"4.6"}},{"$f":"IF(Geg_dP<AB21,IF($L21-8<0,0,$L21-8),\"\")","v":46.5},{"$f":"IF(Geg_dP<$AB21,IF(CalcNo=\"12\",$ET21,IF(CalcNo=\"22\",$ET21,IF(CalcNo=\"13\",$EU21,IF(CalcNo=\"23\",$EU21,IF(CalcNo=\"11\",$ER21,IF(CalcNo=\"21\",$ER21,IF(CalcNo=\"14\",$ES21,IF(CalcNo=\"24\",$ES21,IF(CalcNo=\"32\",$EX21,IF(CalcNo=\"42\",$EX21,IF(CalcNo=\"33\",$EY21,IF(CalcNo=\"43\",$EY21,IF(CalcNo=\"31\",$EV21,IF(CalcNo=\"41\",$EV21,IF(CalcNo=\"34\",$EW21,IF(CalcNo=\"44\",$EW21,)))))))))))))))),\"\")","v":54.5},{"$f":"IF(Geg_dP<$AB21,($CF21*(($N21/Cubics)^4))+($CG21*(($N21/Cubics)^3))+($CH21*(($N21/Cubics)^2))+($CI21*($N21/Cubics))+$CJ21,\"\")","v":{"v":31.13583115645022,"d":"31.1"}},{"$f":"IF(Geg_dP<$AB21,(BZ21*Geg_dP^5+CA21*Geg_dP^4+CB21*Geg_dP^3+CC21*Geg_dP^2+CD21*Geg_dP+CE21)*CF_Case*Cubics,\"\")","v":{"v":450.174779,"d":"450"}},{"$f":"IF(Geg_dP<$AB21,(($N21/Cubics)/3600)/(($BJ$23/100)*($BP$23/100))*FeetMins,\"\")","v":{"v":1.0334590886134067,"d":"1.03"}},{"$f":"IF(Geg_dP<$AB21,((($D21/Watts)/(((p_atm*0.028964)/(8.31447*(20+273.15)))*(($N21/3600)/Cubics)*(1005+1870*((0.622)/(((p_atm)/($E$14*pvs_heat_in))-1)))))+Tl_heat)*Celc1+Celc2,\"\")","v":{"v":52.41052842868903,"d":"52.4"}},{"$f":"IF(Geg_dP<$AB21,(27.8*LN(($GN21+36)/45.5))*Celc1+Celc2,\"\")","v":{"v":23.90250198041,"d":"23.9"}},{"$f":"IF(Geg_dP<$AB21,(Tl_cool-(($G21/Watts)/(1006*$N21*kgss)))*Celc1+Celc2,\"\")","v":{"v":19.905287751520465,"d":"19.9"}},{"$f":"IF(Geg_dP<$AB21,IF((27.8*LN(($HA21+36)/45.5))*Celc1+Celc2>R21,R21,(27.8*LN(($HA21+36)/45.5))*Celc1+Celc2),\"\")","v":{"v":17.110488860674693,"d":"17.1"}},{"$f":"IF(Geg_dP<$AB21,IF($H21>$G21,1,IF(($GT21/$GR21)<0,0,$GT21/$GR21)),\"\")","v":{"v":0.7664165487671575,"d":"77%"}},{"$f":"IF(Geg_dP<$AB21,$CK21*($N21/Cubics)^2+$CL21*($N21/Cubics)^1+$CM21,\"\")","v":{"v":1142.7603685578915,"d":"1143"}},{"$f":"M21/((N21/Cubics)/3.6)","v":{"v":0.2489899421113967,"d":"0.25"}},{"$f":"(G21/Watts)/(N21/Cubics)","v":{"v":2.387023819014546,"d":"2.387"}},1.02106,1.10028,1.13249,1.02106,106.76,1.02106,1.10028,1.13249,{"v":104,"d":"104.00"},1.02106,1.10028,1.13249,{"v":158,"d":"158.00"},1.02106,1.10028,1.13249,106.76,{"$nulls":3},1000,{"$nulls":3},1000,{"$nulls":3},1000,{"$nulls":3},1000,{"$nulls":3},1000,null,null,{"v":10.6328192,"d":"1.06E+01"},{"v":5.14323272,"d":"5.14E+00"},{"v":5.856967585387631E-5,"d":"5.86E-05"},{"v":10.6328192,"d":"1.06E+01"},{"v":5.14323272,"d":"5.14E+00"},{"v":5.856967585387631E-5,"d":"5.86E-05"},{"v":2.14521801,"d":"2.15E+00"},{"$f":"BO21","v":{"v":5.14323272,"d":"5.14E+00"}},{"$f":"BP21","v":{"v":5.856967585387631E-5,"d":"5.86E-05"}},0,0,0,0,0,0,{"v":0,"d":"0.00E+00"},{"v":-6.57900378e-07,"d":"-6.58E-07"},{"v":0.000134994867,"d":"1.35E-04"},{"v":-0.0190746828,"d":"-1.91E-02"},{"v":-2.77528231,"d":"-2.78E+00"},{"v":450.174779,"d":"4.50E+02"},{"v":0,"d":"0.00E+00"},{"v":-1.0108768E-7,"d":"-1.01E-07"},{"v":7.43353717e-05,"d":"7.43E-05"},{"v":0.0276778802,"d":"2.77E-02"},{"v":12.8336918,"d":"1.28E+01"},{"v":0.000220503219,"d":"2.21E-04"},{"v":-0.825751803,"d":"-8.26E-01"},{"v":1469.80641,"d":"1.47E+03"},null,{"v":-1.75002364E-6,"d":"-1.75E-06"},{"v":0.000358753849,"d":"3.59E-04"},{"v":-0.030594376,"d":"-3.06E-02"},{"v":-2.50977718,"d":"-2.51E+00"},{"v":393.623549,"d":"3.94E+02"},null,{"v":-1.61412715e-07,"d":"-1.61E-07"},{"v":0.000105338782,"d":"1.05E-04"},{"v":0.0229727021,"d":"2.30E-02"},{"v":11.9685058,"d":"1.20E+01"},{"v":0.000125727516,"d":"1.26E-04"},{"v":-0.731752425,"d":"-7.32E-01"},{"v":1430.2211,"d":"1.43E+03"},null,{"v":-1.13740268E-7,"d":"-1.14E-07"},{"v":2.98606039e-05,"d":"2.99E-05"},{"v":-0.0116192424,"d":"-1.16E-02"},{"v":-2.12914472,"d":"-2.13E+00"},{"v":587.303999,"d":"5.87E+02"},null,{"v":-4.54190082e-08,"d":"-4.54E-08"},{"v":3.88037402e-05,"d":"3.88E-05"},{"v":0.0567992306,"d":"5.68E-02"},{"v":20.6340683,"d":"2.06E+01"},{"v":1.16822567E-4,"d":"1.17E-04"},{"v":-0.694650425,"d":"-6.95E-01"},{"v":1792.42768,"d":"1.79E+03"},null,{"v":-6.57900378e-07,"d":"-6.58E-07"},{"v":0.000134994867,"d":"1.35E-04"},{"v":-0.0190746828,"d":"-1.91E-02"},{"v":-2.77528231,"d":"-2.78E+00"},{"v":450.174779,"d":"4.50E+02"},null,{"v":-1.0108768E-7,"d":"-1.01E-07"},{"v":7.43353717e-05,"d":"7.43E-05"},{"v":0.0276778802,"d":"2.77E-02"},{"v":12.8336918,"d":"1.28E+01"},{"v":0.000220503219,"d":"2.21E-04"},{"v":-0.825751803,"d":"-8.26E-01"},{"v":1469.80641,"d":"1.47E+03"},{"$nulls":14},54.5,null,54.5,{"$nulls":5},{"$f":"IF($BK$17=\"11\",FA21,IF($BK$17=\"21\",FA21,IF($BK$17=\"12\",FC21,IF($BK$17=\"22\",FC21,IF($BK$17=\"13\",FD21,IF($BK$17=\"23\",FD21,IF($BK$17=\"14\",FB21,IF($BK$17=\"24\",FB21,IF($BK$17=\"31\",FE21,IF($BK$17=\"41\",FE21,IF($BK$17=\"32\",FG21,IF($BK$17=\"42\",FG21,IF($BK$17=\"33\",FH21,IF($BK$17=\"43\",FH21,IF($BK$17=\"34\",FF21,IF($BK$17=\"44\",FF21,))))))))))))))))","v":17.5},{"$f":"Tavg_cold","v":17},{"$f":"IF($GC21<=$FC21,$FC21,IF($FM21<=$FP21,$FC21,$FZ21))","v":17.5},{"$f":"IF($N21>$FN21,Tavg_cold+(0.5*(Tr_cool-Tavg_cold)),Tavg_cold+($FJ21*(Tr_cool-Tavg_cold)))","v":17.5},{"$nulls":6},{"$f":"0.5*(1-((FN21-N21)/FN21))","v":0.5},{"$f":"(0.025*Tl_cool)+0.5","v":{"v":1.175,"d":"1.18"}},null,{"$f":"FQ21/FO21","v":{"v":0.5555555555555556,"d":"55.56%"}},{"$f":"DU21","v":{"v":450.174779,"d":"450.2"}},{"$f":"FN21*1.8","v":{"v":810.3146022,"d":"810.3"}},{"$f":"FN21/FO21","v":{"v":0.5555555555555556,"d":"55.56%"}},{"$f":"N21/Cubics","v":{"v":450.174779,"d":"450.17"}},{"$f":"IF(FQ21-(FP21*FO21)<=0,0,FQ21-(FP21*FO21))","v":{"v":0,"d":"0.00"}},{"$f":"FO21*(1-FP21)","v":{"v":360.13982319999997,"d":"360.14"}},{"$f":"IF((FR21/FS21)>1,1,FR21/FS21)","v":{"v":0,"d":"0.00%"}},{"$f":"FC21","v":{"v":17.5,"d":"17.50"}},{"$f":"Tr_cool*FK21","v":21.150000000000002},{"$f":"ABS(FV21-FU21)","v":{"v":3.650000000000002,"d":"3.65"}},null,null,{"$f":"IF(FM21<=FP21,FU21,FU21+(FT21*FW21))","v":{"v":17.5,"d":"17.50"}},null,null,{"$f":"(237.3*LN((RH*EXP(17.27*(Tl_cool/(Tl_cool+237.3))))))/(17.27-LN((RH*EXP(17.27*(Tl_cool/(Tl_cool+237.3))))))","v":15.69066559142683},null,{"$f":"(H21-G21)/H21","v":{"v":0,"d":"0.0%"}},null,{"$f":"(611*EXP(17.27*(Tl_heat/(Tl_heat+237.7))))","v":{"v":2334.1781978570243,"d":"2334.18"}},{"$f":"(611*EXP(17.27*((($P21-Celc2)/Celc1)/((($P21-Celc2)/Celc1)+237.7))))","v":{"v":13836.221465208122,"d":"13836.22"}},{"$f":"RH*$GG21","v":{"v":1167.0890989285122,"d":"1167.09"}},{"$f":"(GL21*p_atm)/(GL21+0.622)","v":{"v":1167.089098928512,"d":"1167.09"}},{"$f":"0.622*($GI21/(p_atm-$GI21))","v":{"v":7.2478490515896785E-3,"d":"0.01"}},{"v":7.2478490515896785E-3,"d":"0.01"},{"$f":"(1.005*Tl_heat)+($GK21*(2500+(1.87*Tl_heat)))","v":{"v":38.49069218350365,"d":"38.49"}},{"$f":"(1.005*(($P21-Celc2)/Celc1))+($GL21*(2500+(1.87*(($P21-Celc2)/Celc1))))","v":{"v":71.50254862949757,"d":"71.50"}},{"v":0.08435027596683216,"d":"8%"},null,{"$f":"(611*EXP(17.27*(Tl_cool/(Tl_cool+237.7))))","v":{"v":3557.0118570174286,"d":"3557.01"}},{"$f":"(611*EXP(17.27*((($R21-Celc2)/Celc1)/((($R21-Celc2)/Celc1)+237.7))))","v":{"v":2320.5473986301363,"d":"2320.55"}},{"$f":"RH*$GQ21","v":{"v":1778.5059285087143,"d":"1778.51"}},{"$f":"(GW21*p_atm)/(GW21+0.622)","v":{"v":1778.5059285087143,"d":"1778.51"}},{"$f":"T21*GR21","v":{"v":1778.5059285087143,"d":"1778.51"}},{"$f":"0.622*($GS21/(p_atm-$GS21))","v":{"v":0.011112703645172665,"d":"0.0111"}},{"$f":"IF(H21=G21,GV21,(0.53475935828878*($GZ21-(1.005*(($R21-Celc2)/Celc1))))/(1336.8983957219))","v":{"v":0.011112703645172665,"d":"0.0111"}},{"$f":"0.622*($GU21/(p_atm-$GU21))","v":{"v":0.011112703645172665,"d":"0.01"}},{"$f":"(1.005*Tl_cool)+($GV21*(2500+(1.87*Tl_cool)))","v":{"v":55.47783951997643,"d":"55.48"}},{"$f":"GY21-((((H21-G21)/Watts)/1000)/(N21/$L$15))","v":{"v":55.47783951997643,"d":"55.48"}},{"$f":"(1.005*(($R21-Celc2)/Celc1))+($GX21*(2500+(1.87*(($R21-Celc2)/Celc1))))","v":{"v":48.200220227430705,"d":"48.20"}},{"v":19.415087041495514,"d":"19.42"},{"v":19.415087041495514,"d":"19.42"},null,450.174779,1074.5779201926093,17.5,17.5,{"$nulls":3},{"$f":"0.5*(1-((HP21-HE21)/HP21))","v":0.5},{"$f":"(0.025*Tl_cool)+0.5","v":{"v":1.175,"d":"1.18"}},null,{"$f":"HS21/HQ21","v":{"v":0.5555555555555556,"d":"55.56%"}},{"$f":"DU21","v":{"v":450.174779,"d":"450.2"}},{"v":810.3146022,"d":"810.3"},{"$f":"HP21/HQ21","v":{"v":0.5555555555555556,"d":"55.56%"}},{"v":450.174779,"d":"450.17"},{"$f":"IF(HS21-(HR21*HQ21)<=0,0,HS21-(HR21*HQ21))","v":{"v":0,"d":"0.00"}},{"$f":"HQ21*(1-HR21)","v":{"v":360.13982319999997,"d":"360.14"}},{"$f":"IF((HT21/HU21)>1,1,HT21/HU21)","v":{"v":0,"d":"0.00%"}},{"v":17.5,"d":"17.50"},{"$f":"Tr_cool*HM21","v":21.150000000000002},{"$f":"ABS(HX21-HW21)","v":{"v":3.650000000000002,"d":"3.65"}},null,null,{"$f":"IF(HO21<=HR21,HW21,HW21+(HV21*HY21))","v":{"v":17.5,"d":"17.50"}},null,null,{"$f":"(237.3*LN((RH*EXP(17.27*(Tl_cool/(Tl_cool+237.3))))))/(17.27-LN((RH*EXP(17.27*(Tl_cool/(Tl_cool+237.3))))))","v":15.69066559142683},null,{"$f":"(BG21-BF21)/BG21","v":{"$error":"#DIV/0!"}},null,{"$f":"(611*EXP(17.27*(Tl_heat/(Tl_heat+237.7))))","v":{"v":2334.1781978570243,"d":"2334.18"}},{"$f":"(611*EXP(17.27*((($P21-Celc2)/Celc1)/((($P21-Celc2)/Celc1)+237.7))))","v":{"v":13836.221465208122,"d":"13836.22"}}]
[null,{"v":1,"d":"100%"},10,{"$f":"IF(Geg_dP<AB22,((($BK$18*($N22/Cubics)^4+$BK$19*($N22/Cubics)^3+$BK$20*($N22/Cubics)^2+$BK$21*($N22/Cubics)^1+$BK$22)*((CF_Regime_Heat_noExp)^$AA22)))*CF_Addit*Watts*CF_Altit,Lim_dP)","v":{"v":5490.6296081231185,"d":"5491"}},{"$f":"IF(Geg_dP<$AB22,ROUND((($D22/Watts)/((Tv_heat-Tr_heat)*1.163))*FlowH2O,IF(UnitsNo=1,0,IF(UnitsNo=2,2))),\"\")","v":472},{"$f":"IF(Geg_dP<$AB22,IF((($BM$18*(E22/FlowH2O)^$BM$19))*kPa>0,(($BM$18*(E22/FlowH2O)^$BM$19))*kPa,0),\"\")","v":{"v":4.7984866261193035,"d":"4.8"}},{"$f":"IF(Geg_dP<$AB22,((($BL$18*($N22/Cubics)^4+$BL$19*($N22/Cubics)^3+$BL$20*($N22/Cubics)^2+$BL$21*($N22/Cubics)^1+$BL$22)*((CF_Regime_Cool_noExp)^$Y22)))*CF_Addit*Watts*CF_Altit,Lim_dP)","v":{"v":1168.9674964689752,"d":"1169"}},{"$f":"IF(Geg_dP<$AB22,((G22/Watts)/(IF((237.3*LN((RH*EXP(17.27*(Tl_cool/(Tl_cool+237.3))))))/(17.27-LN((RH*EXP(17.27*(Tl_cool/(Tl_cool+237.3))))))<EZ22,1,IF(1/(1+((2258*((0.622/((101325/(1*611*EXP(17.27*(EZ22/(EZ22+237.3))))))-1)*1000-(0.622/((101325/(RH*611*EXP(17.27*(Tl_cool/(Tl_cool+237.3))))))-1)*1000))/(1005*(Tavg_cold-Tl_cool))))>1,1,1/(1+((2258*((0.622/((101325/(1*611*EXP(17.27*(EZ22/(EZ22+237.3))))))-1)*1000-(0.622/((101325/(RH*611*EXP(17.27*(Tl_cool/(Tl_cool+237.3))))))-1)*1000))/(1005*(Tavg_cold-Tl_cool))))))))*Watts,\"\")","v":{"v":1168.9674964689752,"d":"1169"}},{"$f":"IF(Geg_dP<AB22,ROUND(((H22/Watts)/((Tr_cool-Tv_cool)*1.163))*FlowH2O,IF(UnitsNo=1,0,IF(UnitsNo=2,2))),\"\")","v":503},{"$f":"IF(Geg_dP<$AB22,IF((($BM$21*(I22/FlowH2O)^$BM$22))*kPa>0,(($BM$21*(I22/FlowH2O)^$BM$22))*kPa,0),\"\")","v":{"v":5.393462830825165,"d":"5.4"}},{"$f":"IF(Geg_dP<AB22,IF($L22-8<0,0,$L22-8),\"\")","v":{"v":51,"d":"51.0"}},{"$f":"IF(Geg_dP<$AB22,IF(CalcNo=\"12\",$ET22,IF(CalcNo=\"22\",$ET22,IF(CalcNo=\"13\",$EU22,IF(CalcNo=\"23\",$EU22,IF(CalcNo=\"11\",$ER22,IF(CalcNo=\"21\",$ER22,IF(CalcNo=\"14\",$ES22,IF(CalcNo=\"24\",$ES22,IF(CalcNo=\"32\",$EX22,IF(CalcNo=\"42\",$EX22,IF(CalcNo=\"33\",$EY22,IF(CalcNo=\"43\",$EY22,IF(CalcNo=\"31\",$EV22,IF(CalcNo=\"41\",$EV22,IF(CalcNo=\"34\",$EW22,IF(CalcNo=\"44\",$EW22,)))))))))))))))),\"\")","v":{"v":59,"d":"59.0"}},{"$f":"IF(Geg_dP<$AB22,($CF22*(($N22*CFMs)^4))+($CG22*(($N22*CFMs)^3))+($CH22*(($N22*CFMs)^2))+($CI22*($N22*CFMs))+$CJ22,\"\")","v":{"v":41.09229623443275,"d":"41.1"}},{"$f":"IF(Geg_dP<$AB22,(BZ22*Geg_dP^5+CA22*Geg_dP^4+CB22*Geg_dP^3+CC22*Geg_dP^2+CD22*Geg_dP+CE22)*CF_Case*Cubics,\"\")","v":{"v":500.134295,"d":"500"}},{"$f":"IF(Geg_dP<$AB22,(($N22/Cubics)/3600)/(($BJ$23/100)*($BP$23/100))*FeetMins,\"\")","v":{"v":1.1481503558310375,"d":"1.15"}},{"$f":"IF(Geg_dP<$AB22,((($D22/Watts)/(((p_atm*0.028964)/(8.31447*(20+273.15)))*(($N22/3600)/Cubics)*(1005+1870*((0.622)/(((p_atm)/($E$14*pvs_heat_in))-1)))))+Tl_heat)*Celc1+Celc2,\"\")","v":{"v":52.22487934662713,"d":"52.2"}},{"$f":"IF(Geg_dP<$AB22,(27.8*LN(($GN22+36)/45.5))*Celc1+Celc2,\"\")","v":{"v":23.85355961977243,"d":"23.9"}},{"$f":"IF(Geg_dP<$AB22,(Tl_cool-(($G22/Watts)/(1006*$N22*kgss)))*Celc1+Celc2,\"\")","v":{"v":20.053055441326705,"d":"20.1"}},{"$f":"IF(Geg_dP<$AB22,IF((27.8*LN(($HA22+36)/45.5))*Celc1+Celc2>R22,R22,(27.8*LN(($HA22+36)/45.5))*Celc1+Celc2),\"\")","v":{"v":17.160489433954407,"d":"17.2"}},{"$f":"IF(Geg_dP<$AB22,IF($H22>$G22,1,IF(($GT22/$GR22)<0,0,$GT22/$GR22)),\"\")","v":{"v":0.7594466736510744,"d":"76%"}},{"$f":"IF(Geg_dP<$AB22,$CK22*($N22/Cubics)^2+$CL22*($N22/Cubics)^1+$CM22,\"\")","v":{"v":1247.4857962866836,"d":"1247"}},{"$f":"M22/((N22/Cubics)/3.6)","v":{"v":0.2957850879711376,"d":"0.30"}},{"$f":"(G22/Watts)/(N22/Cubics)","v":{"v":2.337307215592914,"d":"2.337"}},1.02106,1.10028,1.13249,1.02106,132.32,1.02106,1.10028,1.13249,{"v":130,"d":"130.00"},1.02106,1.10028,1.13249,{"v":160,"d":"160.00"},1.02106,1.10028,1.13249,132.32,{"$nulls":3},1000,{"$nulls":3},1000,{"$nulls":3},1000,{"$nulls":3},1000,{"$nulls":3},1000,null,null,{"v":-199.381805,"d":"-1.99E+02"},{"v":19.9373476,"d":"1.99E+01"},{"v":1.8375235778256551,"d":"1.84E+00"},{"v":-199.381805,"d":"-1.99E+02"},{"v":19.9373476,"d":"1.99E+01"},{"v":1.8375235778256551,"d":"1.84E+00"},{"v":284.465661,"d":"2.84E+02"},{"v":19.9373476,"d":"1.99E+01"},{"$f":"BP22","v":{"v":1.8375235778256551,"d":"1.84E+00"}},0,0,0,0,0,0,{"v":0,"d":"0.00E+00"},{"v":-5.9409897e-07,"d":"-5.94E-07"},{"v":0.000152766786,"d":"1.53E-04"},{"v":-0.019894911,"d":"-1.99E-02"},{"v":-2.32427141,"d":"-2.32E+00"},{"v":500.134295,"d":"5.00E+02"},{"v":0,"d":"0.00E+00"},{"v":-4.12630845E-7,"d":"-4.13E-07"},{"v":0.000191496176,"d":"1.91E-04"},{"v":0.0639300847,"d":"6.39E-02"},{"v":16.2050758,"d":"1.62E+01"},{"v":0.000221133456,"d":"2.21E-04"},{"v":-0.899365717,"d":"-8.99E-01"},{"v":1641.97637,"d":"1.64E+03"},null,{"v":-2.30874124e-06,"d":"-2.31E-06"},{"v":0.000543318745,"d":"5.43E-04"},{"v":-0.0446109236,"d":"-4.46E-02"},{"v":-1.76933104,"d":"-1.77E+00"},{"v":453.006504,"d":"4.53E+02"},null,{"v":-7.42482315E-7,"d":"-7.42E-07"},{"v":0.000331558582,"d":"3.32E-04"},{"v":0.0465247736,"d":"4.65E-02"},{"v":16.3986311,"d":"1.64E+01"},{"v":-2.46261162e-05,"d":"-2.46E-05"},{"v":-0.725983856,"d":"-7.26E-01"},{"v":1621.898,"d":"1.62E+03"},null,{"v":-3.51508638e-06,"d":"-3.52E-06"},{"v":0.000843142509,"d":"8.43E-04"},{"v":-0.0655930879,"d":"-6.56E-02"},{"v":-0.699193444,"d":"-6.99E-01"},{"v":677.341451,"d":"6.77E+02"},null,{"v":-6.46420982e-07,"d":"-6.46E-07"},{"v":0.00030023873,"d":"3.00E-04"},{"v":0.147500204,"d":"1.48E-01"},{"v":20.9314262,"d":"2.09E+01"},{"v":-0.000874453284,"d":"-8.74E-04"},{"v":0.295186952,"d":"2.95E-01"},{"v":1806.96118,"d":"1.81E+03"},null,{"v":-5.9409897e-07,"d":"-5.94E-07"},{"v":0.000152766786,"d":"1.53E-04"},{"v":-0.019894911,"d":"-1.99E-02"},{"v":-2.32427141,"d":"-2.32E+00"},{"v":500.134295,"d":"5.00E+02"},null,{"v":-4.12630845E-7,"d":"-4.13E-07"},{"v":0.000191496176,"d":"1.91E-04"},{"v":0.0639300847,"d":"6.39E-02"},{"v":16.2050758,"d":"1.62E+01"},{"v":0.000221133456,"d":"2.21E-04"},{"v":-0.899365717,"d":"-8.99E-01"},{"v":1641.97637,"d":"1.64E+03"},{"$nulls":14},59,null,59,{"$nulls":5},{"$f":"IF($BK$17=\"11\",FA22,IF($BK$17=\"21\",FA22,IF($BK$17=\"12\",FC22,IF($BK$17=\"22\",FC22,IF($BK$17=\"13\",FD22,IF($BK$17=\"23\",FD22,IF($BK$17=\"14\",FB22,IF($BK$17=\"24\",FB22,IF($BK$17=\"31\",FE22,IF($BK$17=\"41\",FE22,IF($BK$17=\"32\",FG22,IF($BK$17=\"42\",FG22,IF($BK$17=\"33\",FH22,IF($BK$17=\"43\",FH22,IF($BK$17=\"34\",FF22,IF($BK$17=\"44\",FF22,))))))))))))))))","v":17.5},{"$f":"Tavg_cold","v":17},{"$f":"IF($GC22<=$FC22,$FC22,IF($FM22<=$FP22,$FC22,$FZ22))","v":17.5},{"$f":"IF($N22>$FN22,Tavg_cold+(0.5*(Tr_cool-Tavg_cold)),Tavg_cold+($FJ22*(Tr_cool-Tavg_cold)))","v":17.5},{"$nulls":6},{"$f":"0.5*(1-((FN22-N22)/FN22))","v":0.5},{"$f":"(0.025*Tl_cool)+0.5","v":{"v":1.175,"d":"1.18"}},null,{"$f":"FQ22/FO22","v":{"v":0.5555555555555555,"d":"55.56%"}},{"$f":"DU22","v":{"v":500.134295,"d":"500.1"}},{"$f":"FN22*1.8","v":{"v":900.2417310000001,"d":"900.2"}},{"$f":"FN22/FO22","v":{"v":0.5555555555555555,"d":"55.56%"}},{"$f":"N22/Cubics","v":{"v":500.134295,"d":"500.13"}},{"$f":"IF(FQ22-(FP22*FO22)<=0,0,FQ22-(FP22*FO22))","v":{"v":5.684341886080802e-14,"d":"0.00"}},{"$f":"FO22*(1-FP22)","v":{"v":400.1074360000001,"d":"400.11"}},{"$f":"IF((FR22/FS22)>1,1,FR22/FS22)","v":{"v":1.4207038846638181E-16,"d":"0.00%"}},{"$f":"FC22","v":{"v":17.5,"d":"17.50"}},{"$f":"Tr_cool*FK22","v":21.150000000000002},{"$f":"ABS(FV22-FU22)","v":{"v":3.650000000000002,"d":"3.65"}},null,null,{"$f":"IF(FM22<=FP22,FU22,FU22+(FT22*FW22))","v":{"v":17.5,"d":"17.50"}},null,null,{"$f":"(237.3*LN((RH*EXP(17.27*(Tl_cool/(Tl_cool+237.3))))))/(17.27-LN((RH*EXP(17.27*(Tl_cool/(Tl_cool+237.3))))))","v":15.69066559142683},null,{"$f":"(H22-G22)/H22","v":{"v":0,"d":"0.0%"}},null,{"$f":"(611*EXP(17.27*(Tl_heat/(Tl_heat+237.7))))","v":{"v":2334.1781978570243,"d":"2334.18"}},{"$f":"(611*EXP(17.27*((($P22-Celc2)/Celc1)/((($P22-Celc2)/Celc1)+237.7))))","v":{"v":13711.420823515078,"d":"13711.42"}},{"$f":"RH*$GG22","v":{"v":1167.0890989285122,"d":"1167.09"}},{"$f":"(GL22*p_atm)/(GL22+0.622)","v":{"v":1167.089098928512,"d":"1167.09"}},{"$f":"0.622*($GI22/(p_atm-$GI22))","v":{"v":7.2478490515896785E-3,"d":"0.01"}},{"v":7.2478490515896785E-3,"d":"0.01"},{"$f":"(1.005*Tl_heat)+($GK22*(2500+(1.87*Tl_heat)))","v":{"v":38.49069218350365,"d":"38.49"}},{"$f":"(1.005*(($P22-Celc2)/Celc1))+($GL22*(2500+(1.87*(($P22-Celc2)/Celc1))))","v":{"v":71.31345511132669,"d":"71.31"}},{"v":0.08511802780693266,"d":"9%"},null,{"$f":"(611*EXP(17.27*(Tl_cool/(Tl_cool+237.7))))","v":{"v":3557.0118570174286,"d":"3557.01"}},{"$f":"(611*EXP(17.27*((($R22-Celc2)/Celc1)/((($R22-Celc2)/Celc1)+237.7))))","v":{"v":2341.8443851475,"d":"2341.84"}},{"$f":"RH*$GQ22","v":{"v":1778.5059285087143,"d":"1778.51"}},{"$f":"(GW22*p_atm)/(GW22+0.622)","v":{"v":1778.5059285087143,"d":"1778.51"}},{"$f":"T22*GR22","v":{"v":1778.5059285087145,"d":"1778.51"}},{"$f":"0.622*($GS22/(p_atm-$GS22))","v":{"v":0.011112703645172665,"d":"0.0111"}},{"$f":"IF(H22=G22,GV22,(0.53475935828878*($GZ22-(1.005*(($R22-Celc2)/Celc1))))/(1336.8983957219))","v":{"v":0.011112703645172665,"d":"0.0111"}},{"$f":"0.622*($GU22/(p_atm-$GU22))","v":{"v":0.011112703645172667,"d":"0.01"}},{"$f":"(1.005*Tl_cool)+($GV22*(2500+(1.87*Tl_cool)))","v":{"v":55.47783951997643,"d":"55.48"}},{"$f":"GY22-((((H22-G22)/Watts)/1000)/(N22/$L$15))","v":{"v":55.47783951997643,"d":"55.48"}},{"$f":"(1.005*(($R22-Celc2)/Celc1))+($GX22*(2500+(1.87*(($R22-Celc2)/Celc1))))","v":{"v":48.351797479965406,"d":"48.35"}},{"v":19.415087041495514,"d":"19.42"},{"v":19.415087041495514,"d":"19.42"},null,500.134295,1168.9674964689752,17.5,17.5,{"$nulls":3},{"$f":"0.5*(1-((HP22-HE22)/HP22))","v":0.5},{"$f":"(0.025*Tl_cool)+0.5","v":{"v":1.175,"d":"1.18"}},null,{"$f":"HS22/HQ22","v":{"v":0.5555555555555555,"d":"55.56%"}},{"$f":"DU22","v":{"v":500.134295,"d":"500.1"}},{"v":900.2417310000001,"d":"900.2"},{"$f":"HP22/HQ22","v":{"v":0.5555555555555555,"d":"55.56%"}},{"v":500.134295,"d":"500.13"},{"$f":"IF(HS22-(HR22*HQ22)<=0,0,HS22-(HR22*HQ22))","v":{"v":5.684341886080802e-14,"d":"0.00"}},{"$f":"HQ22*(1-HR22)","v":{"v":400.1074360000001,"d":"400.11"}},{"$f":"IF((HT22/HU22)>1,1,HT22/HU22)","v":{"v":1.4207038846638181E-16,"d":"0.00%"}},{"v":17.5,"d":"17.50"},{"$f":"Tr_cool*HM22","v":21.150000000000002},{"$f":"ABS(HX22-HW22)","v":{"v":3.650000000000002,"d":"3.65"}},null,null,{"$f":"IF(HO22<=HR22,HW22,HW22+(HV22*HY22))","v":{"v":17.5,"d":"17.50"}},null,null,{"$f":"(237.3*LN((RH*EXP(17.27*(Tl_cool/(Tl_cool+237.3))))))/(17.27-LN((RH*EXP(17.27*(Tl_cool/(Tl_cool+237.3))))))","v":15.69066559142683},null,{"$f":"(BG22-BF22)/BG22","v":{"$error":"#DIV/0!"}},null,{"$f":"(611*EXP(17.27*(Tl_heat/(Tl_heat+237.7))))","v":{"v":2334.1781978570243,"d":"2334.18"}},{"$f":"(611*EXP(17.27*((($P22-Celc2)/Celc1)/((($P22-Celc2)/Celc1)+237.7))))","v":{"v":13711.420823515078,"d":"13711.42"}}]
[null,{"$f":"IF(LangNo=1,NL!A23,IF(LangNo=2,EN!A23,IF(LangNo=3,DE!A23,IF(LangNo=4,FR!A23,IF(LangNo=5,NR!A23,IF(LangNo=6,SP!A23,IF(LangNo=7,SW!A23,IF(LangNo=8,TS!A23,IF(LangNo=9,ExtraTaal1!A23,IF(LangNo=10,ExtraTaal2!A23,IF(LangNo=11,ExtraTaal3!A23,)))))))))))","v":"Briza 22 (230V) height 54,5 cm, width 22 cm, length 75 cm (Type 03)"},{"$f":"IF(LangNo=1,NL!B21,IF(LangNo=2,EN!B21,IF(LangNo=3,DE!B21,IF(LangNo=4,FR!B21,IF(LangNo=5,NR!B21,IF(LangNo=6,SP!B21,IF(LangNo=7,SW!B21,IF(LangNo=8,TS!B21,IF(LangNo=9,ExtraTaal1!B21,IF(LangNo=10,ExtraTaal2!B21,IF(LangNo=11,ExtraTaal3!B21,)))))))))))","v":0},{"$f":"IF(LangNo=1,NL!C21,IF(LangNo=2,EN!C21,IF(LangNo=3,DE!C21,IF(LangNo=4,FR!C21,IF(LangNo=5,NR!C21,IF(LangNo=6,SP!C21,IF(LangNo=7,SW!C21,IF(LangNo=8,TS!C21,IF(LangNo=9,ExtraTaal1!C21,IF(LangNo=10,ExtraTaal2!C21,IF(LangNo=11,ExtraTaal3!C21,)))))))))))","v":0},{"$f":"IF(LangNo=1,NL!D21,IF(LangNo=2,EN!D21,IF(LangNo=3,DE!D21,IF(LangNo=4,FR!D21,IF(LangNo=5,NR!D21,IF(LangNo=6,SP!D21,IF(LangNo=7,SW!D21,IF(LangNo=8,TS!D21,IF(LangNo=9,ExtraTaal1!D21,IF(LangNo=10,ExtraTaal2!D21,IF(LangNo=11,ExtraTaal3!D21,)))))))))))","v":0},{"$f":"IF(LangNo=1,NL!E21,IF(LangNo=2,EN!E21,IF(LangNo=3,DE!E21,IF(LangNo=4,FR!E21,IF(LangNo=5,NR!E21,IF(LangNo=6,SP!E21,IF(LangNo=7,SW!E21,IF(LangNo=8,TS!E21,IF(LangNo=9,ExtraTaal1!E21,IF(LangNo=10,ExtraTaal2!E21,IF(LangNo=11,ExtraTaal3!E21,)))))))))))","v":0},{"$f":"IF(LangNo=1,NL!F21,IF(LangNo=2,EN!F21,IF(LangNo=3,DE!F21,IF(LangNo=4,FR!F21,IF(LangNo=5,NR!F21,IF(LangNo=6,SP!F21,IF(LangNo=7,SW!F21,IF(LangNo=8,TS!F21,IF(LangNo=9,ExtraTaal1!F21,IF(LangNo=10,ExtraTaal2!F21,IF(LangNo=11,ExtraTaal3!F21,)))))))))))","v":0},{"$f":"IF(LangNo=1,NL!G21,IF(LangNo=2,EN!G21,IF(LangNo=3,DE!G21,IF(LangNo=4,FR!G21,IF(LangNo=5,NR!G21,IF(LangNo=6,SP!G21,IF(LangNo=7,SW!G21,IF(LangNo=8,TS!G21,IF(LangNo=9,ExtraTaal1!G21,IF(LangNo=10,ExtraTaal2!G21,IF(LangNo=11,ExtraTaal3!G21,)))))))))))","v":0},{"$f":"IF(LangNo=1,NL!H21,IF(LangNo=2,EN!H21,IF(LangNo=3,DE!H21,IF(LangNo=4,FR!H21,IF(LangNo=5,NR!H21,IF(LangNo=6,SP!H21,IF(LangNo=7,SW!H21,IF(LangNo=8,TS!H21,IF(LangNo=9,ExtraTaal1!H21,IF(LangNo=10,ExtraTaal2!H21,IF(LangNo=11,ExtraTaal3!H21,)))))))))))","v":0},{"$f":"IF(LangNo=1,NL!I21,IF(LangNo=2,EN!I21,IF(LangNo=3,DE!I21,IF(LangNo=4,FR!I21,IF(LangNo=5,NR!I21,IF(LangNo=6,SP!I21,IF(LangNo=7,SW!I21,IF(LangNo=8,TS!I21,IF(LangNo=9,ExtraTaal1!I21,IF(LangNo=10,ExtraTaal2!I21,IF(LangNo=11,ExtraTaal3!I21,)))))))))))","v":0},{"$f":"IF(LangNo=1,NL!J21,IF(LangNo=2,EN!J21,IF(LangNo=3,DE!J21,IF(LangNo=4,FR!J21,IF(LangNo=5,NR!J21,IF(LangNo=6,SP!J21,IF(LangNo=7,SW!J21,IF(LangNo=8,TS!J21,IF(LangNo=9,ExtraTaal1!J21,IF(LangNo=10,ExtraTaal2!J21,IF(LangNo=11,ExtraTaal3!J21,)))))))))))","v":0},{"$f":"IF(LangNo=1,NL!K21,IF(LangNo=2,EN!K21,IF(LangNo=3,DE!K21,IF(LangNo=4,FR!K21,IF(LangNo=5,NR!K21,IF(LangNo=6,SP!K21,IF(LangNo=7,SW!K21,IF(LangNo=8,TS!K21,IF(LangNo=9,ExtraTaal1!K21,IF(LangNo=10,ExtraTaal2!K21,IF(LangNo=11,ExtraTaal3!K21,)))))))))))","v":0},{"$f":"IF(LangNo=1,NL!L21,IF(LangNo=2,EN!L21,IF(LangNo=3,DE!L21,IF(LangNo=4,FR!L21,IF(LangNo=5,NR!L21,IF(LangNo=6,SP!L21,IF(LangNo=7,SW!L21,IF(LangNo=8,TS!L21,IF(LangNo=9,ExtraTaal1!L21,IF(LangNo=10,ExtraTaal2!L21,IF(LangNo=11,ExtraTaal3!L21,)))))))))))","v":0},{"$nulls":13},0,"m³/h","n-value","n-value","n-value","m³/h","n-value","n-value","n-value","m³/h","n-value","n-value","n-value","m³/h","n-value","n-value","n-value","m³/h","n-value","n-value","n-value","m³/h","n-value","n-value","n-value","m³/h","n-value","n-value","n-value","m³/h","n-value","n-value","n-value","m³/h",null,{"$f":"IF($BK$17=\"11\",BO23,IF($BK$17=\"21\",BR23,IF($BK$17=\"12\",BO23,IF($BK$17=\"22\",BR23,IF($BK$17=\"13\",BO23,IF($BK$17=\"23\",BR23,IF($BK$17=\"14\",BO23,IF($BK$17=\"24\",BR23,IF($BK$17=\"31\",BU23,IF($BK$17=\"41\",BX23,IF($BK$17=\"32\",BU23,IF($BK$17=\"42\",BX23,IF($BK$17=\"33\",BU23,IF($BK$17=\"43\",BX23,IF($BK$17=\"34\",BU23,IF($BK$17=\"44\",BX23,))))))))))))))))","v":22},{"$f":"(BN23+IF(CaseNo=1,0,IF(CaseNo=2,$BN$2,)))*MilInch","v":54.5},{"$f":"(BJ23+IF(CaseNo=1,0,IF(CaseNo=2,$BN$3,)))*MilInch","v":22},{"$f":"(BP23+IF(CaseNo=1,0,IF(CaseNo=2,$BN$4,)))*MilInch","v":55},54.5,22,55,54.5,22,55,54.5,26,55,54.5,26,55,{"$f":"CF23","v":"T03"},{"$nulls":5},"T03",{"$nulls":7},{"$f":"CF23","v":"T03"},{"$nulls":13},{"$f":"CF23","v":"T03"},{"$nulls":13},{"$f":"CF23","v":"T03"},{"$nulls":13},{"$f":"CF23","v":"T03"},{"$nulls":13},"T03",{"$nulls":8},{"$f":"ER23","v":"T03"},{"$nulls":55},{"$error":"#VALUE!"},{"$error":"#VALUE!"},{"$error":"#VALUE!"},{"$error":"#VALUE!"},{"$nulls":3},"T03"]
[null,{"$f":"IF($AL$5=1,$C24/10,IF($AL$5=2,$C24/10,IF($AL$5=3,0,IF($AL$5=4,$C24/10,))))","v":{"v":0.2,"d":"20%"}},2,{"$f":"IF(Geg_dP<AB24,((($BK$24*($N24/Cubics)^4+$BK$25*($N24/Cubics)^3+$BK$27*($N24/Cubics)^2+$BK$29*($N24/Cubics)^1+$BK$30)*((CF_Regime_Heat_noExp)^$AA24)))*CF_Addit*Watts*CF_Altit,Lim_dP)","v":{"v":2414.055412783147,"d":"2414"}},{"$f":"IF(Geg_dP<$AB24,ROUND((($D24/Watts)/((Tv_heat-Tr_heat)*1.163))*FlowH2O,IF(UnitsNo=1,0,IF(UnitsNo=2,2))),\"\")","v":208},{"$f":"IF(Geg_dP<$AB24,IF((($BM$24*(E24/FlowH2O)^$BM$25))*kPa>0,(($BM$24*(E24/FlowH2O)^$BM$25))*kPa,0),\"\")","v":{"v":1.2996392386829112,"d":"1.3"}},{"$f":"IF(Geg_dP<$AB24,((($BL$24*($N24/Cubics)^4+$BL$25*($N24/Cubics)^3+$BL$27*($N24/Cubics)^2+$BL$29*($N24/Cubics)^1+$BL$30)*((CF_Regime_Cool_noExp)^$Y24)))*CF_Addit*Watts*CF_Altit,Lim_dP)","v":{"v":508.18297018770477,"d":"508"}},{"$f":"IF(Geg_dP<$AB24,((G24/Watts)/(IF((237.3*LN((RH*EXP(17.27*(Tl_cool/(Tl_cool+237.3))))))/(17.27-LN((RH*EXP(17.27*(Tl_cool/(Tl_cool+237.3))))))<EZ24,1,IF(1/(1+((2258*((0.622/((101325/(1*611*EXP(17.27*(EZ24/(EZ24+237.3))))))-1)*1000-(0.622/((101325/(RH*611*EXP(17.27*(Tl_cool/(Tl_cool+237.3))))))-1)*1000))/(1005*(Tavg_cold-Tl_cool))))>1,1,1/(1+((2258*((0.622/((101325/(1*611*EXP(17.27*(EZ24/(EZ24+237.3))))))-1)*1000-(0.622/((101325/(RH*611*EXP(17.27*(Tl_cool/(Tl_cool+237.3))))))-1)*1000))/(1005*(Tavg_cold-Tl_cool))))))))*Watts,\"\")","v":{"v":508.18297018770477,"d":"508"}},{"$f":"IF(Geg_dP<AB24,ROUND(((IF('Briza 22 & 26'!$M$4=\"High Perform. 208/230V (US/EU)\",cal!HK24,H24)/Watts)/((Tr_cool-Tv_cool)*1.163))*FlowH2O,IF(UnitsNo=1,0,IF(UnitsNo=2,2))),\"\")","v":218},{"$f":"IF(Geg_dP<$AB24,IF((($BM$29*(I24/FlowH2O)^$BM$30))*kPa>0,(($BM$29*(I24/FlowH2O)^$BM$30))*kPa,0),\"\")","v":{"v":1.416197316226643,"d":"1.4"}},{"$f":"IF(Geg_dP<AB24,IF($L24-8<0,0,$L24-8),\"\")","v":20.5},{"$f":"IF(Geg_dP<$AB24,IF(CalcNo=\"12\",$ET24,IF(CalcNo=\"22\",$ET24,IF(CalcNo=\"13\",$EU24,IF(CalcNo=\"23\",$EU24,IF(CalcNo=\"11\",$ER24,IF(CalcNo=\"21\",$ER24,IF(CalcNo=\"14\",$ES24,IF(CalcNo=\"24\",$ES24,IF(CalcNo=\"32\",$EX24,IF(CalcNo=\"42\",$EX24,IF(CalcNo=\"33\",$EY24,IF(CalcNo=\"43\",$EY24,IF(CalcNo=\"31\",$EV24,IF(CalcNo=\"41\",$EV24,IF(CalcNo=\"34\",$EW24,IF(CalcNo=\"44\",$EW24,)))))))))))))))),\"\")","v":28.5},{"$f":"IF(Geg_dP<$AB24,($CF24*(($N24/Cubics)^4))+($CG24*(($N24/Cubics)^3))+($CH24*(($N24/Cubics)^2))+($CI24*($N24/Cubics))+$CJ24,\"\")","v":{"v":3.6631675496846254,"d":"3.7"}},{"$f":"IF(Geg_dP<$AB24,(BZ24*Geg_dP^5+CA24*Geg_dP^4+CB24*Geg_dP^3+CC24*Geg_dP^2+CD24*Geg_dP+CE24)*CF_Case*Cubics,\"\")","v":{"v":178.414262,"d":"178"}},{"$f":"IF(Geg_dP<$AB24,(($N24/Cubics)/3600)/(($BJ$31/100)*($BP$31/100))*FeetMins,\"\")","v":{"v":0.30036071043771045,"d":"0.30"}},{"$f":"IF(Geg_dP<$AB24,((($D24/Watts)/(((p_atm*0.028964)/(8.31447*(20+273.15)))*(($N24/3600)/Cubics)*(1005+1870*((0.622)/(((p_atm)/($E$14*pvs_heat_in))-1)))))+Tl_heat)*Celc1+Celc2,\"\")","v":{"v":59.71672730673983,"d":"59.7"}},{"$f":"IF(Geg_dP<$AB24,(27.8*LN(($GN24+36)/45.5))*Celc1+Celc2,\"\")","v":{"v":25.76324307819888,"d":"25.8"}},{"$f":"IF(Geg_dP<$AB24,(Tl_cool-(($G24/Watts)/(1006*$N24*kgss)))*Celc1+Celc2,\"\")","v":{"v":18.534188923730937,"d":"18.5"}},{"$f":"IF(Geg_dP<$AB24,IF((27.8*LN(($HA24+36)/45.5))*Celc1+Celc2>R24,R24,(27.8*LN(($HA24+36)/45.5))*Celc1+Celc2),\"\")","v":{"v":16.64220680497453,"d":"16.6"}},{"$f":"IF(Geg_dP<$AB24,IF($H24>$G24,1,IF(($GT24/$GR24)<0,0,$GT24/$GR24)),\"\")","v":{"v":0.834636453120847,"d":"83%"}},{"$f":"IF(Geg_dP<$AB24,$CK24*($N24/Cubics)^2+$CL24*($N24/Cubics)^1+$CM24,\"\")","v":{"v":438.3206188255052,"d":"438"}},{"$f":"M24/((N24/Cubics)/3.6)","v":{"v":0.07391451238839107,"d":"0.07"}},{"$f":"(G24/Watts)/(N24/Cubics)","v":{"v":2.848331543067475,"d":"2.848"}},0.980228,1.29011,1.13171,0.980228,9.74,0.980228,1.29011,1.13171,{"v":5,"d":"5.00"},0.980228,1.29011,1.13171,{"v":7.5,"d":"7.50"},0.980228,1.29011,1.13171,9.74,1.0471988669409447,1.2021874904764758,1.1584541354089894,20.68,{"$nulls":3},1000,{"$nulls":3},1000,{"$nulls":3},1000,{"$nulls":3},1000,null,null,{"$f":"IF($BK$17=\"11\",BN24,IF($BK$17=\"21\",BQ24,IF($BK$17=\"12\",BN24,IF($BK$17=\"22\",BQ24,IF($BK$17=\"13\",BN24,IF($BK$17=\"23\",BQ24,IF($BK$17=\"14\",BN24,IF($BK$17=\"24\",BQ24,IF($BK$17=\"31\",BT24,IF($BK$17=\"41\",BW24,IF($BK$17=\"32\",BT24,IF($BK$17=\"42\",BW24,IF($BK$17=\"33\",BT24,IF($BK$17=\"43\",BW24,IF($BK$17=\"34\",BT24,IF($BK$17=\"44\",BW24,))))))))))))))))","v":{"v":0,"d":"0.00E+00"}},{"v":0,"d":"0.00E+00"},{"v":7.47950756732502e-05,"d":"7.48E-05"},null,null,{"$f":"BP29","v":{"v":7.47950756732502e-05,"d":"7.48E-05"}},null,{"$f":"BO24","v":0},{"v":6.8063317012543245E-4,"d":"6.81E-04"},0,0,0,0,0,0,{"$f":"IF($BK$17=\"11\",CN24,IF($BK$17=\"21\",CN24,IF($BK$17=\"12\",DP24,IF($BK$17=\"22\",DP24,IF($BK$17=\"13\",ED24,IF($BK$17=\"23\",ED24,IF($BK$17=\"14\",DB24,IF($BK$17=\"24\",DB24,IF($BK$17=\"31\",0,IF($BK$17=\"41\",0,IF($BK$17=\"32\",0,IF($BK$17=\"42\",0,IF($BK$17=\"33\",0,IF($BK$17=\"43\",0,IF($BK$17=\"34\",DB24,IF($BK$17=\"44\",DB24,))))))))))))))))","v":{"v":0,"d":"0.00E+00"}},{"v":0.0058292139,"d":"5.83E-03"},{"v":-0.132191821,"d":"-1.32E-01"},{"v":0.772416816,"d":"7.72E-01"},{"v":-14.4365366,"d":"-1.44E+01"},{"v":178.414262,"d":"1.78E+02"},{"$f":"IF($BK$17=\"11\",CT24,IF($BK$17=\"21\",CT24,IF($BK$17=\"12\",DV24,IF($BK$17=\"22\",DV24,IF($BK$17=\"13\",EJ24,IF($BK$17=\"23\",EJ24,IF($BK$17=\"14\",DH24,IF($BK$17=\"24\",DH24,IF($BK$17=\"31\",0,IF($BK$17=\"41\",0,IF($BK$17=\"32\",0,IF($BK$17=\"42\",0,IF($BK$17=\"33\",0,IF($BK$17=\"43\",0,IF($BK$17=\"34\",DH24,IF($BK$17=\"44\",DH24,))))))))))))))))","v":{"v":0,"d":"0.00E+00"}},{"v":-2.83558633E-8,"d":"-2.84E-08"},{"v":2.09030852e-05,"d":"2.09E-05"},{"v":1.08425021E-3,"d":"1.08E-03"},{"$f":"IF($BK$17=\"11\",CX24,IF($BK$17=\"21\",CX24,IF($BK$17=\"12\",DZ24,IF($BK$17=\"22\",DZ24,IF($BK$17=\"13\",EN24,IF($BK$17=\"23\",EN24,IF($BK$17=\"14\",DL24,IF($BK$17=\"24\",DL24,IF($BK$17=\"31\",0,IF($BK$17=\"41\",0,IF($BK$17=\"32\",0,IF($BK$17=\"42\",0,IF($BK$17=\"33\",0,IF($BK$17=\"43\",0,IF($BK$17=\"34\",DL24,IF($BK$17=\"44\",DL24,))))))))))))))))","v":{"v":2.96538137,"d":"2.97E+00"}},{"v":-0.000686891563,"d":"-6.87E-04"},{"v":-0.265424415,"d":"-2.65E-01"},{"v":507.541011,"d":"5.08E+02"},null,{"v":0.0224703299,"d":"2.25E-02"},{"v":-0.303198405,"d":"-3.03E-01"},{"v":1.28826108,"d":"1.29E+00"},{"v":-16.7626749,"d":"-1.68E+01"},{"v":79.6893642,"d":"7.97E+01"},null,{"v":-1.62124341e-08,"d":"-1.62E-08"},{"v":2.1375238e-05,"d":"2.14E-05"},{"v":0.000586088227,"d":"5.86E-04"},{"v":2.15110824,"d":"2.15E+00"},{"v":-0.000510548751,"d":"-5.11E-04"},{"v":-0.0632758344,"d":"-6.33E-02"},{"v":341.333385,"d":"3.41E+02"},null,{"v":0.0301834977,"d":"3.02E-02"},{"v":-0.414313879,"d":"-4.14E-01"},{"v":1.27272694,"d":"1.27E+00"},{"v":-16.5123452,"d":"-1.65E+01"},{"v":137.557789,"d":"1.38E+02"},null,{"v":-2.17251291e-07,"d":"-2.17E-07"},{"v":5.58568005e-05,"d":"5.59E-05"},{"v":-2.13436315E-4,"d":"-2.13E-04"},{"v":2.60133976,"d":"2.60E+00"},{"v":-0.000342334664,"d":"-3.42E-04"},{"v":-0.108145733,"d":"-1.08E-01"},{"v":401.277632,"d":"4.01E+02"},null,{"v":0.0058292139,"d":"5.83E-03"},{"v":-0.132191821,"d":"-1.32E-01"},{"v":0.772416816,"d":"7.72E-01"},{"v":-14.4365366,"d":"-1.44E+01"},{"v":178.414262,"d":"1.78E+02"},null,{"v":-2.83558633E-8,"d":"-2.84E-08"},{"v":2.09030852e-05,"d":"2.09E-05"},{"v":1.08425021E-3,"d":"1.08E-03"},{"v":2.96538137,"d":"2.97E+00"},{"v":-0.000686891563,"d":"-6.87E-04"},{"v":-0.265424415,"d":"-2.65E-01"},{"v":507.541011,"d":"5.08E+02"},null,{"v":0.00146259326,"d":"1.46E-03"},{"v":-0.0645135206,"d":"-6.45E-02"},{"v":0.761701571,"d":"7.62E-01"},{"v":-14.2775662,"d":"-1.43E+01"},{"v":307.39181,"d":"3.07E+02"},null,{"v":-1.11250677E-7,"d":"-1.11E-07"},{"v":7.61601401e-05,"d":"7.62E-05"},{"v":-0.00316070729,"d":"-3.16E-03"},{"v":8.63602745,"d":"8.64E+00"},{"v":-0.000136587716,"d":"-1E-04"},{"v":-0.0904124388,"d":"-9E-02"},{"v":666.125538,"d":"7E+02"},28.5,null,28.5,null,{"$f":"ER24-5","v":23.5},{"$nulls":3},{"$f":"IF($BK$17=\"11\",FA24,IF($BK$17=\"21\",FA24,IF($BK$17=\"12\",FC24,IF($BK$17=\"22\",FC24,IF($BK$17=\"13\",FD24,IF($BK$17=\"23\",FD24,IF($BK$17=\"14\",FB24,IF($BK$17=\"24\",FB24,IF($BK$17=\"31\",FE24,IF($BK$17=\"41\",FE24,IF($BK$17=\"32\",FG24,IF($BK$17=\"42\",FG24,IF($BK$17=\"33\",FH24,IF($BK$17=\"43\",FH24,IF($BK$17=\"34\",FF24,IF($BK$17=\"44\",FF24,))))))))))))))))","v":17.5},{"$f":"Tavg_cold","v":17},{"$f":"IF($GC24<=$FC24,$FC24,IF($FM24<=$FP24,$FC24,$FZ24))","v":17.5},{"$f":"IF($N24>$FN24,Tavg_cold+(0.5*(Tr_cool-Tavg_cold)),Tavg_cold+($FJ24*(Tr_cool-Tavg_cold)))","v":17.5},17.5,{"$nulls":5},{"$f":"0.5*(1-((FN24-N24)/FN24))","v":0.5},{"$f":"(0.025*Tl_cool)+0.5","v":{"v":1.175,"d":"1.18"}},null,{"$f":"FQ24/FO24","v":{"v":0.5804131931816922,"d":"58.04%"}},{"$f":"DU24","v":{"v":178.414262,"d":"178.4"}},{"$f":"EI24","v":{"v":307.39181,"d":"307.4"}},{"$f":"FN24/FO24","v":{"v":0.5804131931816922,"d":"58.04%"}},{"$f":"N24/Cubics","v":{"v":178.414262,"d":"178.41"}},{"$f":"IF(FQ24-(FP24*FO24)<=0,0,FQ24-(FP24*FO24))","v":{"v":0,"d":"0.00"}},{"$f":"FO24*(1-FP24)","v":{"v":128.97754799999998,"d":"128.98"}},{"$f":"IF((FR24/FS24)>1,1,FR24/FS24)","v":{"v":0,"d":"0.00%"}},{"$f":"FC24","v":{"v":17.5,"d":"17.50"}},{"$f":"Tr_cool*FK24","v":21.150000000000002},{"$f":"ABS(FV24-FU24)","v":{"v":3.650000000000002,"d":"3.65"}},null,null,{"$f":"IF(FM24<=FP24,FU24,FU24+(FT24*FW24))","v":{"v":17.5,"d":"17.50"}},null,null,{"$f":"(237.3*LN((RH*EXP(17.27*(Tl_cool/(Tl_cool+237.3))))))/(17.27-LN((RH*EXP(17.27*(Tl_cool/(Tl_cool+237.3))))))","v":15.69066559142683},null,{"$f":"(H24-G24)/H24","v":{"v":0,"d":"0.0%"}},null,{"$f":"(611*EXP(17.27*(Tl_heat/(Tl_heat+237.7))))","v":{"v":2334.1781978570243,"d":"2334.18"}},{"$f":"(611*EXP(17.27*((($P24-Celc2)/Celc1)/((($P24-Celc2)/Celc1)+237.7))))","v":{"v":19587.534864333866,"d":"19587.53"}},{"$f":"RH*$GG24","v":{"v":1167.0890989285122,"d":"1167.09"}},{"$f":"(GL24*p_atm)/(GL24+0.622)","v":{"v":1167.089098928512,"d":"1167.09"}},{"$f":"0.622*($GI24/(p_atm-$GI24))","v":{"v":7.2478490515896785E-3,"d":"0.01"}},{"v":7.2478490515896785E-3,"d":"0.01"},{"$f":"(1.005*Tl_heat)+($GK24*(2500+(1.87*Tl_heat)))","v":{"v":38.49069218350365,"d":"38.49"}},{"$f":"(1.005*(($P24-Celc2)/Celc1))+($GL24*(2500+(1.87*(($P24-Celc2)/Celc1))))","v":{"v":78.94430290569746,"d":"78.94"}},{"v":0.05958325572931673,"d":"6%"},null,{"$f":"(611*EXP(17.27*(Tl_cool/(Tl_cool+237.7))))","v":{"v":3557.0118570174286,"d":"3557.01"}},{"$f":"(611*EXP(17.27*((($R24-Celc2)/Celc1)/((($R24-Celc2)/Celc1)+237.7))))","v":{"v":2130.87497180189,"d":"2130.87"}},{"$f":"RH*$GQ24","v":{"v":1778.5059285087143,"d":"1778.51"}},{"$f":"(GW24*p_atm)/(GW24+0.622)","v":{"v":1778.5059285087143,"d":"1778.51"}},{"$f":"T24*GR24","v":{"v":1778.5059285087143,"d":"1778.51"}},{"$f":"0.622*($GS24/(p_atm-$GS24))","v":{"v":0.011112703645172665,"d":"0.0111"}},{"$f":"IF(H24=G24,GV24,(0.53475935828878*($GZ24-(1.005*(($R24-Celc2)/Celc1))))/(1336.8983957219))","v":{"v":0.011112703645172665,"d":"0.0111"}},{"$f":"0.622*($GU24/(p_atm-$GU24))","v":{"v":0.011112703645172665,"d":"0.01"}},{"$f":"(1.005*Tl_cool)+($GV24*(2500+(1.87*Tl_cool)))","v":{"v":55.47783951997643,"d":"55.48"}},{"$f":"GY24-((((H24-G24)/Watts)/1000)/(N24/$L$15))","v":{"v":55.47783951997643,"d":"55.48"}},{"$f":"(1.005*(($R24-Celc2)/Celc1))+($GX24*(2500+(1.87*(($R24-Celc2)/Celc1))))","v":{"v":46.79377343556168,"d":"46.79"}},{"v":19.415087041495514,"d":"19.42"},{"v":19.415087041495514,"d":"19.42"},{"$f":"H24","v":{"v":508.18297018770477,"d":"508"}},178.414262,{"$f":"IF(Geg_dP<$AB24,((($BL$24*($HE24/Cubics)^4+$BL$25*($HE24/Cubics)^3+$BL$27*($HE24/Cubics)^2+$BL$29*($HE24/Cubics)^1+$BL$30)*((CF_Regime_Cool_noExp)^$Y24)))*CF_Addit*Watts*CF_Altit,Lim_dP)","v":508.18297018770477},17.5,17.5,{"$f":"IF(Geg_dP<$AB24,((HF24/Watts)/(IF((237.3*LN((RH*EXP(17.27*(Tl_cool/(Tl_cool+237.3))))))/(17.27-LN((RH*EXP(17.27*(Tl_cool/(Tl_cool+237.3))))))<HH24,1,IF(1/(1+((2258*((0.622/((101325/(1*611*EXP(17.27*(HH24/(HH24+237.3))))))-1)*1000-(0.622/((101325/(RH*611*EXP(17.27*(Tl_cool/(Tl_cool+237.3))))))-1)*1000))/(1005*(Tavg_cold-Tl_cool))))>1,1,1/(1+((2258*((0.622/((101325/(1*611*EXP(17.27*(HH24/(HH24+237.3))))))-1)*1000-(0.622/((101325/(RH*611*EXP(17.27*(Tl_cool/(Tl_cool+237.3))))))-1)*1000))/(1005*(Tavg_cold-Tl_cool))))))))*Watts,\"\")","v":{"v":508.18297018770477,"d":"508"}},{"$f":"HI24/HF24","v":1},{"$f":"HJ24*G24","v":{"v":508.18297018770477,"d":"508"}},{"$f":"0.5*(1-((HP24-HE24)/HP24))","v":0.5},{"$f":"(0.025*Tl_cool)+0.5","v":{"v":1.175,"d":"1.18"}},null,{"$f":"HS24/HQ24","v":{"v":0.5804131931816922,"d":"58.04%"}},{"$f":"DU24","v":{"v":178.414262,"d":"178.4"}},{"$f":"EI24","v":{"v":307.39181,"d":"307.4"}},{"$f":"HP24/HQ24","v":{"v":0.5804131931816922,"d":"58.04%"}},{"v":178.414262,"d":"178.41"},{"$f":"IF(HS24-(HR24*HQ24)<=0,0,HS24-(HR24*HQ24))","v":{"v":0,"d":"0.00"}},{"$f":"HQ24*(1-HR24)","v":{"v":128.97754799999998,"d":"128.98"}},{"$f":"IF((HT24/HU24)>1,1,HT24/HU24)","v":{"v":0,"d":"0.00%"}},{"v":17.5,"d":"17.50"},{"$f":"Tr_cool*HM24","v":21.150000000000002},{"$f":"ABS(HX24-HW24)","v":{"v":3.650000000000002,"d":"3.65"}},null,null,{"$f":"IF(HO24<=HR24,HW24,HW24+(HV24*HY24))","v":{"v":17.5,"d":"17.50"}},null,null,{"$f":"(237.3*LN((RH*EXP(17.27*(Tl_cool/(Tl_cool+237.3))))))/(17.27-LN((RH*EXP(17.27*(Tl_cool/(Tl_cool+237.3))))))","v":15.69066559142683},null,{"$f":"(BG24-BF24)/BG24","v":{"$error":"#DIV/0!"}},null,{"$f":"(611*EXP(17.27*(Tl_heat/(Tl_heat+237.7))))","v":{"v":2334.1781978570243,"d":"2334.18"}},{"$f":"(611*EXP(17.27*((($P24-Celc2)/Celc1)/((($P24-Celc2)/Celc1)+237.7))))","v":{"v":19587.534864333866,"d":"19587.53"}}]
[null,{"$f":"IF($AL$5=1,$C25/10,IF($AL$5=2,$C25/10,IF($AL$5=3,0,IF($AL$5=4,$C25/10,))))","v":{"v":0.4,"d":"40%"}},4,{"v":4256.248619077803,"d":"4256"},366,{"v":3.653543834025186,"d":"3.7"},{"v":870.4079031708319,"d":"870"},{"v":870.4079031708319,"d":"870"},{"$f":"IF(Geg_dP<AB25,ROUND(((IF('Briza 22 & 26'!$M$4=\"High Perform. 208/230V (US/EU)\",cal!HK25,H25)/Watts)/((Tr_cool-Tv_cool)*1.163))*FlowH2O,IF(UnitsNo=1,0,IF(UnitsNo=2,2))),\"\")","v":374},{"v":3.8009349421834946,"d":"3.8"},29.5,{"$f":"IF(Geg_dP<$AB25,IF(CalcNo=\"12\",$ET25,IF(CalcNo=\"22\",$ET25,IF(CalcNo=\"13\",$EU25,IF(CalcNo=\"23\",$EU25,IF(CalcNo=\"11\",$ER25,IF(CalcNo=\"21\",$ER25,IF(CalcNo=\"14\",$ES25,IF(CalcNo=\"24\",$ES25,IF(CalcNo=\"32\",$EX25,IF(CalcNo=\"42\",$EX25,IF(CalcNo=\"33\",$EY25,IF(CalcNo=\"43\",$EY25,IF(CalcNo=\"31\",$EV25,IF(CalcNo=\"41\",$EV25,IF(CalcNo=\"34\",$EW25,IF(CalcNo=\"44\",$EW25,)))))))))))))))),\"\")","v":37.5},{"v":8.819535674356523,"d":"8.8"},{"v":326.678518,"d":"327"},{"v":0.549963835016835,"d":"0.55"},{"v":58.243902276633726,"d":"58.2"},{"v":25.39803373173983,"d":"25.4"},{"v":19.080818765833964,"d":"19.1"},{"v":16.829848135327037,"d":"16.8"},{"v":0.8066512902297772,"d":"81%"},{"v":652.459279552639,"d":"652"},{"v":0.09719135687913058,"d":"0.10"},{"v":2.6644173253254193,"d":"2.664"},0.980228,1.29011,1.13171,0.980228,27.88,0.980228,1.29011,1.13171,{"v":17,"d":"17.00"},0.980228,1.29011,1.13171,{"v":27,"d":"27.00"},0.980228,1.29011,1.13171,27.88,1.0471988669409447,1.2021874904764758,1.1584541354089894,72.12,{"$nulls":3},1000,{"$nulls":3},1000,{"$nulls":3},1000,{"$nulls":3},1000,null,null,{"v":0,"d":"0.00E+00"},{"v":0,"d":"0.00E+00"},{"v":1.8290914425086318,"d":"1.83E+00"},null,null,{"$f":"BP30","v":{"v":1.8290914425086318,"d":"1.83E+00"}},{"v":1.02677448E-6,"d":"1.03E-06"},{"$f":"BO25","v":0},{"v":1.8035869761243581,"d":"1.80E+00"},0,0,0,0,0,0,{"v":0,"d":"0.00E+00"},{"v":0.000193223416,"d":"1.93E-04"},{"v":-0.0120398069,"d":"-1.20E-02"},{"v":0.177873434,"d":"1.78E-01"},{"v":-10.2939382,"d":"-1.03E+01"},{"v":326.678518,"d":"3.27E+02"},{"v":0,"d":"0.00E+00"},{"v":-8.62496981e-08,"d":"-8.62E-08"},{"v":5.53787137e-05,"d":"5.54E-05"},{"v":1.51054365E-3,"d":"1.51E-03"},{"v":5.42302292,"d":"5.42E+00"},{"v":-0.00028922757,"d":"-2.89E-04"},{"v":-0.285641245,"d":"-2.86E-01"},{"v":776.638173,"d":"7.77E+02"},null,{"v":0.0015565857,"d":"1.56E-03"},{"v":-0.0421925643,"d":"-4.22E-02"},{"v":0.194437966,"d":"1.94E-01"},{"v":-9.87860685,"d":"-9.88E+00"},{"v":189.792621,"d":"1.90E+02"},null,{"v":-1.40847705e-07,"d":"-1.41E-07"},{"v":6.1237809e-05,"d":"6.12E-05"},{"v":1.95840122E-4,"d":"1.96E-04"},{"v":3.84572366,"d":"3.85E+00"},{"v":-0.000344904505,"d":"-3.45E-04"},{"v":-0.0960935174,"d":"-9.61E-02"},{"v":586.308351,"d":"5.86E+02"},null,{"v":0.000360521075,"d":"3.61E-04"},{"v":-0.0177771446,"d":"-1.78E-02"},{"v":0.133612822,"d":"1.34E-01"},{"v":-9.17427374,"d":"-9.17E+00"},{"v":319.12385,"d":"3.19E+02"},null,{"v":-1.29433238e-07,"d":"-1.29E-07"},{"v":7.30723403e-05,"d":"7.31E-05"},{"v":1.25314831E-3,"d":"1.25E-03"},{"v":5.43610411,"d":"5.44E+00"},{"v":-1.52038885E-4,"d":"-1.52E-04"},{"v":-0.152290472,"d":"-1.52E-01"},{"v":731.267509,"d":"7.31E+02"},null,{"v":0.000193223416,"d":"1.93E-04"},{"v":-0.0120398069,"d":"-1.20E-02"},{"v":0.177873434,"d":"1.78E-01"},{"v":-10.2939382,"d":"-1.03E+01"},{"v":326.678518,"d":"3.27E+02"},null,{"v":-8.62496981e-08,"d":"-8.62E-08"},{"v":5.53787137e-05,"d":"5.54E-05"},{"v":1.51054365E-3,"d":"1.51E-03"},{"v":5.42302292,"d":"5.42E+00"},{"v":-0.00028922757,"d":"-2.89E-04"},{"v":-0.285641245,"d":"-2.86E-01"},{"v":776.638173,"d":"7.77E+02"},null,{"v":2.18262422e-05,"d":"2.18E-05"},{"v":-2.8060143E-3,"d":"-2.81E-03"},{"v":0.0617112608,"d":"6.17E-02"},{"v":-6.68835898,"d":"-6.69E+00"},{"v":645.46574,"d":"6.45E+02"},null,{"v":-5.51067734e-08,"d":"-5.51E-08"},{"v":7.13998509e-05,"d":"7.14E-05"},{"v":0.0072599635,"d":"7.26E-03"},{"v":18.8851717,"d":"1.89E+01"},{"v":-6.51271973e-05,"d":"-7E-05"},{"v":-0.0660861402,"d":"-7E-02"},{"v":1162.68107,"d":"1E+03"},37.5,null,37.5,null,{"$f":"ER25-5","v":32.5},{"$nulls":3},{"$f":"IF($BK$17=\"11\",FA25,IF($BK$17=\"21\",FA25,IF($BK$17=\"12\",FC25,IF($BK$17=\"22\",FC25,IF($BK$17=\"13\",FD25,IF($BK$17=\"23\",FD25,IF($BK$17=\"14\",FB25,IF($BK$17=\"24\",FB25,IF($BK$17=\"31\",FE25,IF($BK$17=\"41\",FE25,IF($BK$17=\"32\",FG25,IF($BK$17=\"42\",FG25,IF($BK$17=\"33\",FH25,IF($BK$17=\"43\",FH25,IF($BK$17=\"34\",FF25,IF($BK$17=\"44\",FF25,))))))))))))))))","v":17.5},{"$f":"Tavg_cold","v":17},17.5,17.5,17.5,{"$nulls":5},0.5,{"v":1.175,"d":"1.18"},null,{"$f":"FQ25/FO25","v":{"v":0.5061128697551012,"d":"50.61%"}},{"$f":"DU25","v":{"v":326.678518,"d":"326.7"}},{"$f":"EI25","v":{"v":645.46574,"d":"645.5"}},{"$f":"FN25/FO25","v":{"v":0.5061128697551012,"d":"50.61%"}},{"v":326.678518,"d":"326.68"},{"v":0,"d":"0.00"},{"$f":"FO25*(1-FP25)","v":{"v":318.787222,"d":"318.79"}},{"$f":"IF((FR25/FS25)>1,1,FR25/FS25)","v":{"v":0,"d":"0.00%"}},{"$f":"FC25","v":{"v":17.5,"d":"17.50"}},21.150000000000002,{"$f":"ABS(FV25-FU25)","v":{"v":3.650000000000002,"d":"3.65"}},null,null,{"$f":"IF(FM25<=FP25,FU25,FU25+(FT25*FW25))","v":{"v":17.5,"d":"17.50"}},null,null,15.69066559142683,null,{"v":0,"d":"0.0%"},null,{"v":2334.1781978570243,"d":"2334.18"},{"v":18287.224403278535,"d":"18287.22"},{"v":1167.0890989285122,"d":"1167.09"},{"v":1167.089098928512,"d":"1167.09"},{"v":7.2478490515896785E-3,"d":"0.01"},{"v":7.2478490515896785E-3,"d":"0.01"},{"v":38.49069218350365,"d":"38.49"},{"v":77.4441518492003,"d":"77.44"},{"v":0.06381991455845405,"d":"6%"},null,{"v":3557.0118570174286,"d":"3557.01"},{"v":2204.801442767297,"d":"2204.80"},{"v":1778.5059285087143,"d":"1778.51"},{"v":1778.5059285087143,"d":"1778.51"},{"v":1778.5059285087143,"d":"1778.51"},{"v":0.011112703645172665,"d":"0.0111"},{"v":0.011112703645172665,"d":"0.0111"},{"v":0.011112703645172665,"d":"0.01"},{"v":55.47783951997643,"d":"55.48"},{"v":55.47783951997643,"d":"55.48"},{"v":47.35449580814596,"d":"47.35"},{"v":19.415087041495514,"d":"19.42"},{"v":19.415087041495514,"d":"19.42"},{"v":870.4079031708319,"d":"870"},326.678518,870.4079031708319,17.5,17.5,{"v":870.4079031708319,"d":"870"},{"$f":"HI25/HF25","v":1},{"v":870.4079031708319,"d":"870"},0.5,{"v":1.175,"d":"1.18"},null,{"$f":"HS25/HQ25","v":{"v":0.5061128697551012,"d":"50.61%"}},{"v":326.678518,"d":"326.7"},{"v":645.46574,"d":"645.5"},{"$f":"HP25/HQ25","v":{"v":0.5061128697551012,"d":"50.61%"}},{"v":326.678518,"d":"326.68"},{"v":0,"d":"0.00"},{"$f":"HQ25*(1-HR25)","v":{"v":318.787222,"d":"318.79"}},{"$f":"IF((HT25/HU25)>1,1,HT25/HU25)","v":{"v":0,"d":"0.00%"}},{"v":17.5,"d":"17.50"},21.150000000000002,{"$f":"ABS(HX25-HW25)","v":{"v":3.650000000000002,"d":"3.65"}},null,null,{"$f":"IF(HO25<=HR25,HW25,HW25+(HV25*HY25))","v":{"v":17.5,"d":"17.50"}},null,null,15.69066559142683,null,{"$error":"#DIV/0!"},null,{"v":2334.1781978570243,"d":"2334.18"},{"v":18287.224403278535,"d":"18287.22"}]
[null,{"$f":"IF($AL$5=1,$C26/10,IF($AL$5=2,$C26/10,IF($AL$5=3,0.25,IF($AL$5=4,$C26/10,))))","v":{"v":0.5,"d":"50%"}},5,{"v":-176.58230878697927,"d":"-177"},-15,{"$error":"#NUM!"},{"v":5.8527436755953275,"d":"6"},{"v":5.8527436755953275,"d":"6"},{"$f":"IF(Geg_dP<AB26,ROUND(((IF('Briza 22 & 26'!$M$4=\"High Perform. 208/230V (US/EU)\",cal!HK26,H26)/Watts)/((Tr_cool-Tv_cool)*1.163))*FlowH2O,IF(UnitsNo=1,0,IF(UnitsNo=2,2))),\"\")","v":3},{"v":5.579193318791106E-4,"d":"0.0"},{"v":0,"d":"0.0"},{"$f":"IF(Geg_dP<$AB26,0,\"\")","v":{"v":0,"d":"0.0"}},{"v":0,"d":"0.0"},0,{"v":0,"d":"0.00"},{"$error":"#DIV/0!"},{"$error":"#DIV/0!"},{"$error":"#DIV/0!"},{"$error":"#DIV/0!"},{"$error":"#DIV/0!"},0,{"$error":"#DIV/0!"},{"$error":"#DIV/0!"},0.980228,1.29011,1.13171,0.980228,40.05,0.980228,1.29011,1.13171,{"$f":"AF25+((AF27-AF25)/2)","v":{"v":26,"d":"26.00"}},0.980228,1.29011,1.13171,{"$f":"AJ25+((AJ27-AJ25)/2)","v":{"v":43.5,"d":"43.50"}},0.980228,1.29011,1.13171,{"$f":"AN25+((AN27-AN25)/2)","v":40.05},1.0471988669409447,1.2021874904764758,1.1584541354089894,{"v":104,"d":"104.00"},{"$nulls":3},1000,{"$nulls":3},1000,{"$nulls":3},1000,{"$nulls":3},1000,{"$nulls":17},{"v":0,"d":"0.00E+00"},{"v":0,"d":"0.00E+00"},{"v":0,"d":"0.00E+00"},{"v":0,"d":"0.00E+00"},{"v":0,"d":"0.00E+00"},{"v":0,"d":"0.00E+00"},{"$f":"IF($BK$17=\"11\",CT26,IF($BK$17=\"21\",CT26,IF($BK$17=\"12\",DV26,IF($BK$17=\"22\",DV26,IF($BK$17=\"13\",EJ26,IF($BK$17=\"23\",EJ26,IF($BK$17=\"14\",DH26,IF($BK$17=\"24\",DH26,IF($BK$17=\"31\",0,IF($BK$17=\"41\",0,IF($BK$17=\"32\",0,IF($BK$17=\"42\",0,IF($BK$17=\"33\",0,IF($BK$17=\"43\",0,IF($BK$17=\"34\",DH26,IF($BK$17=\"44\",DH26,))))))))))))))))","v":{"v":0,"d":"0.00E+00"}},{"v":0,"d":"0.00E+00"},{"v":0,"d":"0.00E+00"},{"v":0,"d":"0.00E+00"},{"v":0,"d":"0.00E+00"},{"v":0,"d":"0.00E+00"},{"v":0,"d":"0.00E+00"},{"v":0,"d":"0.00E+00"},{"$nulls":44},{"v":3.37349719E-5,"d":"3.37E-05"},{"v":-0.033324399,"d":"-3.33E-02"},{"v":-4.49302319,"d":"-4.49E+00"},{"v":794.403226,"d":"7.94E+02"},null,{"v":-4.87982601e-08,"d":"-4.88E-08"},{"v":7.77542939e-05,"d":"7.78E-05"},{"v":0.0124869009,"d":"1.25E-02"},{"v":28.9568883,"d":"2.90E+01"},{"v":-6.35007256e-05,"d":"-6E-05"},{"v":-0.0933733236,"d":"-9E-02"},{"v":1418.06184,"d":"1E+03"},{"$nulls":8},{"$f":"IF($BK$17=\"11\",FA26,IF($BK$17=\"21\",FA26,IF($BK$17=\"12\",FC26,IF($BK$17=\"22\",FC26,IF($BK$17=\"13\",FD26,IF($BK$17=\"23\",FD26,IF($BK$17=\"14\",FB26,IF($BK$17=\"24\",FB26,IF($BK$17=\"31\",FE26,IF($BK$17=\"41\",FE26,IF($BK$17=\"32\",FG26,IF($BK$17=\"42\",FG26,IF($BK$17=\"33\",FH26,IF($BK$17=\"43\",FH26,IF($BK$17=\"34\",FF26,IF($BK$17=\"44\",FF26,))))))))))))))))","v":{"v":17,"d":"17.0"}},{"$f":"((FA27-FA25)/2)+FA25","v":17},17,17,{"$f":"IF($GC26<=$FC26,$FC26,IF($FM26<=$FP26,$FC26,$FZ26))","v":17},{"$nulls":5},{"v":0,"d":"0.0"},{"v":1.175,"d":"1.18"},null,{"$f":"FQ26/FO26","v":{"v":0,"d":"0.00%"}},{"$f":"((FN27-FN25)/2)+FN25","v":{"v":391.4548655,"d":"391.5"}},{"$f":"((FO27-FO25)/2)+FO25","v":{"v":796.8861775,"d":"796.9"}},{"$f":"FN26/FO26","v":{"v":0.49123058794679614,"d":"49.12%"}},{"v":0,"d":"0.00"},{"v":0,"d":"0.00"},{"v":405.43131200000005,"d":"405.43"},{"v":0,"d":"0.00%"},{"$f":"FC26","v":{"v":17,"d":"17.00"}},21.150000000000002,{"$f":"ABS(FV26-FU26)","v":{"v":4.150000000000002,"d":"4.15"}},null,null,{"$f":"IF(FM26<=FP26,FU26,FU26+(FT26*FW26))","v":{"v":17,"d":"17.00"}},null,null,15.69066559142683,null,{"v":0,"d":"0.0%"},null,{"v":2334.1781978570243,"d":"2334.18"},{"$error":"#DIV/0!"},{"v":1167.0890989285122,"d":"1167.09"},{"v":1167.089098928512,"d":"1167.09"},{"v":7.2478490515896785E-3,"d":"0.01"},{"v":7.2478490515896785E-3,"d":"0.01"},{"v":38.49069218350365,"d":"38.49"},{"$error":"#DIV/0!"},{"$error":"#DIV/0!"},null,{"v":3557.0118570174286,"d":"3557.01"},{"$error":"#DIV/0!"},{"v":1778.5059285087143,"d":"1778.51"},{"v":1778.5059285087143,"d":"1778.51"},{"$error":"#DIV/0!"},{"v":0.011112703645172665,"d":"0.0111"},{"v":0.011112703645172665,"d":"0.0111"},{"$error":"#DIV/0!"},{"v":55.47783951997643,"d":"55.48"},{"$error":"#DIV/0!"},{"$error":"#DIV/0!"},{"v":19.415087041495514,"d":"19.42"},{"$error":"#DIV/0!"},{"v":5.8527436755953275,"d":"6"},0,5.8527436755953275,{"v":17,"d":"17.0"},17,{"$f":"IF(Geg_dP<$AB26,((HF26/Watts)/(IF((237.3*LN((RH*EXP(17.27*(Tl_cool/(Tl_cool+237.3))))))/(17.27-LN((RH*EXP(17.27*(Tl_cool/(Tl_cool+237.3))))))<HH26,1,IF(1/(1+((2258*((0.622/((101325/(1*611*EXP(17.27*(HH26/(HH26+237.3))))))-1)*1000-(0.622/((101325/(RH*611*EXP(17.27*(Tl_cool/(Tl_cool+237.3))))))-1)*1000))/(1005*(Tavg_cold-Tl_cool))))>1,1,1/(1+((2258*((0.622/((101325/(1*611*EXP(17.27*(HH26/(HH26+237.3))))))-1)*1000-(0.622/((101325/(RH*611*EXP(17.27*(Tl_cool/(Tl_cool+237.3))))))-1)*1000))/(1005*(Tavg_cold-Tl_cool))))))))*Watts,\"\")","v":{"v":5.8527436755953275,"d":"6"}},1,{"v":5.8527436755953275,"d":"6"},{"v":0,"d":"0.0"},{"v":1.175,"d":"1.18"},null,{"v":0,"d":"0.00%"},{"$f":"((HP27-HP25)/2)+HP25","v":{"v":391.4548655,"d":"391.5"}},{"$f":"((HQ27-HQ25)/2)+HQ25","v":{"v":796.8861775,"d":"796.9"}},{"$f":"HP26/HQ26","v":{"v":0.49123058794679614,"d":"49.12%"}},{"v":0,"d":"0.00"},{"v":0,"d":"0.00"},{"v":405.43131200000005,"d":"405.43"},{"v":0,"d":"0.00%"},{"v":17,"d":"17.00"},21.150000000000002,{"$f":"ABS(HX26-HW26)","v":{"v":4.150000000000002,"d":"4.15"}},null,null,{"$f":"IF(HO26<=HR26,HW26,HW26+(HV26*HY26))","v":{"v":17,"d":"17.00"}},null,null,15.69066559142683,null,{"$error":"#DIV/0!"},null,{"v":2334.1781978570243,"d":"2334.18"},{"$error":"#DIV/0!"}]
[null,{"$f":"IF($AL$5=1,$C27/10,IF($AL$5=2,$C27/10,IF($AL$5=3,0.5,IF($AL$5=4,$C27/10,))))","v":{"v":0.6,"d":"60%"}},6,{"v":5635.100608838506,"d":"5635"},485,{"v":6.114208391587188,"d":"6.1"},{"v":1145.886622360002,"d":"1146"},{"v":1145.886622360002,"d":"1146"},{"$f":"IF(Geg_dP<AB27,ROUND(((IF('Briza 22 & 26'!$M$4=\"High Perform. 208/230V (US/EU)\",cal!HK27,H27)/Watts)/((Tr_cool-Tv_cool)*1.163))*FlowH2O,IF(UnitsNo=1,0,IF(UnitsNo=2,2))),\"\")","v":493},{"v":6.299937804464194,"d":"6.3"},{"v":39,"d":"39.0"},{"$f":"IF(Geg_dP<$AB27,IF(CalcNo=\"12\",$ET27,IF(CalcNo=\"22\",$ET27,IF(CalcNo=\"13\",$EU27,IF(CalcNo=\"23\",$EU27,IF(CalcNo=\"11\",$ER27,IF(CalcNo=\"21\",$ER27,IF(CalcNo=\"14\",$ES27,IF(CalcNo=\"24\",$ES27,IF(CalcNo=\"32\",$EX27,IF(CalcNo=\"42\",$EX27,IF(CalcNo=\"33\",$EY27,IF(CalcNo=\"43\",$EY27,IF(CalcNo=\"31\",$EV27,IF(CalcNo=\"41\",$EV27,IF(CalcNo=\"34\",$EW27,IF(CalcNo=\"44\",$EW27,)))))))))))))))),\"\")","v":{"v":47,"d":"47.0"}},{"v":17.716229239720533,"d":"17.7"},{"v":456.231213,"d":"456"},{"v":0.7680660151515151,"d":"0.77"},{"v":56.255380575852506,"d":"56.3"},{"v":24.897212278988306,"d":"24.9"},{"v":19.5349161835818,"d":"19.5"},{"v":16.984768565071484,"d":"17.0"},{"v":0.7842047140227679,"d":"78%"},{"v":832.5592387999743,"d":"833"},{"v":0.13979408564269782,"d":"0.14"},{"v":2.5116357445714748,"d":"2.512"},0.980228,1.29011,1.13171,0.980228,52.22,0.980228,1.29011,1.13171,{"v":35,"d":"35.00"},0.980228,1.29011,1.13171,{"v":60,"d":"60.00"},0.980228,1.29011,1.13171,52.22,1.0471988669409447,1.2021874904764758,1.1584541354089894,{"v":155,"d":"155.00"},{"$nulls":3},1000,{"$nulls":3},1000,{"$nulls":3},1000,{"$nulls":3},1000,null,null,{"$f":"IF($BK$17=\"11\",BN27,IF($BK$17=\"21\",BQ27,IF($BK$17=\"12\",BN27,IF($BK$17=\"22\",BQ27,IF($BK$17=\"13\",BN27,IF($BK$17=\"23\",BQ27,IF($BK$17=\"14\",BN27,IF($BK$17=\"24\",BQ27,IF($BK$17=\"31\",BT27,IF($BK$17=\"41\",BW27,IF($BK$17=\"32\",BT27,IF($BK$17=\"42\",BW27,IF($BK$17=\"33\",BT27,IF($BK$17=\"43\",BW27,IF($BK$17=\"34\",BT27,IF($BK$17=\"44\",BW27,))))))))))))))))","v":{"v":-0.00365305869,"d":"-3.65E-03"}},{"$f":"IF($BK$17=\"11\",BO27,IF($BK$17=\"21\",BR27,IF($BK$17=\"12\",BO27,IF($BK$17=\"22\",BR27,IF($BK$17=\"13\",BO27,IF($BK$17=\"23\",BR27,IF($BK$17=\"14\",BO27,IF($BK$17=\"24\",BR27,IF($BK$17=\"31\",BU27,IF($BK$17=\"41\",BX27,IF($BK$17=\"32\",BU27,IF($BK$17=\"42\",BX27,IF($BK$17=\"33\",BU27,IF($BK$17=\"43\",BX27,IF($BK$17=\"34\",BU27,IF($BK$17=\"44\",BX27,))))))))))))))))","v":{"v":-0.00233610709,"d":"-2.34E-03"}},null,{"v":-0.00365305869,"d":"-3.65E-03"},{"v":-0.00233610709,"d":"-2.34E-03"},null,{"v":-0.00348906844,"d":"-3.49E-03"},{"$f":"BO27","v":{"v":-0.00233610709,"d":"-2.34E-03"}},null,0,0,null,0,0,null,{"v":0,"d":"0.00E+00"},{"v":2.9637606e-06,"d":"2.96E-06"},{"v":-0.000340861562,"d":"-3.41E-04"},{"v":-0.0153290574,"d":"-1.53E-02"},{"v":-6.87527796,"d":"-6.88E+00"},{"v":456.231213,"d":"4.56E+02"},{"v":0,"d":"0.00E+00"},{"v":-9.62798827E-8,"d":"-9.63E-08"},{"v":8.00319909e-05,"d":"8.00E-05"},{"v":1.33615595E-3,"d":"1.34E-03"},{"v":9.59125902,"d":"9.59E+00"},{"v":-0.00022627979,"d":"-2.26E-04"},{"v":-0.328713064,"d":"-3.29E-01"},{"v":1029.62784,"d":"1.03E+03"},null,{"v":1.5521822e-05,"d":"1.55E-05"},{"v":-0.000262023458,"d":"-2.62E-04"},{"v":-0.0721821826,"d":"-7.22E-02"},{"v":-6.61575365,"d":"-6.62E+00"},{"v":314.824331,"d":"3.15E+02"},null,{"v":-9.90956405e-08,"d":"-9.91E-08"},{"v":6.76010372e-05,"d":"6.76E-05"},{"v":0.002455986,"d":"2.46E-03"},{"v":6.78912913,"d":"6.79E+00"},{"v":-0.000251486221,"d":"-2.51E-04"},{"v":-0.125381237,"d":"-1.25E-01"},{"v":835.893017,"d":"8.36E+02"},null,{"v":2.28546434E-5,"d":"2.29E-05"},{"v":-0.00280828477,"d":"-2.81E-03"},{"v":0.063051114,"d":"6.31E-02"},{"v":-6.88721292,"d":"-6.89E+00"},{"v":503.73452,"d":"5.04E+02"},null,{"v":-9.39365542e-08,"d":"-9.39E-08"},{"v":8.29638076e-05,"d":"8.30E-05"},{"v":0.00506052476,"d":"5.06E-03"},{"v":11.0457006,"d":"1.10E+01"},{"v":-8.28796874e-05,"d":"-8.29E-05"},{"v":-0.224852364,"d":"-2.25E-01"},{"v":1069.41123,"d":"1.07E+03"},null,{"v":2.9637606e-06,"d":"2.96E-06"},{"v":-0.000340861562,"d":"-3.41E-04"},{"v":-0.0153290574,"d":"-1.53E-02"},{"v":-6.87527796,"d":"-6.88E+00"},{"v":456.231213,"d":"4.56E+02"},null,{"v":-9.62798827E-8,"d":"-9.63E-08"},{"v":8.00319909e-05,"d":"8.00E-05"},{"v":1.33615595E-3,"d":"1.34E-03"},{"v":9.59125902,"d":"9.59E+00"},{"v":-0.00022627979,"d":"-2.26E-04"},{"v":-0.328713064,"d":"-3.29E-01"},{"v":1029.62784,"d":"1.03E+03"},null,{"v":1.32481937E-6,"d":"1.32E-06"},{"v":-0.000367664376,"d":"-3.68E-04"},{"v":0.0144323817,"d":"1.44E-02"},{"v":-4.35234412,"d":"-4.35E+00"},{"v":948.306615,"d":"9.48E+02"},null,{"v":-4.24897469e-08,"d":"-4.25E-08"},{"v":8.4108737e-05,"d":"8.41E-05"},{"v":0.0177138382,"d":"1.77E-02"},{"v":39.028605,"d":"3.90E+01"},{"v":-6.1874254e-05,"d":"-6E-05"},{"v":-0.120660507,"d":"-1E-01"},{"v":1673.44261,"d":"2E+03"},47,null,47,null,{"$f":"ER27-5","v":42},{"$nulls":3},17.5,{"$f":"Tavg_cold","v":17},17.5,17.5,17.5,{"$nulls":5},0.5,{"v":1.175,"d":"1.18"},null,{"v":0.48110094961216743,"d":"48.11%"},{"$f":"DU27","v":{"v":456.231213,"d":"456.2"}},{"$f":"EI27","v":{"v":948.306615,"d":"948.3"}},{"$f":"FN27/FO27","v":{"v":0.48110094961216743,"d":"48.11%"}},{"v":456.231213,"d":"456.23"},{"v":0,"d":"0.00"},{"v":492.07540199999994,"d":"492.08"},{"v":0,"d":"0.00%"},{"v":17.5,"d":"17.50"},21.150000000000002,{"v":3.650000000000002,"d":"3.65"},null,null,{"$f":"IF(FM27<=FP27,FU27,FU27+(FT27*FW27))","v":{"v":17.5,"d":"17.50"}},null,null,15.69066559142683,null,{"v":0,"d":"0.0%"},null,{"v":2334.1781978570243,"d":"2334.18"},{"v":16649.30577095878,"d":"16649.31"},{"v":1167.0890989285122,"d":"1167.09"},{"v":1167.089098928512,"d":"1167.09"},{"v":7.2478490515896785E-3,"d":"0.01"},{"v":7.2478490515896785E-3,"d":"0.01"},{"v":38.49069218350365,"d":"38.49"},{"v":75.41873615533501,"d":"75.42"},{"v":0.07009836415907826,"d":"7%"},null,{"v":3557.0118570174286,"d":"3557.01"},{"v":2267.9102748381065,"d":"2267.91"},{"v":1778.5059285087143,"d":"1778.51"},{"v":1778.5059285087143,"d":"1778.51"},{"v":1778.5059285087143,"d":"1778.51"},{"v":0.011112703645172665,"d":"0.0111"},{"v":0.011112703645172665,"d":"0.0111"},{"v":0.011112703645172665,"d":"0.01"},{"v":55.47783951997643,"d":"55.48"},{"v":55.47783951997643,"d":"55.48"},{"v":47.820300200537645,"d":"47.82"},{"v":19.415087041495514,"d":"19.42"},{"v":19.415087041495514,"d":"19.42"},{"v":1145.886622360002,"d":"1146"},456.231213,1145.886622360002,17.5,{"v":17.5,"d":"17.50"},{"v":1145.886622360002,"d":"1146"},1,{"v":1145.886622360002,"d":"1146"},0.5,{"v":1.175,"d":"1.18"},null,{"v":0.48110094961216743,"d":"48.11%"},{"v":456.231213,"d":"456.2"},{"v":948.306615,"d":"948.3"},{"$f":"HP27/HQ27","v":{"v":0.48110094961216743,"d":"48.11%"}},{"v":456.231213,"d":"456.23"},{"v":0,"d":"0.00"},{"v":492.07540199999994,"d":"492.08"},{"v":0,"d":"0.00%"},{"v":17.5,"d":"17.50"},21.150000000000002,{"v":3.650000000000002,"d":"3.65"},null,null,{"v":17.5,"d":"17.50"},null,null,15.69066559142683,null,{"$error":"#DIV/0!"},null,{"v":2334.1781978570243,"d":"2334.18"},{"v":16649.30577095878,"d":"16649.31"}]
[null,{"$f":"IF($AL$5=1,$C28/10,IF($AL$5=2,$C28/10,IF($AL$5=3,0.75,IF($AL$5=4,$C28/10,))))","v":{"v":0.7,"d":"70%"}},7,{"v":-176.58230878697927,"d":"-177"},-15,{"$error":"#NUM!"},{"v":5.8527436755953275,"d":"6"},{"v":5.8527436755953275,"d":"6"},{"$f":"IF(Geg_dP<AB28,ROUND(((IF('Briza 22 & 26'!$M$4=\"High Perform. 208/230V (US/EU)\",cal!HK28,H28)/Watts)/((Tr_cool-Tv_cool)*1.163))*FlowH2O,IF(UnitsNo=1,0,IF(UnitsNo=2,2))),\"\")","v":3},{"v":5.579193318791106E-4,"d":"0.0"},{"v":0,"d":"0.0"},{"$f":"IF(Geg_dP<$AB28,0,\"\")","v":{"v":0,"d":"0.0"}},{"v":0,"d":"0.0"},0,{"v":0,"d":"0.00"},{"$error":"#DIV/0!"},{"$error":"#DIV/0!"},{"$error":"#DIV/0!"},{"$error":"#DIV/0!"},{"$error":"#DIV/0!"},0,{"$error":"#DIV/0!"},{"$error":"#DIV/0!"},0.980228,1.29011,1.13171,0.980228,69.05,0.980228,1.29011,1.13171,{"$f":"AF27+((AF29-AF27)/2)","v":{"v":48,"d":"48.00"}},0.980228,1.29011,1.13171,{"$f":"AJ27+((AJ29-AJ27)/2)","v":{"v":80,"d":"80.00"}},0.980228,1.29011,1.13171,{"$f":"AN27+((AN29-AN27)/2)","v":69.05},1.0471988669409447,1.2021874904764758,1.1584541354089894,{"$f":"AR27+((AR29-AR27)/2)","v":{"v":180.6,"d":"180.60"}},{"$nulls":3},1000,{"$nulls":3},1000,{"$nulls":3},1000,{"$nulls":3},1000,{"$nulls":17},{"v":0,"d":"0.00E+00"},{"v":0,"d":"0.00E+00"},{"v":0,"d":"0.00E+00"},{"v":0,"d":"0.00E+00"},{"v":0,"d":"0.00E+00"},{"v":0,"d":"0.00E+00"},{"v":0,"d":"0.00E+00"},{"v":0,"d":"0.00E+00"},{"v":0,"d":"0.00E+00"},{"v":0,"d":"0.00E+00"},{"v":0,"d":"0.00E+00"},{"v":0,"d":"0.00E+00"},{"v":0,"d":"0.00E+00"},{"v":0,"d":"0.00E+00"},{"$nulls":43},{"v":1.23195739E-6,"d":"1.23E-06"},{"v":-0.000403307611,"d":"-4.03E-04"},{"v":0.0235485401,"d":"2.35E-02"},{"v":-4.15029357,"d":"-4.15E+00"},{"v":1086.48702,"d":"1.09E+03"},null,{"v":-6.2770093e-08,"d":"-6.28E-08"},{"v":1.33139917E-4,"d":"1.33E-04"},{"v":0.00933321085,"d":"9.33E-03"},{"v":47.5620444,"d":"4.76E+01"},{"v":-7.03046897e-05,"d":"-7E-05"},{"v":-0.0253476076,"d":"-3E-02"},{"v":1790.25922,"d":"2E+03"},{"$nulls":8},{"$f":"IF($BK$17=\"11\",FA28,IF($BK$17=\"21\",FA28,IF($BK$17=\"12\",FC28,IF($BK$17=\"22\",FC28,IF($BK$17=\"13\",FD28,IF($BK$17=\"23\",FD28,IF($BK$17=\"14\",FB28,IF($BK$17=\"24\",FB28,IF($BK$17=\"31\",FE28,IF($BK$17=\"41\",FE28,IF($BK$17=\"32\",FG28,IF($BK$17=\"42\",FG28,IF($BK$17=\"33\",FH28,IF($BK$17=\"43\",FH28,IF($BK$17=\"34\",FF28,IF($BK$17=\"44\",FF28,))))))))))))))))","v":{"v":17,"d":"17.0"}},{"$f":"((FA29-FA27)/2)+FA27","v":17},17,17,17,{"$nulls":5},{"v":0,"d":"0.0"},{"v":1.175,"d":"1.18"},null,{"v":0,"d":"0.00%"},{"$f":"((FN29-FN27)/2)+FN27","v":{"v":517.6964370000001,"d":"517.7"}},{"$f":"((FO29-FO27)/2)+FO27","v":{"v":1086.4870225,"d":"1086.5"}},{"$f":"FN28/FO28","v":{"v":0.4764865353005172,"d":"47.65%"}},{"v":0,"d":"0.00"},{"v":0,"d":"0.00"},{"v":568.7905854999999,"d":"568.79"},{"v":0,"d":"0.00%"},{"v":17,"d":"17.00"},21.150000000000002,{"v":4.150000000000002,"d":"4.15"},null,null,{"v":17,"d":"17.00"},null,null,15.69066559142683,null,{"v":0,"d":"0.0%"},null,{"v":2334.1781978570243,"d":"2334.18"},{"$error":"#DIV/0!"},{"v":1167.0890989285122,"d":"1167.09"},{"v":1167.089098928512,"d":"1167.09"},{"v":7.2478490515896785E-3,"d":"0.01"},{"v":7.2478490515896785E-3,"d":"0.01"},{"v":38.49069218350365,"d":"38.49"},{"$error":"#DIV/0!"},{"$error":"#DIV/0!"},null,{"v":3557.0118570174286,"d":"3557.01"},{"$error":"#DIV/0!"},{"v":1778.5059285087143,"d":"1778.51"},{"v":1778.5059285087143,"d":"1778.51"},{"$error":"#DIV/0!"},{"v":0.011112703645172665,"d":"0.0111"},{"v":0.011112703645172665,"d":"0.0111"},{"$error":"#DIV/0!"},{"v":55.47783951997643,"d":"55.48"},{"$error":"#DIV/0!"},{"$error":"#DIV/0!"},{"v":19.415087041495514,"d":"19.42"},{"$error":"#DIV/0!"},{"v":5.8527436755953275,"d":"6"},0,5.8527436755953275,{"v":17,"d":"17.0"},17,{"v":5.8527436755953275,"d":"6"},1,{"v":5.8527436755953275,"d":"6"},{"v":0,"d":"0.0"},{"v":1.175,"d":"1.18"},null,{"v":0,"d":"0.00%"},{"$f":"((HP29-HP27)/2)+HP27","v":{"v":517.6964370000001,"d":"517.7"}},{"v":1086.48702,"d":"1086.5"},{"$f":"HP28/HQ28","v":{"v":0.4764865363969098,"d":"47.65%"}},{"v":0,"d":"0.00"},{"v":0,"d":"0.00"},{"v":568.790583,"d":"568.79"},{"v":0,"d":"0.00%"},{"v":17,"d":"17.00"},21.150000000000002,{"v":4.150000000000002,"d":"4.15"},null,null,{"v":17,"d":"17.00"},null,null,15.69066559142683,null,{"$error":"#DIV/0!"},null,{"v":2334.1781978570243,"d":"2334.18"},{"$error":"#DIV/0!"}]
[null,{"$f":"IF($AL$5=1,$C29/10,IF($AL$5=2,$C29/10,IF($AL$5=3,1,IF($AL$5=4,$C29/10,))))","v":{"v":0.8,"d":"80%"}},8,{"v":6744.396958828855,"d":"6744"},580,{"v":8.480774212087125,"d":"8.5"},{"v":1371.8997657119116,"d":"1372"},{"v":1371.8997657119116,"d":"1372"},{"$f":"IF(Geg_dP<AB29,ROUND(((IF('Briza 22 & 26'!$M$4=\"High Perform. 208/230V (US/EU)\",cal!HK29,H29)/Watts)/((Tr_cool-Tv_cool)*1.163))*FlowH2O,IF(UnitsNo=1,0,IF(UnitsNo=2,2))),\"\")","v":590},{"v":8.750134100325388,"d":"8.8"},{"v":45,"d":"45.0"},{"$f":"IF(Geg_dP<$AB29,IF(CalcNo=\"12\",$ET29,IF(CalcNo=\"22\",$ET29,IF(CalcNo=\"13\",$EU29,IF(CalcNo=\"23\",$EU29,IF(CalcNo=\"11\",$ER29,IF(CalcNo=\"21\",$ER29,IF(CalcNo=\"14\",$ES29,IF(CalcNo=\"24\",$ES29,IF(CalcNo=\"32\",$EX29,IF(CalcNo=\"42\",$EX29,IF(CalcNo=\"33\",$EY29,IF(CalcNo=\"43\",$EY29,IF(CalcNo=\"31\",$EV29,IF(CalcNo=\"41\",$EV29,IF(CalcNo=\"34\",$EW29,IF(CalcNo=\"44\",$EW29,)))))))))))))))),\"\")","v":{"v":53,"d":"53.0"}},{"v":31.879079582988997,"d":"31.9"},{"v":579.161661,"d":"579"},{"v":0.9750196313131312,"d":"0.98"},{"v":54.182128860973364,"d":"54.2"},{"v":24.36526217076755,"d":"24.4"},{"v":19.959546895047005,"d":"20.0"},{"v":17.128859131157803,"d":"17.1"},{"v":0.7638489342617149,"d":"76%"},{"v":1002.7134849674694,"d":"1003"},{"v":0.19815656702932274,"d":"0.20"},{"v":2.3687682698871044,"d":"2.369"},0.980228,1.29011,1.13171,0.980228,85.88,0.980228,1.29011,1.13171,{"v":61,"d":"61.00"},0.980228,1.29011,1.13171,{"v":100,"d":"100.00"},0.980228,1.29011,1.13171,85.88,1.0471988669409447,1.2021874904764758,1.1584541354089894,{"v":206.2,"d":"206.20"},{"$nulls":3},1000,{"$nulls":3},1000,{"$nulls":3},1000,{"$nulls":3},1000,null,null,{"$f":"IF($BK$17=\"11\",BN29,IF($BK$17=\"21\",BQ29,IF($BK$17=\"12\",BN29,IF($BK$17=\"22\",BQ29,IF($BK$17=\"13\",BN29,IF($BK$17=\"23\",BQ29,IF($BK$17=\"14\",BN29,IF($BK$17=\"24\",BQ29,IF($BK$17=\"31\",BT29,IF($BK$17=\"41\",BW29,IF($BK$17=\"32\",BT29,IF($BK$17=\"42\",BW29,IF($BK$17=\"33\",BT29,IF($BK$17=\"43\",BW29,IF($BK$17=\"34\",BT29,IF($BK$17=\"44\",BW29,))))))))))))))))","v":{"v":8.92186764,"d":"8.92E+00"}},{"v":6.18626209,"d":"6.19E+00"},{"v":7.47950756732502e-05,"d":"7.48E-05"},{"v":8.92186764,"d":"8.92E+00"},{"v":6.18626209,"d":"6.19E+00"},{"v":7.47950756732502e-05,"d":"7.48E-05"},{"v":4.13149537,"d":"4.13E+00"},{"$f":"BO29","v":{"v":6.18626209,"d":"6.19E+00"}},{"$f":"+BP29","v":{"v":7.47950756732502e-05,"d":"7.48E-05"}},0,0,0,0,0,0,{"v":0,"d":"0.00E+00"},{"v":1.96948126e-08,"d":"1.97E-08"},{"v":5.15876391e-05,"d":"5.16E-05"},{"v":-0.0208433305,"d":"-2.08E-02"},{"v":-5.09270804,"d":"-5.09E+00"},{"v":579.161661,"d":"5.79E+02"},{"v":0,"d":"0.00E+00"},{"v":-8.84130423e-08,"d":"-8.84E-08"},{"v":9.01771626e-05,"d":"9.02E-05"},{"v":0.00402249581,"d":"4.02E-03"},{"v":16.4771898,"d":"1.65E+01"},{"v":-0.000173540207,"d":"-1.74E-04"},{"v":-0.406743741,"d":"-4.07E-01"},{"v":1296.49415,"d":"1.30E+03"},null,{"v":8.78725398e-06,"d":"8.79E-06"},{"v":-0.000825185742,"d":"-8.25E-04"},{"v":-0.0143398681,"d":"-1.43E-02"},{"v":-5.16234785,"d":"-5.16E+00"},{"v":435.112842,"d":"4.35E+02"},null,{"v":-8.66069846e-08,"d":"-8.66E-08"},{"v":8.19552591e-05,"d":"8.20E-05"},{"v":3.86369648E-3,"d":"3.86E-03"},{"v":11.4790949,"d":"1.15E+01"},{"v":-2.17152168E-4,"d":"-2.17E-04"},{"v":-0.155833711,"d":"-1.56E-01"},{"v":1080.80091,"d":"1.08E+03"},null,{"v":1.66933886E-6,"d":"1.67E-06"},{"v":-0.000410006502,"d":"-4.10E-04"},{"v":0.012203242,"d":"1.22E-02"},{"v":-5.37771878,"d":"-5.38E+00"},{"v":670.065309,"d":"6.70E+02"},null,{"v":-8.99835151e-08,"d":"-9.00E-08"},{"v":9.97296882e-05,"d":"9.97E-05"},{"v":0.00914115806,"d":"9.14E-03"},{"v":19.8057688,"d":"1.98E+01"},{"v":-4.44863341e-05,"d":"-4.45E-05"},{"v":-0.294994003,"d":"-2.95E-01"},{"v":1376.19701,"d":"1.38E+03"},null,{"v":1.96948126e-08,"d":"1.97E-08"},{"v":5.15876391e-05,"d":"5.16E-05"},{"v":-0.0208433305,"d":"-2.08E-02"},{"v":-5.09270804,"d":"-5.09E+00"},{"v":579.161661,"d":"5.79E+02"},null,{"v":-8.84130423e-08,"d":"-8.84E-08"},{"v":9.01771626e-05,"d":"9.02E-05"},{"v":0.00402249581,"d":"4.02E-03"},{"v":16.4771898,"d":"1.65E+01"},{"$f":" -0.000173540207","v":{"v":-0.000173540207,"d":"-1.74E-04"}},{"v":-0.406743741,"d":"-4.07E-01"},{"v":1296.49415,"d":"1.30E+03"},null,{"v":1.13909541e-06,"d":"1.14E-06"},{"v":-4.38950845E-4,"d":"-4.39E-04"},{"v":0.0326646985,"d":"3.27E-02"},{"v":-3.94824301,"d":"-3.95E+00"},{"v":1224.66743,"d":"1.22E+03"},null,{"v":-8.3050439e-08,"d":"-8.31E-08"},{"v":0.000182171097,"d":"1.82E-04"},{"v":0.000952583498,"d":"9.53E-04"},{"v":56.0954838,"d":"5.61E+01"},{"v":-7.87351254e-05,"d":"-8E-05"},{"v":0.0699652918,"d":"7E-02"},{"v":1907.07584,"d":"2E+03"},53,null,53,null,{"$f":"ER29-5","v":48},{"$nulls":3},17.5,{"$f":"Tavg_cold","v":17},{"$f":"IF($GC29<=$FC29,$FC29,IF($FM29<=$FP29,$FC29,$FZ29))","v":17.5},17.5,{"$f":"IF($GC29<=$FC29,$FC29,IF($FM29<=$FP29,$FC29,$FZ29))","v":17.5},{"$nulls":5},0.5,{"v":1.175,"d":"1.18"},null,{"v":0.4729134186250058,"d":"47.29%"},{"$f":"DU29","v":{"v":579.161661,"d":"579.2"}},{"$f":"EI29","v":{"v":1224.66743,"d":"1224.7"}},{"$f":"FP30","v":{"v":0.555903345122847,"d":"55.59%"}},{"v":579.161661,"d":"579.16"},{"v":0,"d":"0.00"},{"v":543.8707089999999,"d":"543.87"},{"v":0,"d":"0.00%"},{"v":17.5,"d":"17.50"},21.150000000000002,{"v":3.650000000000002,"d":"3.65"},null,null,{"v":17.5,"d":"17.50"},null,null,15.69066559142683,null,{"v":0,"d":"0.0%"},null,{"v":2334.1781978570243,"d":"2334.18"},{"v":15077.064713760918,"d":"15077.06"},{"v":1167.0890989285122,"d":"1167.09"},{"v":1167.089098928512,"d":"1167.09"},{"v":7.2478490515896785E-3,"d":"0.01"},{"v":7.2478490515896785E-3,"d":"0.01"},{"v":38.49069218350365,"d":"38.49"},{"v":73.3070184109425,"d":"73.31"},{"v":0.07740824365257937,"d":"8%"},null,{"v":3557.0118570174286,"d":"3557.01"},{"v":2328.347725231428,"d":"2328.35"},{"v":1778.5059285087143,"d":"1778.51"},{"v":1778.5059285087143,"d":"1778.51"},{"v":1778.5059285087143,"d":"1778.51"},{"v":0.011112703645172665,"d":"0.0111"},{"v":0.011112703645172665,"d":"0.0111"},{"v":0.011112703645172665,"d":"0.01"},{"v":55.47783951997643,"d":"55.48"},{"v":55.47783951997643,"d":"55.48"},{"v":48.255878212687314,"d":"48.26"},{"v":19.415087041495514,"d":"19.42"},{"v":19.415087041495514,"d":"19.42"},{"v":1371.8997657119116,"d":"1372"},579.161661,1371.8997657119116,17.5,17.5,{"v":1371.8997657119116,"d":"1372"},1,{"v":1371.8997657119116,"d":"1372"},0.5,{"v":1.175,"d":"1.18"},null,{"v":0.4729134186250058,"d":"47.29%"},{"v":579.161661,"d":"579.2"},{"v":1224.66743,"d":"1224.7"},{"$f":"HR30","v":{"v":0.555903345122847,"d":"55.59%"}},{"v":579.161661,"d":"579.16"},{"v":0,"d":"0.00"},{"v":543.8707089999999,"d":"543.87"},{"v":0,"d":"0.00%"},{"v":17.5,"d":"17.50"},21.150000000000002,{"v":3.650000000000002,"d":"3.65"},null,null,{"v":17.5,"d":"17.50"},null,null,15.69066559142683,null,{"$error":"#DIV/0!"},null,{"v":2334.1781978570243,"d":"2334.18"},{"v":15077.064713760918,"d":"15077.06"}]
[null,{"v":1,"d":"100%"},10,{"v":7515.139363436289,"d":"7515"},646,{"v":10.328690311651778,"d":"10.3"},{"v":1532.7406174704122,"d":"1533"},{"v":1532.7406174704122,"d":"1533"},{"$f":"IF(Geg_dP<AB30,ROUND(((IF('Briza 22 & 26'!$M$4=\"High Perform. 208/230V (US/EU)\",cal!HK30,H30)/Watts)/((Tr_cool-Tv_cool)*1.163))*FlowH2O,IF(UnitsNo=1,0,IF(UnitsNo=2,2))),\"\")","v":659},{"v":10.712040232877664,"d":"10.7"},{"v":49,"d":"49.0"},{"$f":"IF(Geg_dP<$AB30,IF(CalcNo=\"12\",$ET30,IF(CalcNo=\"22\",$ET30,IF(CalcNo=\"13\",$EU30,IF(CalcNo=\"23\",$EU30,IF(CalcNo=\"11\",$ER30,IF(CalcNo=\"21\",$ER30,IF(CalcNo=\"14\",$ES30,IF(CalcNo=\"24\",$ES30,IF(CalcNo=\"32\",$EX30,IF(CalcNo=\"42\",$EX30,IF(CalcNo=\"33\",$EY30,IF(CalcNo=\"43\",$EY30,IF(CalcNo=\"31\",$EV30,IF(CalcNo=\"41\",$EV30,IF(CalcNo=\"34\",$EW30,IF(CalcNo=\"44\",$EW30,)))))))))))))))),\"\")","v":{"v":57,"d":"57.0"}},{"$f":"IF(Geg_dP<$AB30,($CF30*(($N30*CFMs)^4))+($CG30*(($N30*CFMs)^3))+($CH30*(($N30*CFMs)^2))+($CI30*($N30*CFMs))+$CJ30,\"\")","v":{"v":46.36358146180268,"d":"46.4"}},{"v":680.796721,"d":"681"},{"v":1.146122425925926,"d":"1.15"},{"v":52.402265147039785,"d":"52.4"},{"v":23.90032537638189,"d":"23.9"},{"v":20.308411222994504,"d":"20.3"},{"v":17.246683477907272,"d":"17.2"},{"v":0.7475696262393953,"d":"75%"},{"v":1119.0768344085554,"d":"1119"},{"v":0.24516700523663312,"d":"0.25"},{"v":2.2513924791221376,"d":"2.251"},0.980228,1.29011,1.13171,0.980228,115.48,0.980228,1.29011,1.13171,{"v":82,"d":"82.00"},0.980228,1.29011,1.13171,{"v":136,"d":"136.00"},0.980228,1.29011,1.13171,115.48,1.0471988669409447,1.2021874904764758,1.1584541354089894,{"$f":"AR29","v":{"v":206.2,"d":"206.20"}},{"$nulls":3},1000,{"$nulls":3},1000,{"$nulls":3},1000,{"$nulls":3},1000,null,null,{"v":-100.572988,"d":"-1.01E+02"},{"v":11.993211,"d":"1.20E+01"},{"v":1.8290914425086318,"d":"1.83E+00"},{"v":-100.572988,"d":"-1.01E+02"},{"v":11.993211,"d":"1.20E+01"},{"v":1.8290914425086318,"d":"1.83E+00"},{"v":42.7862742,"d":"4.28E+01"},{"$f":"BO30","v":{"v":11.993211,"d":"1.20E+01"}},{"$f":"+BP30","v":{"v":1.8290914425086318,"d":"1.83E+00"}},0,0,0,0,0,0,{"v":0,"d":"0.00E+00"},{"v":-1.14394599e-06,"d":"-1.14E-06"},{"v":0.000272206979,"d":"2.72E-04"},{"v":-0.0269005902,"d":"-2.69E-02"},{"v":-4.49481216,"d":"-4.49E+00"},{"v":680.796721,"d":"6.81E+02"},{"v":0,"d":"0.00E+00"},{"v":-3.99978238e-07,"d":"-4.00E-07"},{"v":0.000276824363,"d":"2.77E-04"},{"v":0.00919669609,"d":"9.20E-03"},{"v":23.9646479,"d":"2.40E+01"},{"v":-1.26308006E-4,"d":"-1.26E-04"},{"v":-0.460486712,"d":"-4.60E-01"},{"v":1491.11644,"d":"1.49E+03"},null,{"v":2.56989698e-06,"d":"2.57E-06"},{"v":-3.87324863E-4,"d":"-3.87E-04"},{"v":-3.58428489E-3,"d":"-3.58E-03"},{"v":-4.84558781,"d":"-4.85E+00"},{"v":519.739461,"d":"5.20E+02"},null,{"v":-4.04031137e-07,"d":"-4.04E-07"},{"v":2.51694287E-4,"d":"2.52E-04"},{"v":0.0115735178,"d":"1.16E-02"},{"v":15.6660152,"d":"1.57E+01"},{"v":-1.69777536E-4,"d":"-1.70E-04"},{"v":-0.189175462,"d":"-1.89E-01"},{"v":1244.36003,"d":"1.24E+03"},null,{"v":8.45037138E-7,"d":"8.45E-07"},{"v":-0.000268391939,"d":"-2.68E-04"},{"v":0.0149031926,"d":"1.49E-02"},{"v":-4.87030332,"d":"-4.87E+00"},{"v":785.565979,"d":"7.86E+02"},null,{"v":-3.1246284e-07,"d":"-3.12E-07"},{"v":2.26268063E-4,"d":"2.26E-04"},{"v":0.0432743999,"d":"4.33E-02"},{"v":27.8436334,"d":"2.78E+01"},{"v":4.12403107e-05,"d":"4.12E-05"},{"v":-0.409641333,"d":"-4.10E-01"},{"v":1609.75577,"d":"1.61E+03"},null,{"v":-1.14394599e-06,"d":"-1.14E-06"},{"v":0.000272206979,"d":"2.72E-04"},{"v":-0.0269005902,"d":"-2.69E-02"},{"v":-4.49481216,"d":"-4.49E+00"},{"v":680.796721,"d":"6.81E+02"},null,{"v":-3.99978238e-07,"d":"-4.00E-07"},{"v":0.000276824363,"d":"2.77E-04"},{"v":0.00919669609,"d":"9.20E-03"},{"v":23.9646479,"d":"2.40E+01"},{"v":-1.26308006E-4,"d":"-1.26E-04"},{"v":-0.460486712,"d":"-4.60E-01"},{"v":1491.11644,"d":"1.49E+03"},{"$f":"ED29","v":0},{"v":1.13909541e-06,"d":"1.14E-06"},{"v":-4.38950845E-4,"d":"-4.39E-04"},{"v":0.0326646985,"d":"3.27E-02"},{"v":-3.94824301,"d":"-3.95E+00"},{"v":1224.66743,"d":"1.22E+03"},{"$f":"EJ29","v":0},{"v":-8.3050439e-08,"d":"-8.31E-08"},{"v":0.000182171097,"d":"1.82E-04"},{"v":0.000952583498,"d":"9.53E-04"},{"v":56.0954838,"d":"5.61E+01"},{"v":-7.87351254e-05,"d":"-8E-05"},{"v":0.0699652918,"d":"7E-02"},{"v":1907.07584,"d":"2E+03"},57,null,57,null,{"$f":"ER30-5","v":52},{"$nulls":3},17.5,{"$f":"Tavg_cold","v":17},{"$f":"IF($GC30<=$FC30,$FC30,IF($FM30<=$FP30,$FC30,$FZ30))","v":17.5},17.5,{"$f":"IF($GC30<=$FC30,$FC30,IF($FM30<=$FP30,$FC30,$FZ30))","v":17.5},{"$nulls":5},0.5,{"v":1.175,"d":"1.18"},null,{"v":0.555903345122847,"d":"55.59%"},{"$f":"DU30","v":{"v":680.796721,"d":"680.8"}},{"$f":"EI30","v":{"v":1224.66743,"d":"1224.7"}},{"$f":"FN30/FO30","v":{"v":0.555903345122847,"d":"55.59%"}},{"v":680.796721,"d":"680.80"},{"v":0,"d":"0.00"},{"v":543.8707089999999,"d":"543.87"},{"v":0,"d":"0.00%"},{"v":17.5,"d":"17.50"},21.150000000000002,{"v":3.650000000000002,"d":"3.65"},null,null,{"v":17.5,"d":"17.50"},null,null,15.69066559142683,null,{"v":0,"d":"0.0%"},null,{"v":2334.1781978570243,"d":"2334.18"},{"v":13830.645892912335,"d":"13830.65"},{"v":1167.0890989285122,"d":"1167.09"},{"v":1167.089098928512,"d":"1167.09"},{"v":7.2478490515896785E-3,"d":"0.01"},{"v":7.2478490515896785E-3,"d":"0.01"},{"v":38.49069218350365,"d":"38.49"},{"v":71.4941320352363,"d":"71.49"},{"v":0.0843842802400573,"d":"8%"},null,{"v":3557.0118570174286,"d":"3557.01"},{"v":2379.0505473789553,"d":"2379.05"},{"v":1778.5059285087143,"d":"1778.51"},{"v":1778.5059285087143,"d":"1778.51"},{"v":1778.5059285087143,"d":"1778.51"},{"v":0.011112703645172665,"d":"0.0111"},{"v":0.011112703645172665,"d":"0.0111"},{"v":0.011112703645172665,"d":"0.01"},{"v":55.47783951997643,"d":"55.48"},{"v":55.47783951997643,"d":"55.48"},{"v":48.6137365266867,"d":"48.61"},{"v":19.415087041495514,"d":"19.42"},{"v":19.415087041495514,"d":"19.42"},{"v":1532.7406174704122,"d":"1533"},680.796721,1532.7406174704122,17.5,17.5,{"v":1532.7406174704122,"d":"1533"},1,{"v":1532.7406174704122,"d":"1533"},0.5,{"v":1.175,"d":"1.18"},null,{"v":0.555903345122847,"d":"55.59%"},{"v":680.796721,"d":"680.8"},{"v":1224.66743,"d":"1224.7"},{"$f":"HP30/HQ30","v":{"v":0.555903345122847,"d":"55.59%"}},{"v":680.796721,"d":"680.80"},{"v":0,"d":"0.00"},{"v":543.8707089999999,"d":"543.87"},{"v":0,"d":"0.00%"},{"v":17.5,"d":"17.50"},21.150000000000002,{"v":3.650000000000002,"d":"3.65"},null,null,{"v":17.5,"d":"17.50"},null,null,15.69066559142683,null,{"$error":"#DIV/0!"},null,{"v":2334.1781978570243,"d":"2334.18"},{"v":13830.645892912335,"d":"13830.65"}]
[null,{"$f":"IF(LangNo=1,NL!A31,IF(LangNo=2,EN!A31,IF(LangNo=3,DE!A31,IF(LangNo=4,FR!A31,IF(LangNo=5,NR!A31,IF(LangNo=6,SP!A31,IF(LangNo=7,SW!A31,IF(LangNo=8,TS!A31,IF(LangNo=9,ExtraTaal1!A31,IF(LangNo=10,ExtraTaal2!A31,IF(LangNo=11,ExtraTaal3!A31,)))))))))))","v":"Briza 22 (230V) height 54,5 cm, width 22 cm, length 95 cm (Type 04)"},{"$nulls":24},0,"m³/h","n-value","n-value","n-value","m³/h","n-value","n-value","n-value","m³/h","n-value","n-value","n-value","m³/h","n-value","n-value","n-value","m³/h","n-value","n-value","n-value","m³/h","n-value","n-value","n-value","m³/h","n-value","n-value","n-value","m³/h","n-value","n-value","n-value","m³/h",null,{"$f":"IF($BK$17=\"11\",BO31,IF($BK$17=\"21\",BR31,IF($BK$17=\"12\",BO31,IF($BK$17=\"22\",BR31,IF($BK$17=\"13\",BO31,IF($BK$17=\"23\",BR31,IF($BK$17=\"14\",BO31,IF($BK$17=\"24\",BR31,IF($BK$17=\"31\",BU31,IF($BK$17=\"41\",BX31,IF($BK$17=\"32\",BU31,IF($BK$17=\"42\",BX31,IF($BK$17=\"33\",BU31,IF($BK$17=\"43\",BX31,IF($BK$17=\"34\",BU31,IF($BK$17=\"44\",BX31,))))))))))))))))","v":22},{"$f":"(BN31+IF(CaseNo=1,0,IF(CaseNo=2,$BN$2,)))*MilInch","v":54.5},{"$f":"(BJ31+IF(CaseNo=1,0,IF(CaseNo=2,$BN$3,)))*MilInch","v":22},{"$f":"(BP31+IF(CaseNo=1,0,IF(CaseNo=2,$BN$4,)))*MilInch","v":75},54.5,22,75,54.5,22,75,54.5,26,75,54.5,26,75,{"$f":"CF31","v":"T04"},{"$nulls":5},"T04",{"$nulls":7},{"$f":"CF31","v":"T04"},{"$nulls":13},{"$f":"CF31","v":"T04"},{"$nulls":13},{"$f":"CF31","v":"T04"},{"$nulls":13},{"$f":"CF31","v":"T04"},{"$nulls":13},"T04",{"$nulls":8},{"$f":"ER31","v":"T04"},{"$nulls":54},{"$f":"H31","v":0},{"$error":"#VALUE!"},{"$f":"IF(Geg_dP<$AB31,((($BL$18*($HE31/Cubics)^4+$BL$19*($HE31/Cubics)^3+$BL$20*($HE31/Cubics)^2+$BL$21*($HE31/Cubics)^1+$BL$22)*((CF_Regime_Cool_noExp)^$Y31)))*CF_Addit*Watts*CF_Altit,Lim_dP)","v":{"$error":"#VALUE!"}},{"$error":"#VALUE!"},{"$error":"#VALUE!"},{"$error":"#VALUE!"},{"$error":"#VALUE!"},{"$error":"#VALUE!"},"T04"]
[null,{"$f":"IF($AL$5=1,$C32/10,IF($AL$5=2,$C32/10,IF($AL$5=3,0,IF($AL$5=4,$C32/10,))))","v":{"v":0.2,"d":"20%"}},2,{"$f":"IF(Geg_dP<AB32,((($BK$32*($N32/Cubics)^4+$BK$33*($N32/Cubics)^3+$BK$35*($N32/Cubics)^2+$BK$37*($N32/Cubics)^1+$BK$38)*((CF_Regime_Heat_noExp)^$AA32)))*CF_Addit*Watts*CF_Altit,Lim_dP)","v":{"v":3210.5181232071163,"d":"3211"}},{"$f":"IF(Geg_dP<$AB32,ROUND((($D32/Watts)/((Tv_heat-Tr_heat)*1.163))*FlowH2O,IF(UnitsNo=1,0,IF(UnitsNo=2,2))),\"\")","v":276},{"$f":"IF(Geg_dP<$AB32,IF((($BM$32*(E32/FlowH2O)^$BM$33))*kPa>0,(($BM$32*(E32/FlowH2O)^$BM$33))*kPa,0),\"\")","v":{"v":2.558645147451846,"d":"2.6"}},{"$f":"IF(Geg_dP<$AB32,((($BL$32*($N32/Cubics)^4+$BL$33*($N32/Cubics)^3+$BL$35*($N32/Cubics)^2+$BL$37*($N32/Cubics)^1+$BL$38)*((CF_Regime_Cool_noExp)^$Y32)))*CF_Addit*Watts*CF_Altit,Lim_dP)","v":{"v":746.8295455661088,"d":"747"}},{"$f":"IF(Geg_dP<$AB32,((G32/Watts)/(IF((237.3*LN((RH*EXP(17.27*(Tl_cool/(Tl_cool+237.3))))))/(17.27-LN((RH*EXP(17.27*(Tl_cool/(Tl_cool+237.3))))))<EZ32,1,IF(1/(1+((2258*((0.622/((101325/(1*611*EXP(17.27*(EZ32/(EZ32+237.3))))))-1)*1000-(0.622/((101325/(RH*611*EXP(17.27*(Tl_cool/(Tl_cool+237.3))))))-1)*1000))/(1005*(Tavg_cold-Tl_cool))))>1,1,1/(1+((2258*((0.622/((101325/(1*611*EXP(17.27*(EZ32/(EZ32+237.3))))))-1)*1000-(0.622/((101325/(RH*611*EXP(17.27*(Tl_cool/(Tl_cool+237.3))))))-1)*1000))/(1005*(Tavg_cold-Tl_cool))))))))*Watts,\"\")","v":{"v":746.8295455661088,"d":"747"}},{"$f":"IF(Geg_dP<AB32,ROUND(((IF('Briza 22 & 26'!$M$4=\"High Perform. 208/230V (US/EU)\",cal!HK32,H32)/Watts)/((Tr_cool-Tv_cool)*1.163))*FlowH2O,IF(UnitsNo=1,0,IF(UnitsNo=2,2))),\"\")","v":321},{"$f":"IF(Geg_dP<$AB32,IF((($BM$37*(I32/FlowH2O)^$BM$38))*kPa>0,(($BM$37*(I32/FlowH2O)^$BM$38))*kPa,0),\"\")","v":{"v":3.3735100324461316,"d":"3.4"}},{"$f":"IF(Geg_dP<AB32,IF($L32-8<0,0,$L32-8),\"\")","v":{"v":22,"d":"22.0"}},{"$f":"IF(Geg_dP<$AB32,IF(CalcNo=\"12\",$ET32,IF(CalcNo=\"22\",$ET32,IF(CalcNo=\"13\",$EU32,IF(CalcNo=\"23\",$EU32,IF(CalcNo=\"11\",$ER32,IF(CalcNo=\"21\",$ER32,IF(CalcNo=\"14\",$ES32,IF(CalcNo=\"24\",$ES32,IF(CalcNo=\"32\",$EX32,IF(CalcNo=\"42\",$EX32,IF(CalcNo=\"33\",$EY32,IF(CalcNo=\"43\",$EY32,IF(CalcNo=\"31\",$EV32,IF(CalcNo=\"41\",$EV32,IF(CalcNo=\"34\",$EW32,IF(CalcNo=\"44\",$EW32,)))))))))))))))),\"\")","v":{"v":30,"d":"30.0"}},{"$f":"IF(Geg_dP<$AB32,($CF32*(($N32/Cubics)^4))+($CG32*(($N32/Cubics)^3))+($CH32*(($N32/Cubics)^2))+($CI32*($N32/Cubics))+$CJ32,\"\")","v":{"v":3.932234097736646,"d":"3.9"}},{"$f":"IF(Geg_dP<$AB32,(BZ32*Geg_dP^5+CA32*Geg_dP^4+CB32*Geg_dP^3+CC32*Geg_dP^2+CD32*Geg_dP+CE32)*CF_Case*Cubics,\"\")","v":{"v":247.220183,"d":"247"}},{"$f":"IF(Geg_dP<$AB32,(($N32/Cubics)/3600)/(($BJ$39/100)*($BP$39/100))*FeetMins,\"\")","v":{"v":0.3285754691653376,"d":"0.33"}},{"$f":"IF(Geg_dP<$AB32,((($D32/Watts)/(((p_atm*0.028964)/(8.31447*(20+273.15)))*(($N32/3600)/Cubics)*(1005+1870*((0.622)/(((p_atm)/($E$14*pvs_heat_in))-1)))))+Tl_heat)*Celc1+Celc2,\"\")","v":{"v":58.11948199690513,"d":"58.1"}},{"$f":"IF(Geg_dP<$AB32,(27.8*LN(($GN32+36)/45.5))*Celc1+Celc2,\"\")","v":{"v":25.366960932333647,"d":"25.4"}},{"$f":"IF(Geg_dP<$AB32,(Tl_cool-(($G32/Watts)/(1006*$N32*kgss)))*Celc1+Celc2,\"\")","v":{"v":18.0212557681714,"d":"18.0"}},{"$f":"IF(Geg_dP<$AB32,IF((27.8*LN(($HA32+36)/45.5))*Celc1+Celc2>R32,R32,(27.8*LN(($HA32+36)/45.5))*Celc1+Celc2),\"\")","v":{"v":16.46497319463652,"d":"16.5"}},{"$f":"IF(Geg_dP<$AB32,IF($H32>$G32,1,IF(($GT32/$GR32)<0,0,$GT32/$GR32)),\"\")","v":{"v":0.8618931013881044,"d":"86%"}},{"$f":"IF(Geg_dP<$AB32,$CK32*($N32/Cubics)^2+$CL32*($N32/Cubics)^1+$CM32,\"\")","v":{"v":417.3402059477958,"d":"417"}},{"$f":"M32/((N32/Cubics)/3.6)","v":{"v":0.05726086996647813,"d":"0.06"}},{"$f":"(G32/Watts)/(N32/Cubics)","v":{"v":3.020908473181208,"d":"3.021"}},1.03062,1.073,1.14154,1.03062,11.6,1.03062,1.073,1.14154,{"v":5.5,"d":"5.50"},1.03062,1.073,1.14154,{"v":7,"d":"7.00"},1.03062,1.073,1.14154,{"v":11.6,"d":"11.60"},1.0127469901095905,1.4118789851268314,1.1240022585776352,21.22,{"$nulls":3},1000,{"$nulls":3},1000,{"$nulls":3},1000,{"$nulls":3},1000,null,null,{"$f":"IF($BK$17=\"11\",BN32,IF($BK$17=\"21\",BQ32,IF($BK$17=\"12\",BN32,IF($BK$17=\"22\",BQ32,IF($BK$17=\"13\",BN32,IF($BK$17=\"23\",BQ32,IF($BK$17=\"14\",BN32,IF($BK$17=\"24\",BQ32,IF($BK$17=\"31\",BT32,IF($BK$17=\"41\",BW32,IF($BK$17=\"32\",BT32,IF($BK$17=\"42\",BW32,IF($BK$17=\"33\",BT32,IF($BK$17=\"43\",BW32,IF($BK$17=\"34\",BT32,IF($BK$17=\"44\",BW32,))))))))))))))))","v":{"v":0,"d":"0.00E+00"}},{"v":0,"d":"0.00E+00"},{"v":8.7092260316846474E-5,"d":"8.71E-05"},null,null,{"$f":"BP37","v":{"v":8.7092260316846474E-5,"d":"8.71E-05"}},null,{"$f":"BO32","v":0},{"v":1.0766558270359899E-4,"d":"1.08E-04"},0,0,0,0,0,0,{"$f":"IF($BK$17=\"11\",CN32,IF($BK$17=\"21\",CN32,IF($BK$17=\"12\",DP32,IF($BK$17=\"22\",DP32,IF($BK$17=\"13\",ED32,IF($BK$17=\"23\",ED32,IF($BK$17=\"14\",DB32,IF($BK$17=\"24\",DB32,IF($BK$17=\"31\",0,IF($BK$17=\"41\",0,IF($BK$17=\"32\",0,IF($BK$17=\"42\",0,IF($BK$17=\"33\",0,IF($BK$17=\"43\",0,IF($BK$17=\"34\",DB32,IF($BK$17=\"44\",DB32,))))))))))))))))","v":{"v":0,"d":"0.00E+00"}},{"v":0.00410899598,"d":"4.11E-03"},{"$f":"IF($BK$17=\"11\",CP32,IF($BK$17=\"21\",CP32,IF($BK$17=\"12\",DR32,IF($BK$17=\"22\",DR32,IF($BK$17=\"13\",EF32,IF($BK$17=\"23\",EF32,IF($BK$17=\"14\",DD32,IF($BK$17=\"24\",DD32,IF($BK$17=\"31\",0,IF($BK$17=\"41\",0,IF($BK$17=\"32\",0,IF($BK$17=\"42\",0,IF($BK$17=\"33\",0,IF($BK$17=\"43\",0,IF($BK$17=\"34\",DD32,IF($BK$17=\"44\",DD32,))))))))))))))))","v":{"v":-0.122825751,"d":"-1.23E-01"}},{"v":1.07027706,"d":"1.07E+00"},{"v":-19.2451049,"d":"-1.92E+01"},{"v":247.220183,"d":"2.47E+02"},{"v":0,"d":"0.00E+00"},{"v":-5.41379521e-08,"d":"-5.41E-08"},{"v":2.48566072e-05,"d":"2.49E-05"},{"v":0.00127742741,"d":"1.28E-03"},{"v":2.91524719,"d":"2.92E+00"},{"v":-4.36554554e-05,"d":"-4.37E-05"},{"v":-0.371553834,"d":"-3.72E-01"},{"v":511.863939,"d":"5.12E+02"},null,{"v":-0.0286118986,"d":"-2.86E-02"},{"v":0.386743275,"d":"3.87E-01"},{"v":-1.61466769,"d":"-1.61E+00"},{"v":-16.8950264,"d":"-1.69E+01"},{"v":108.259045,"d":"1.08E+02"},null,{"v":-1.53401773e-07,"d":"-1.53E-07"},{"v":3.85120171e-05,"d":"3.85E-05"},{"v":4.03162116e-05,"d":"4.03E-05"},{"v":2.15156818,"d":"2.15E+00"},{"$f":" -0.000556186953","v":{"v":-0.000556186953,"d":"-5.56E-04"}},{"v":-0.0593641273,"d":"-5.94E-02"},{"v":342.887304,"d":"3.43E+02"},null,{"v":0.0307510349,"d":"3.08E-02"},{"v":-0.300291893,"d":"-3.00E-01"},{"v":-0.404173611,"d":"-4.04E-01"},{"v":-17.7272364,"d":"-1.77E+01"},{"v":185.11197,"d":"1.85E+02"},null,{"v":-1.32133342e-07,"d":"-1.32E-07"},{"v":4.40856435e-05,"d":"4.41E-05"},{"v":-0.000370591255,"d":"-3.71E-04"},{"v":2.58292755,"d":"2.58E+00"},{"v":-0.000182698739,"d":"-1.83E-04"},{"v":-0.105857467,"d":"-1.06E-01"},{"v":386.579502,"d":"3.87E+02"},null,{"v":0.00410899598,"d":"4.11E-03"},{"v":-0.122825751,"d":"-1.23E-01"},{"v":1.07027706,"d":"1.07E+00"},{"v":-19.2451049,"d":"-1.92E+01"},{"v":247.220183,"d":"2.47E+02"},null,{"v":-5.41379521e-08,"d":"-5.41E-08"},{"v":2.48566072e-05,"d":"2.49E-05"},{"v":0.00127742741,"d":"1.28E-03"},{"v":2.91524719,"d":"2.92E+00"},{"$f":" -0.0000436554554","v":{"v":-4.36554554e-05,"d":"-4.37E-05"}},{"v":-0.371553834,"d":"-3.72E-01"},{"v":511.863939,"d":"5.12E+02"},null,{"v":0.000471948839,"d":"4.72E-04"},{"v":-0.0146009054,"d":"-1.46E-02"},{"v":-0.0936444997,"d":"-9.36E-02"},{"v":-13.1145013,"d":"-1.31E+01"},{"v":416.394092,"d":"4.16E+02"},null,{"v":-7.26262101e-08,"d":"-7.26E-08"},{"v":5.41146464e-05,"d":"5.41E-05"},{"v":0.000135447515,"d":"1.35E-04"},{"v":8.42908903,"d":"8.43E+00"},{"v":6.06988763e-05,"d":"6E-05"},{"v":-0.146766201,"d":"-1E-01"},{"v":666.111729,"d":"7E+02"},30,null,30,null,{"$f":"ER32-5","v":25},{"$nulls":3},{"$f":"IF($BK$17=\"11\",FA32,IF($BK$17=\"21\",FA32,IF($BK$17=\"12\",FC32,IF($BK$17=\"22\",FC32,IF($BK$17=\"13\",FD32,IF($BK$17=\"23\",FD32,IF($BK$17=\"14\",FB32,IF($BK$17=\"24\",FB32,IF($BK$17=\"31\",FE32,IF($BK$17=\"41\",FE32,IF($BK$17=\"32\",FG32,IF($BK$17=\"42\",FG32,IF($BK$17=\"33\",FH32,IF($BK$17=\"43\",FH32,IF($BK$17=\"34\",FF32,IF($BK$17=\"44\",FF32,))))))))))))))))","v":17.5},{"$f":"Tavg_cold","v":17},{"$f":"IF($GC32<=$FC32,$FC32,IF($FM32<=$FP32,$FC32,$FZ32))","v":17.5},{"$f":"IF($N32>$FN32,Tavg_cold+(0.5*(Tr_cool-Tavg_cold)),Tavg_cold+($FJ32*(Tr_cool-Tavg_cold)))","v":17.5},{"$f":"IF($GC32<=$FC32,$FC32,IF($FM32<=$FP32,$FC32,$FZ32))","v":17.5},{"$nulls":5},{"$f":"0.5*(1-((FN32-N32)/FN32))","v":0.5},{"$f":"(0.025*Tl_cool)+0.5","v":{"v":1.175,"d":"1.18"}},null,{"$f":"FQ32/FO32","v":{"v":0.593716836405066,"d":"59.37%"}},{"$f":"DU32","v":{"v":247.220183,"d":"247.2"}},{"$f":"EI32","v":{"v":416.394092,"d":"416.4"}},{"$f":"FN32/FO32","v":{"v":0.593716836405066,"d":"59.37%"}},{"$f":"N32/Cubics","v":{"v":247.220183,"d":"247.22"}},{"$f":"IF(FQ32-(FP32*FO32)<=0,0,FQ32-(FP32*FO32))","v":{"v":0,"d":"0.00"}},{"$f":"FO32*(1-FP32)","v":{"v":169.173909,"d":"169.17"}},{"$f":"IF((FR32/FS32)>1,1,FR32/FS32)","v":{"v":0,"d":"0.00%"}},{"v":17.5,"d":"17.50"},{"$f":"Tr_cool*FK32","v":21.150000000000002},{"v":3.650000000000002,"d":"3.65"},null,null,{"v":17.5,"d":"17.50"},null,null,{"$f":"(237.3*LN((RH*EXP(17.27*(Tl_cool/(Tl_cool+237.3))))))/(17.27-LN((RH*EXP(17.27*(Tl_cool/(Tl_cool+237.3))))))","v":15.69066559142683},null,{"$f":"(H32-G32)/H32","v":{"v":0,"d":"0.0%"}},null,{"$f":"(611*EXP(17.27*(Tl_heat/(Tl_heat+237.7))))","v":{"v":2334.1781978570243,"d":"2334.18"}},{"$f":"(611*EXP(17.27*((($P32-Celc2)/Celc1)/((($P32-Celc2)/Celc1)+237.7))))","v":{"v":18180.844873078393,"d":"18180.84"}},{"$f":"RH*$GG32","v":{"v":1167.0890989285122,"d":"1167.09"}},{"$f":"(GL32*p_atm)/(GL32+0.622)","v":{"v":1167.089098928512,"d":"1167.09"}},{"$f":"0.622*($GI32/(p_atm-$GI32))","v":{"v":7.2478490515896785E-3,"d":"0.01"}},{"v":7.2478490515896785E-3,"d":"0.01"},{"$f":"(1.005*Tl_heat)+($GK32*(2500+(1.87*Tl_heat)))","v":{"v":38.49069218350365,"d":"38.49"}},{"$f":"(1.005*(($P32-Celc2)/Celc1))+($GL32*(2500+(1.87*(($P32-Celc2)/Celc1))))","v":{"v":77.31742314058303,"d":"77.32"}},{"v":0.06419333683753607,"d":"6%"},null,{"$f":"(611*EXP(17.27*(Tl_cool/(Tl_cool+237.7))))","v":{"v":3557.0118570174286,"d":"3557.01"}},{"$f":"(611*EXP(17.27*((($R32-Celc2)/Celc1)/((($R32-Celc2)/Celc1)+237.7))))","v":{"v":2063.4878335194676,"d":"2063.49"}},{"$f":"RH*$GQ32","v":{"v":1778.5059285087143,"d":"1778.51"}},{"$f":"(GW32*p_atm)/(GW32+0.622)","v":{"v":1778.5059285087143,"d":"1778.51"}},{"$f":"T32*GR32","v":{"v":1778.5059285087143,"d":"1778.51"}},{"$f":"0.622*($GS32/(p_atm-$GS32))","v":{"v":0.011112703645172665,"d":"0.0111"}},{"$f":"IF(H32=G32,GV32,(0.53475935828878*($GZ32-(1.005*(($R32-Celc2)/Celc1))))/(1336.8983957219))","v":{"v":0.011112703645172665,"d":"0.0111"}},{"$f":"0.622*($GU32/(p_atm-$GU32))","v":{"v":0.011112703645172665,"d":"0.01"}},{"$f":"(1.005*Tl_cool)+($GV32*(2500+(1.87*Tl_cool)))","v":{"v":55.47783951997643,"d":"55.48"}},{"$f":"GY32-((((H32-G32)/Watts)/1000)/(N32/$L$15))","v":{"v":55.47783951997643,"d":"55.48"}},{"$f":"(1.005*(($R32-Celc2)/Celc1))+($GX32*(2500+(1.87*(($R32-Celc2)/Celc1))))","v":{"v":46.26761647556849,"d":"46.27"}},{"v":19.415087041495514,"d":"19.42"},{"v":19.415087041495514,"d":"19.42"},{"$f":"H32","v":{"v":746.8295455661088,"d":"747"}},247.220183,{"$f":"IF(Geg_dP<$AB32,((($BL$32*($HE32/Cubics)^4+$BL$33*($HE32/Cubics)^3+$BL$35*($HE32/Cubics)^2+$BL$37*($HE32/Cubics)^1+$BL$38)*((CF_Regime_Cool_noExp)^$Y32)))*CF_Addit*Watts*CF_Altit,Lim_dP)","v":746.8295455661088},17.5,17.5,{"v":746.8295455661088,"d":"747"},1,{"v":746.8295455661088,"d":"747"},{"$f":"0.5*(1-((HP32-HE32)/HP32))","v":0.5},{"$f":"(0.025*Tl_cool)+0.5","v":{"v":1.175,"d":"1.18"}},null,{"$f":"HS32/HQ32","v":{"v":0.593716836405066,"d":"59.37%"}},{"$f":"DU32","v":{"v":247.220183,"d":"247.2"}},{"v":416.394092,"d":"416.4"},{"$f":"HP32/HQ32","v":{"v":0.593716836405066,"d":"59.37%"}},{"v":247.220183,"d":"247.22"},{"$f":"IF(HS32-(HR32*HQ32)<=0,0,HS32-(HR32*HQ32))","v":{"v":0,"d":"0.00"}},{"$f":"HQ32*(1-HR32)","v":{"v":169.173909,"d":"169.17"}},{"$f":"IF((HT32/HU32)>1,1,HT32/HU32)","v":{"v":0,"d":"0.00%"}},{"v":17.5,"d":"17.50"},{"$f":"Tr_cool*HM32","v":21.150000000000002},{"$f":"ABS(HX32-HW32)","v":{"v":3.650000000000002,"d":"3.65"}},null,null,{"$f":"IF(HO32<=HR32,HW32,HW32+(HV32*HY32))","v":{"v":17.5,"d":"17.50"}},null,null,{"$f":"(237.3*LN((RH*EXP(17.27*(Tl_cool/(Tl_cool+237.3))))))/(17.27-LN((RH*EXP(17.27*(Tl_cool/(Tl_cool+237.3))))))","v":15.69066559142683},null,{"$f":"(BG32-BF32)/BG32","v":{"$error":"#DIV/0!"}},null,{"$f":"(611*EXP(17.27*(Tl_heat/(Tl_heat+237.7))))","v":{"v":2334.1781978570243,"d":"2334.18"}},{"$f":"(611*EXP(17.27*((($P32-Celc2)/Celc1)/((($P32-Celc2)/Celc1)+237.7))))","v":{"v":18180.844873078393,"d":"18180.84"}}]
[null,{"$f":"IF($AL$5=1,$C33/10,IF($AL$5=2,$C33/10,IF($AL$5=3,0,IF($AL$5=4,$C33/10,))))","v":{"v":0.4,"d":"40%"}},4,{"v":5519.575227392482,"d":"5520"},475,{"v":6.9120753049022925,"d":"6.9"},{"v":1265.5751323529887,"d":"1266"},{"v":1265.5751323529887,"d":"1266"},{"$f":"IF(Geg_dP<AB33,ROUND(((IF('Briza 22 & 26'!$M$4=\"High Perform. 208/230V (US/EU)\",cal!HK33,H33)/Watts)/((Tr_cool-Tv_cool)*1.163))*FlowH2O,IF(UnitsNo=1,0,IF(UnitsNo=2,2))),\"\")","v":544},{"v":8.859991423883756,"d":"8.9"},29.5,{"$f":"IF(Geg_dP<$AB33,IF(CalcNo=\"12\",$ET33,IF(CalcNo=\"22\",$ET33,IF(CalcNo=\"13\",$EU33,IF(CalcNo=\"23\",$EU33,IF(CalcNo=\"11\",$ER33,IF(CalcNo=\"21\",$ER33,IF(CalcNo=\"14\",$ES33,IF(CalcNo=\"24\",$ES33,IF(CalcNo=\"32\",$EX33,IF(CalcNo=\"42\",$EX33,IF(CalcNo=\"33\",$EY33,IF(CalcNo=\"43\",$EY33,IF(CalcNo=\"31\",$EV33,IF(CalcNo=\"41\",$EV33,IF(CalcNo=\"34\",$EW33,IF(CalcNo=\"44\",$EW33,)))))))))))))))),\"\")","v":37.5},{"v":9.858097036075701,"d":"9.9"},{"v":412.802491,"d":"413"},{"v":0.5486476488569909,"d":"0.55"},{"v":59.24814502651321,"d":"59.2"},{"v":25.647570543199233,"d":"25.6"},{"v":17.88779133166592,"d":"17.9"},{"v":16.41867142382871,"d":"16.4"},{"v":0.8691483965212843,"d":"87%"},{"v":624.1658420142392,"d":"624"},{"v":0.08597125769251361,"d":"0.09"},{"v":3.0658127311372954,"d":"3.066"},1.03062,{"$f":"IF($BK$17=\"11\",AD33,IF($BK$17=\"21\",AD33,IF($BK$17=\"12\",AL33,IF($BK$17=\"22\",AL33,IF($BK$17=\"13\",AP33,IF($BK$17=\"23\",AP33,IF($BK$17=\"14\",AH33,IF($BK$17=\"24\",AH33,IF($BK$17=\"31\",AT33,IF($BK$17=\"41\",AT33,IF($BK$17=\"32\",BB33,IF($BK$17=\"42\",BB33,IF($BK$17=\"33\",BF33,IF($BK$17=\"43\",BF33,IF($BK$17=\"34\",AX33,IF($BK$17=\"44\",AX33,))))))))))))))))","v":1.073},{"$f":"IF($BK$17=\"11\",AE33,IF($BK$17=\"21\",AE33,IF($BK$17=\"12\",AM33,IF($BK$17=\"22\",AM33,IF($BK$17=\"13\",AQ33,IF($BK$17=\"23\",AQ33,IF($BK$17=\"14\",AI33,IF($BK$17=\"24\",AI33,IF($BK$17=\"31\",AU33,IF($BK$17=\"41\",AU33,IF($BK$17=\"32\",BC33,IF($BK$17=\"42\",BC33,IF($BK$17=\"33\",BG33,IF($BK$17=\"43\",BG33,IF($BK$17=\"34\",AY33,IF($BK$17=\"44\",AY33,))))))))))))))))","v":1.14154},1.03062,30.340000000000003,1.03062,1.073,1.14154,{"v":18,"d":"18.00"},1.03062,1.073,1.14154,{"v":27,"d":"27.00"},1.03062,1.073,1.14154,{"v":30.340000000000003,"d":"30.34"},1.0127469901095905,1.4118789851268314,1.1240022585776352,{"v":75.2,"d":"75.20"},{"$nulls":3},1000,{"$nulls":3},1000,{"$nulls":3},1000,{"$nulls":3},1000,null,null,{"v":0,"d":"0.00E+00"},{"v":0,"d":"0.00E+00"},{"v":1.8304780500024638,"d":"1.83E+00"},null,null,{"$f":"BP38","v":{"v":1.8304780500024638,"d":"1.83E+00"}},{"v":8.31042405e-07,"d":"8.31E-07"},{"$f":"BO33","v":0},{"v":1.8377764077732492,"d":"1.84E+00"},0,0,0,0,0,0,{"v":0,"d":"0.00E+00"},{"v":3.36300981e-05,"d":"3.36E-05"},{"$f":"IF($BK$17=\"11\",CP33,IF($BK$17=\"21\",CP33,IF($BK$17=\"12\",DR33,IF($BK$17=\"22\",DR33,IF($BK$17=\"13\",EF33,IF($BK$17=\"23\",EF33,IF($BK$17=\"14\",DD33,IF($BK$17=\"24\",DD33,IF($BK$17=\"31\",0,IF($BK$17=\"41\",0,IF($BK$17=\"32\",0,IF($BK$17=\"42\",0,IF($BK$17=\"33\",0,IF($BK$17=\"43\",0,IF($BK$17=\"34\",DD33,IF($BK$17=\"44\",DD33,))))))))))))))))","v":{"v":-1.53481698E-3,"d":"-1.53E-03"}},{"v":-0.0638467441,"d":"-6.38E-02"},{"v":-9.86541862,"d":"-9.87E+00"},{"v":412.802491,"d":"4.13E+02"},{"v":0,"d":"0.00E+00"},{"v":-4.74535049e-08,"d":"-4.75E-08"},{"v":3.79131586e-05,"d":"3.79E-05"},{"v":0.00313097923,"d":"3.13E-03"},{"v":5.44306356,"d":"5.44E+00"},{"v":-0.000134794778,"d":"-1.35E-04"},{"v":-0.319275365,"d":"-3.19E-01"},{"v":778.933333,"d":"7.79E+02"},null,{"v":0.000665553503,"d":"6.66E-04"},{"v":-0.0169763839,"d":"-1.70E-02"},{"v":0.0173890952,"d":"1.74E-02"},{"v":-12.5638768,"d":"-1.26E+01"},{"v":255.931928,"d":"2.56E+02"},null,{"v":-1.17896244E-7,"d":"-1.18E-07"},{"v":5.97305379e-05,"d":"5.97E-05"},{"v":-3.93616003E-4,"d":"-3.94E-04"},{"v":3.90377604,"d":"3.90E+00"},{"v":-0.000207630898,"d":"-2.08E-04"},{"v":-0.115442935,"d":"-1.15E-01"},{"v":590.016992,"d":"5.90E+02"},null,{"v":0.000589966543,"d":"5.90E-04"},{"v":-0.0348044662,"d":"-3.48E-02"},{"v":0.523368629,"d":"5.23E-01"},{"v":-16.7479116,"d":"-1.67E+01"},{"v":458.028999,"d":"4.58E+02"},null,{"v":-3.20036938e-08,"d":"-3.20E-08"},{"v":2.94380399E-5,"d":"2.94E-05"},{"v":0.00522288396,"d":"5.22E-03"},{"v":5.49674381,"d":"5.50E+00"},{"v":-1.02694916e-05,"d":"-1.03E-05"},{"v":-0.184056275,"d":"-1.84E-01"},{"v":726.648389,"d":"7.27E+02"},null,{"v":3.36300981e-05,"d":"3.36E-05"},{"v":-1.53481698E-3,"d":"-1.53E-03"},{"v":-0.0638467441,"d":"-6.38E-02"},{"v":-9.86541862,"d":"-9.87E+00"},{"v":412.802491,"d":"4.13E+02"},null,{"v":-4.74535049e-08,"d":"-4.75E-08"},{"v":3.79131586e-05,"d":"3.79E-05"},{"v":0.00313097923,"d":"3.13E-03"},{"v":5.44306356,"d":"5.44E+00"},{"$f":" -0.000134794778","v":{"v":-0.000134794778,"d":"-1.35E-04"}},{"v":-0.319275365,"d":"-3.19E-01"},{"v":778.933333,"d":"7.79E+02"},null,{"v":3.39603828e-05,"d":"3.40E-05"},{"v":-0.00491389308,"d":"-4.91E-03"},{"v":0.157942614,"d":"1.58E-01"},{"v":-9.75914842,"d":"-9.76E+00"},{"v":873.762787,"d":"8.74E+02"},null,{"v":-3.35719066e-08,"d":"-3.36E-08"},{"v":5.47551463e-05,"d":"5.48E-05"},{"v":0.00911405005,"d":"9.11E-03"},{"v":19.1305756,"d":"1.91E+01"},{"v":-4.19516397e-05,"d":"-4E-05"},{"v":-0.0832370776,"d":"-8E-02"},{"v":1170.31588,"d":"1E+03"},37.5,null,37.5,null,{"$f":"ER33-5","v":32.5},{"$nulls":3},17.5,{"$f":"Tavg_cold","v":17},17.5,17.5,{"$f":"IF($GC33<=$FC33,$FC33,IF($FM33<=$FP33,$FC33,$FZ33))","v":17.5},{"$nulls":5},0.5,{"v":1.175,"d":"1.18"},null,{"$f":"FQ33/FO33","v":{"v":0.47244228884744205,"d":"47.24%"}},{"$f":"DU33","v":{"v":412.802491,"d":"412.8"}},{"$f":"EI33","v":{"v":873.762787,"d":"873.8"}},{"$f":"FN33/FO33","v":{"v":0.47244228884744205,"d":"47.24%"}},{"v":412.802491,"d":"412.80"},{"v":0,"d":"0.00"},{"$f":"FO33*(1-FP33)","v":{"v":460.9602960000001,"d":"460.96"}},{"$f":"IF((FR33/FS33)>1,1,FR33/FS33)","v":{"v":0,"d":"0.00%"}},{"v":17.5,"d":"17.50"},21.150000000000002,{"v":3.650000000000002,"d":"3.65"},null,null,{"v":17.5,"d":"17.50"},null,null,15.69066559142683,null,{"v":0,"d":"0.0%"},null,{"v":2334.1781978570243,"d":"2334.18"},{"v":19165.527300437345,"d":"19165.53"},{"v":1167.0890989285122,"d":"1167.09"},{"v":1167.089098928512,"d":"1167.09"},{"v":7.2478490515896785E-3,"d":"0.01"},{"v":7.2478490515896785E-3,"d":"0.01"},{"v":38.49069218350365,"d":"38.49"},{"v":78.46702679457164,"d":"78.47"},{"v":0.060895225089991636,"d":"6%"},null,{"v":3557.0118570174286,"d":"3557.01"},{"v":2046.2626815249048,"d":"2046.26"},{"v":1778.5059285087143,"d":"1778.51"},{"v":1778.5059285087143,"d":"1778.51"},{"v":1778.5059285087143,"d":"1778.51"},{"v":0.011112703645172665,"d":"0.0111"},{"v":0.011112703645172665,"d":"0.0111"},{"v":0.011112703645172665,"d":"0.01"},{"v":55.47783951997643,"d":"55.48"},{"v":55.47783951997643,"d":"55.48"},{"v":46.130711225015276,"d":"46.13"},{"v":19.415087041495514,"d":"19.42"},{"v":19.415087041495514,"d":"19.42"},{"v":1265.5751323529887,"d":"1266"},412.802491,1265.5751323529887,17.5,17.5,{"v":1265.5751323529887,"d":"1266"},1,{"v":1265.5751323529887,"d":"1266"},0.5,{"v":1.175,"d":"1.18"},null,{"$f":"HS33/HQ33","v":{"v":0.47244228884744205,"d":"47.24%"}},{"v":412.802491,"d":"412.8"},{"v":873.762787,"d":"873.8"},{"$f":"HP33/HQ33","v":{"v":0.47244228884744205,"d":"47.24%"}},{"v":412.802491,"d":"412.80"},{"v":0,"d":"0.00"},{"$f":"HQ33*(1-HR33)","v":{"v":460.9602960000001,"d":"460.96"}},{"$f":"IF((HT33/HU33)>1,1,HT33/HU33)","v":{"v":0,"d":"0.00%"}},{"v":17.5,"d":"17.50"},21.150000000000002,{"v":3.650000000000002,"d":"3.65"},null,null,{"v":17.5,"d":"17.50"},null,null,15.69066559142683,null,{"$error":"#DIV/0!"},null,{"v":2334.1781978570243,"d":"2334.18"},{"v":19165.527300437345,"d":"19165.53"}]
[null,{"$f":"IF($AL$5=1,$C34/10,IF($AL$5=2,$C34/10,IF($AL$5=3,0.25,IF($AL$5=4,$C34/10,))))","v":{"v":0.5,"d":"50%"}},5,{"v":-828.8478907144921,"d":"-829"},-71,{"$error":"#NUM!"},{"v":-168.87699058900006,"d":"-169"},{"v":-168.87699058900006,"d":"-169"},{"$f":"IF(Geg_dP<AB34,ROUND(((IF('Briza 22 & 26'!$M$4=\"High Perform. 208/230V (US/EU)\",cal!HK34,H34)/Watts)/((Tr_cool-Tv_cool)*1.163))*FlowH2O,IF(UnitsNo=1,0,IF(UnitsNo=2,2))),\"\")","v":-73},{"$error":"#NUM!"},{"v":0,"d":"0.0"},{"$f":"IF(Geg_dP<$AB34,0,\"\")","v":{"v":0,"d":"0.0"}},{"v":0,"d":"0.0"},0,{"v":0,"d":"0.00"},{"$error":"#DIV/0!"},{"$error":"#DIV/0!"},{"$error":"#DIV/0!"},{"$error":"#DIV/0!"},{"$error":"#DIV/0!"},0,{"$error":"#DIV/0!"},{"$error":"#DIV/0!"},1.03062,1.073,1.14154,1.03062,43.94,1.03062,1.073,1.14154,{"$f":"AF33+((AF35-AF33)/2)","v":{"v":28,"d":"28.00"}},1.03062,1.073,1.14154,{"$f":"AJ33+((AJ35-AJ33)/2)","v":{"v":43.5,"d":"43.50"}},1.03062,1.073,1.14154,{"$f":"AN33+((AN35-AN33)/2)","v":43.94},1.0127469901095905,1.4118789851268314,1.1240022585776352,{"v":106,"d":"106.00"},{"$nulls":3},1000,{"$nulls":3},1000,{"$nulls":3},1000,{"$nulls":3},1000,{"$nulls":17},{"v":0,"d":"0.00E+00"},{"v":0,"d":"0.00E+00"},{"v":0,"d":"0.00E+00"},{"v":0,"d":"0.00E+00"},{"v":0,"d":"0.00E+00"},{"v":0,"d":"0.00E+00"},{"v":0,"d":"0.00E+00"},{"v":0,"d":"0.00E+00"},{"v":0,"d":"0.00E+00"},{"v":0,"d":"0.00E+00"},{"v":0,"d":"0.00E+00"},{"v":0,"d":"0.00E+00"},{"v":0,"d":"0.00E+00"},{"v":0,"d":"0.00E+00"},{"$nulls":44},{"v":6.5021735e-06,"d":"6.50E-06"},{"v":-0.0409782976,"d":"-4.10E-02"},{"v":-5.69288771,"d":"-5.69E+00"},{"v":1063.4372,"d":"1.06E+03"},null,{"v":-2.80066889e-08,"d":"-2.80E-08"},{"v":5.4201534e-05,"d":"5.42E-05"},{"v":0.0182474673,"d":"1.82E-02"},{"v":29.0692292,"d":"2.91E+01"},{"v":-2.51956024e-05,"d":"-3E-05"},{"v":-0.125146079,"d":"-1E-01"},{"v":1424.83611,"d":"1E+03"},{"$nulls":8},{"v":17,"d":"17.0"},{"$f":"((FA35-FA33)/2)+FA33","v":17},17,17,17,{"$nulls":5},{"v":0,"d":"0.0"},{"v":1.175,"d":"1.18"},null,{"v":0,"d":"0.00%"},{"$f":"((FN35-FN33)/2)+FN33","v":{"v":488.82188499999995,"d":"488.8"}},{"$f":"((FO35-FO33)/2)+FO33","v":{"v":1068.5978635,"d":"1068.6"}},{"$f":"FN34/FO34","v":{"v":0.4574423192265722,"d":"45.74%"}},{"v":0,"d":"0.00"},{"v":0,"d":"0.00"},{"v":579.7759785,"d":"579.78"},{"v":0,"d":"0.00%"},{"v":17,"d":"17.00"},21.150000000000002,{"v":4.150000000000002,"d":"4.15"},null,null,{"v":17,"d":"17.00"},null,null,15.69066559142683,null,{"v":0,"d":"0.0%"},null,{"v":2334.1781978570243,"d":"2334.18"},{"$error":"#DIV/0!"},{"v":1167.0890989285122,"d":"1167.09"},{"v":1167.089098928512,"d":"1167.09"},{"v":7.2478490515896785E-3,"d":"0.01"},{"v":7.2478490515896785E-3,"d":"0.01"},{"v":38.49069218350365,"d":"38.49"},{"$error":"#DIV/0!"},{"$error":"#DIV/0!"},null,{"v":3557.0118570174286,"d":"3557.01"},{"$error":"#DIV/0!"},{"v":1778.5059285087143,"d":"1778.51"},{"v":1778.5059285087143,"d":"1778.51"},{"$error":"#DIV/0!"},{"v":0.011112703645172665,"d":"0.0111"},{"v":0.011112703645172665,"d":"0.0111"},{"$error":"#DIV/0!"},{"v":55.47783951997643,"d":"55.48"},{"$error":"#DIV/0!"},{"$error":"#DIV/0!"},{"v":19.415087041495514,"d":"19.42"},{"$error":"#DIV/0!"},{"v":-168.87699058900006,"d":"-169"},0,-168.87699058900006,{"v":17,"d":"17.0"},17,{"v":-168.87699058900006,"d":"-169"},1,{"v":-168.87699058900006,"d":"-169"},{"v":0,"d":"0.0"},{"v":1.175,"d":"1.18"},null,{"v":0,"d":"0.00%"},{"$f":"((HP35-HP33)/2)+HP33","v":{"v":488.82188499999995,"d":"488.8"}},{"$f":"((HQ35-HQ33)/2)+HQ33","v":{"v":1068.5978635,"d":"1068.6"}},{"$f":"HP34/HQ34","v":{"v":0.4574423192265722,"d":"45.74%"}},{"v":0,"d":"0.00"},{"v":0,"d":"0.00"},{"v":579.7759785,"d":"579.78"},{"v":0,"d":"0.00%"},{"v":17,"d":"17.00"},21.150000000000002,{"v":4.150000000000002,"d":"4.15"},null,null,{"v":17,"d":"17.00"},null,null,15.69066559142683,null,{"$error":"#DIV/0!"},null,{"v":2334.1781978570243,"d":"2334.18"},{"$error":"#DIV/0!"}]
[null,{"$f":"IF($AL$5=1,$C35/10,IF($AL$5=2,$C35/10,IF($AL$5=3,0.5,IF($AL$5=4,$C35/10,))))","v":{"v":0.6,"d":"60%"}},6,{"v":7359.702109205712,"d":"7360"},633,{"v":11.691966501114814,"d":"11.7"},{"v":1675.0755144910545,"d":"1675"},{"v":1675.0755144910545,"d":"1675"},{"$f":"IF(Geg_dP<AB35,ROUND(((IF('Briza 22 & 26'!$M$4=\"High Perform. 208/230V (US/EU)\",cal!HK35,H35)/Watts)/((Tr_cool-Tv_cool)*1.163))*FlowH2O,IF(UnitsNo=1,0,IF(UnitsNo=2,2))),\"\")","v":720},{"v":14.800077115227213,"d":"14.8"},{"v":37,"d":"37.0"},{"$f":"IF(Geg_dP<$AB35,IF(CalcNo=\"12\",$ET35,IF(CalcNo=\"22\",$ET35,IF(CalcNo=\"13\",$EU35,IF(CalcNo=\"23\",$EU35,IF(CalcNo=\"11\",$ER35,IF(CalcNo=\"21\",$ER35,IF(CalcNo=\"14\",$ES35,IF(CalcNo=\"24\",$ES35,IF(CalcNo=\"32\",$EX35,IF(CalcNo=\"42\",$EX35,IF(CalcNo=\"33\",$EY35,IF(CalcNo=\"43\",$EY35,IF(CalcNo=\"31\",$EV35,IF(CalcNo=\"41\",$EV35,IF(CalcNo=\"34\",$EW35,IF(CalcNo=\"44\",$EW35,)))))))))))))))),\"\")","v":{"v":45,"d":"45.0"}},{"v":20.589359735431245,"d":"20.6"},{"v":564.841279,"d":"565"},{"v":0.7507194032429558,"d":"0.75"},{"v":58.24631491319571,"d":"58.2"},{"v":25.398635921991204,"d":"25.4"},{"v":18.185737185141427,"d":"18.2"},{"v":16.5219295645473,"d":"16.5"},{"v":0.8530452035008976,"d":"85%"},{"v":797.6976805119784,"d":"798"},{"v":0.13122570499588518,"d":"0.13"},{"v":2.9655685176845132,"d":"2.966"},1.03062,1.073,1.14154,1.03062,57.54,1.03062,1.073,1.14154,{"v":38,"d":"38.00"},1.03062,1.073,1.14154,{"v":60,"d":"60.00"},1.03062,1.073,1.14154,57.54,1.0127469901095905,1.4118789851268314,1.1240022585776352,159.32,{"$nulls":3},1000,{"$nulls":3},1000,{"$nulls":3},1000,{"$nulls":3},1000,null,null,{"$f":"IF($BK$17=\"11\",BN35,IF($BK$17=\"21\",BQ35,IF($BK$17=\"12\",BN35,IF($BK$17=\"22\",BQ35,IF($BK$17=\"13\",BN35,IF($BK$17=\"23\",BQ35,IF($BK$17=\"14\",BN35,IF($BK$17=\"24\",BQ35,IF($BK$17=\"31\",BT35,IF($BK$17=\"41\",BW35,IF($BK$17=\"32\",BT35,IF($BK$17=\"42\",BW35,IF($BK$17=\"33\",BT35,IF($BK$17=\"43\",BW35,IF($BK$17=\"34\",BT35,IF($BK$17=\"44\",BW35,))))))))))))))))","v":{"v":-3.20893891E-3,"d":"-3.21E-03"}},{"$f":"IF($BK$17=\"11\",BO35,IF($BK$17=\"21\",BR35,IF($BK$17=\"12\",BO35,IF($BK$17=\"22\",BR35,IF($BK$17=\"13\",BO35,IF($BK$17=\"23\",BR35,IF($BK$17=\"14\",BO35,IF($BK$17=\"24\",BR35,IF($BK$17=\"31\",BU35,IF($BK$17=\"41\",BX35,IF($BK$17=\"32\",BU35,IF($BK$17=\"42\",BX35,IF($BK$17=\"33\",BU35,IF($BK$17=\"43\",BX35,IF($BK$17=\"34\",BU35,IF($BK$17=\"44\",BX35,))))))))))))))))","v":{"v":-0.00251277543,"d":"-2.51E-03"}},null,{"v":-3.20893891E-3,"d":"-3.21E-03"},{"v":-0.00251277543,"d":"-2.51E-03"},null,{"v":-0.00317531975,"d":"-3.18E-03"},{"$f":"BO35","v":{"v":-0.00251277543,"d":"-2.51E-03"}},null,0,0,0,0,0,0,{"v":0,"d":"0.00E+00"},{"v":-1.58276965e-05,"d":"-1.58E-05"},{"v":0.00208824298,"d":"2.09E-03"},{"v":-0.119400932,"d":"-1.19E-01"},{"v":-6.29979825,"d":"-6.30E+00"},{"v":564.841279,"d":"5.65E+02"},{"v":0,"d":"0.00E+00"},{"v":-4.18844797e-08,"d":"-4.19E-08"},{"v":4.57838604e-05,"d":"4.58E-05"},{"v":0.00664588683,"d":"6.65E-03"},{"v":9.77635506,"d":"9.78E+00"},{"v":-0.00014390134,"d":"-1.44E-04"},{"v":-0.362875692,"d":"-3.63E-01"},{"v":1048.57595,"d":"1.05E+03"},null,{"v":3.15848949e-05,"d":"3.16E-05"},{"v":-1.41584787E-3,"d":"-1.42E-03"},{"v":-0.0351363621,"d":"-3.51E-02"},{"v":-9.52628442,"d":"-9.53E+00"},{"v":426.93058,"d":"4.27E+02"},null,{"v":-7.81925468e-08,"d":"-7.82E-08"},{"v":6.3819384e-05,"d":"6.38E-05"},{"v":1.66224254E-3,"d":"1.66E-03"},{"v":6.99530289,"d":"7.00E+00"},{"v":-0.000118504745,"d":"-1.19E-04"},{"v":-0.154918149,"d":"-1.55E-01"},{"v":839.416736,"d":"8.39E+02"},null,{"v":-6.80107186E-6,"d":"-6.80E-06"},{"v":0.00100293605,"d":"1.00E-03"},{"v":-0.0935343721,"d":"-9.35E-02"},{"v":-7.7682051,"d":"-7.77E+00"},{"v":691.930554,"d":"6.92E+02"},null,{"v":-4.25310676e-08,"d":"-4.25E-08"},{"v":4.89292719e-05,"d":"4.89E-05"},{"v":0.00960089866,"d":"9.60E-03"},{"v":11.1444686,"d":"1.11E+01"},{"v":-8.54202875e-06,"d":"-8.54E-06"},{"v":-0.2492499,"d":"-2.49E-01"},{"v":1064.31433,"d":"1.06E+03"},null,{"v":-1.58276965e-05,"d":"-1.58E-05"},{"v":0.00208824298,"d":"2.09E-03"},{"v":-0.119400932,"d":"-1.19E-01"},{"v":-6.29979825,"d":"-6.30E+00"},{"v":564.841279,"d":"5.65E+02"},null,{"v":-4.18844797e-08,"d":"-4.19E-08"},{"v":4.57838604e-05,"d":"4.58E-05"},{"v":0.00664588683,"d":"6.65E-03"},{"v":9.77635506,"d":"9.78E+00"},{"v":-0.00014390134,"d":"-1.44E-04"},{"v":-0.362875692,"d":"-3.63E-01"},{"v":1048.57595,"d":"1.05E+03"},null,{"v":1.32620264e-06,"d":"1.33E-06"},{"v":-0.000366090389,"d":"-3.66E-04"},{"v":0.0102574768,"d":"1.03E-02"},{"v":-5.50185023,"d":"-5.50E+00"},{"v":1263.43294,"d":"1.26E+03"},null,{"v":-2.24414711e-08,"d":"-2.24E-08"},{"v":5.36479218e-05,"d":"5.36E-05"},{"v":0.0273808845,"d":"2.74E-02"},{"v":39.0078828,"d":"3.90E+01"},{"v":-8.43956508e-06,"d":"-8E-06"},{"v":-0.167055081,"d":"-2E-01"},{"v":1679.35635,"d":"2E+03"},45,null,45,null,{"$f":"ER35-5","v":40},{"$nulls":3},17.5,{"$f":"Tavg_cold","v":17},17.5,17.5,17.5,{"$nulls":5},0.5,{"v":1.175,"d":"1.18"},null,{"v":0.4470686659475572,"d":"44.71%"},{"$f":"DU35","v":{"v":564.841279,"d":"564.8"}},{"$f":"EI35","v":{"v":1263.43294,"d":"1263.4"}},{"$f":"FN35/FO35","v":{"v":0.4470686659475572,"d":"44.71%"}},{"v":564.841279,"d":"564.84"},{"v":0,"d":"0.00"},{"v":698.5916609999999,"d":"698.59"},{"v":0,"d":"0.00%"},{"v":17.5,"d":"17.50"},21.150000000000002,{"v":3.650000000000002,"d":"3.65"},null,null,{"v":17.5,"d":"17.50"},null,null,15.69066559142683,null,{"v":0,"d":"0.0%"},null,{"v":2334.1781978570243,"d":"2334.18"},{"v":18289.292464739126,"d":"18289.29"},{"v":1167.0890989285122,"d":"1167.09"},{"v":1167.089098928512,"d":"1167.09"},{"v":7.2478490515896785E-3,"d":"0.01"},{"v":7.2478490515896785E-3,"d":"0.01"},{"v":38.49069218350365,"d":"38.49"},{"v":77.44660924856099,"d":"77.45"},{"v":0.06381269812260935,"d":"6%"},null,{"v":3557.0118570174286,"d":"3557.01"},{"v":2084.8906027602357,"d":"2084.89"},{"v":1778.5059285087143,"d":"1778.51"},{"v":1778.5059285087143,"d":"1778.51"},{"v":1778.5059285087143,"d":"1778.51"},{"v":0.011112703645172665,"d":"0.0111"},{"v":0.011112703645172665,"d":"0.0111"},{"v":0.011112703645172665,"d":"0.01"},{"v":55.47783951997643,"d":"55.48"},{"v":55.47783951997643,"d":"55.48"},{"v":46.43633834778577,"d":"46.44"},{"v":19.415087041495514,"d":"19.42"},{"v":19.415087041495514,"d":"19.42"},{"v":1675.0755144910545,"d":"1675"},564.841279,1675.0755144910545,17.5,17.5,{"v":1675.0755144910545,"d":"1675"},1,{"v":1675.0755144910545,"d":"1675"},0.5,{"v":1.175,"d":"1.18"},null,{"v":0.4470686659475572,"d":"44.71%"},{"v":564.841279,"d":"564.8"},{"v":1263.43294,"d":"1263.4"},{"$f":"HP35/HQ35","v":{"v":0.4470686659475572,"d":"44.71%"}},{"v":564.841279,"d":"564.84"},{"v":0,"d":"0.00"},{"v":698.5916609999999,"d":"698.59"},{"v":0,"d":"0.00%"},{"v":17.5,"d":"17.50"},21.150000000000002,{"v":3.650000000000002,"d":"3.65"},null,null,{"v":17.5,"d":"17.50"},null,null,15.69066559142683,null,{"$error":"#DIV/0!"},null,{"v":2334.1781978570243,"d":"2334.18"},{"v":18289.292464739126,"d":"18289.29"}]
[null,{"$f":"IF($AL$5=1,$C36/10,IF($AL$5=2,$C36/10,IF($AL$5=3,0.75,IF($AL$5=4,$C36/10,))))","v":{"v":0.7,"d":"70%"}},7,{"v":-828.8478907144921,"d":"-829"},-71,{"$error":"#NUM!"},{"v":-168.87699058900006,"d":"-169"},{"v":-168.87699058900006,"d":"-169"},{"$f":"IF(Geg_dP<AB36,ROUND(((IF('Briza 22 & 26'!$M$4=\"High Perform. 208/230V (US/EU)\",cal!HK36,H36)/Watts)/((Tr_cool-Tv_cool)*1.163))*FlowH2O,IF(UnitsNo=1,0,IF(UnitsNo=2,2))),\"\")","v":-73},{"$error":"#NUM!"},{"v":0,"d":"0.0"},{"$f":"IF(Geg_dP<$AB36,0,\"\")","v":{"v":0,"d":"0.0"}},{"v":0,"d":"0.0"},0,{"v":0,"d":"0.00"},{"$error":"#DIV/0!"},{"$error":"#DIV/0!"},{"$error":"#DIV/0!"},{"$error":"#DIV/0!"},{"$error":"#DIV/0!"},0,{"$error":"#DIV/0!"},{"$error":"#DIV/0!"},1.03062,1.073,1.14154,1.03062,74.17,1.03062,1.073,1.14154,{"$f":"AF35+((AF37-AF35)/2)","v":{"v":51.5,"d":"51.50"}},1.03062,1.073,1.14154,{"$f":"AJ35+((AJ37-AJ35)/2)","v":{"v":81,"d":"81.00"}},1.03062,1.073,1.14154,{"$f":"AN35+((AN37-AN35)/2)","v":74.17},1.0127469901095905,1.4118789851268314,1.1240022585776352,{"v":184,"d":"184.00"},{"$nulls":3},1000,{"$nulls":3},1000,{"$nulls":3},1000,{"$nulls":3},1000,{"$nulls":17},{"v":0,"d":"0.00E+00"},{"v":0,"d":"0.00E+00"},{"v":0,"d":"0.00E+00"},{"v":0,"d":"0.00E+00"},{"v":0,"d":"0.00E+00"},{"v":0,"d":"0.00E+00"},{"v":0,"d":"0.00E+00"},{"v":0,"d":"0.00E+00"},{"v":0,"d":"0.00E+00"},{"v":0,"d":"0.00E+00"},{"v":0,"d":"0.00E+00"},{"v":0,"d":"0.00E+00"},{"v":0,"d":"0.00E+00"},{"v":0,"d":"0.00E+00"},{"$nulls":43},{"v":-1.4101435e-07,"d":"-1.41E-07"},{"v":-6.2077974e-05,"d":"-6.21E-05"},{"v":-0.0011131432,"d":"-1.11E-03"},{"v":-4.26174345,"d":"-4.26E+00"},{"v":1372.2292,"d":"1.37E+03"},null,{"v":-6.29085385e-08,"d":"-6.29E-08"},{"v":0.000133083693,"d":"1.33E-04"},{"v":0.008211067,"d":"8.21E-03"},{"v":47.8599882,"d":"4.79E+01"},{"v":-1.3224432E-4,"d":"-1E-04"},{"v":0.041160283,"d":"4E-02"},{"v":1783.04781,"d":"2E+03"},{"$nulls":8},17,{"$f":"((FA37-FA35)/2)+FA35","v":17},17,17,17,{"$nulls":5},{"v":0,"d":"0.0"},{"v":1.175,"d":"1.18"},null,{"v":0,"d":"0.00%"},{"$f":"((FN37-FN35)/2)+FN35","v":{"v":635.8646145,"d":"635.9"}},{"$f":"((FO37-FO35)/2)+FO35","v":{"v":1368.0337949999998,"d":"1368.0"}},{"$f":"FN36/FO36","v":{"v":0.46480183225298183,"d":"46.48%"}},{"v":0,"d":"0.00"},{"v":0,"d":"0.00"},{"v":732.1691804999997,"d":"732.17"},{"v":0,"d":"0.00%"},{"v":17,"d":"17.00"},21.150000000000002,{"v":4.150000000000002,"d":"4.15"},null,null,{"v":17,"d":"17.00"},null,null,15.69066559142683,null,{"v":0,"d":"0.0%"},null,{"v":2334.1781978570243,"d":"2334.18"},{"$error":"#DIV/0!"},{"v":1167.0890989285122,"d":"1167.09"},{"v":1167.089098928512,"d":"1167.09"},{"v":7.2478490515896785E-3,"d":"0.01"},{"v":7.2478490515896785E-3,"d":"0.01"},{"v":38.49069218350365,"d":"38.49"},{"$error":"#DIV/0!"},{"$error":"#DIV/0!"},null,{"v":3557.0118570174286,"d":"3557.01"},{"$error":"#DIV/0!"},{"v":1778.5059285087143,"d":"1778.51"},{"v":1778.5059285087143,"d":"1778.51"},{"$error":"#DIV/0!"},{"v":0.011112703645172665,"d":"0.0111"},{"v":0.011112703645172665,"d":"0.0111"},{"$error":"#DIV/0!"},{"v":55.47783951997643,"d":"55.48"},{"$error":"#DIV/0!"},{"$error":"#DIV/0!"},{"v":19.415087041495514,"d":"19.42"},{"$error":"#DIV/0!"},{"v":-168.87699058900006,"d":"-169"},0,-168.87699058900006,{"v":17,"d":"17.0"},17,{"v":-168.87699058900006,"d":"-169"},1,{"v":-168.87699058900006,"d":"-169"},{"v":0,"d":"0.0"},{"v":1.175,"d":"1.18"},null,{"v":0,"d":"0.00%"},{"$f":"((FN37-FN35)/2)+HP35","v":{"v":635.8646145,"d":"635.9"}},{"v":1372.2292,"d":"1372.2"},{"$f":"HP36/HQ36","v":{"v":0.4633807635779795,"d":"46.34%"}},{"v":0,"d":"0.00"},{"v":0,"d":"0.00"},{"v":736.3645855,"d":"736.36"},{"v":0,"d":"0.00%"},{"v":17,"d":"17.00"},21.150000000000002,{"v":4.150000000000002,"d":"4.15"},null,null,{"v":17,"d":"17.00"},null,null,15.69066559142683,null,{"$error":"#DIV/0!"},null,{"v":2334.1781978570243,"d":"2334.18"},{"$error":"#DIV/0!"}]
[null,{"$f":"IF($AL$5=1,$C37/10,IF($AL$5=2,$C37/10,IF($AL$5=3,1,IF($AL$5=4,$C37/10,))))","v":{"v":0.8,"d":"80%"}},8,{"v":8836.624378289422,"d":"8837"},760,{"v":16.339757574578403,"d":"16.3"},{"v":1999.864655238314,"d":"2000"},{"v":1999.864655238314,"d":"2000"},{"$f":"IF(Geg_dP<AB37,ROUND(((IF('Briza 22 & 26'!$M$4=\"High Perform. 208/230V (US/EU)\",cal!HK37,H37)/Watts)/((Tr_cool-Tv_cool)*1.163))*FlowH2O,IF(UnitsNo=1,0,IF(UnitsNo=2,2))),\"\")","v":860},{"v":20.48870760994988,"d":"20.5"},42.5,{"$f":"IF(Geg_dP<$AB37,IF(CalcNo=\"12\",$ET37,IF(CalcNo=\"22\",$ET37,IF(CalcNo=\"13\",$EU37,IF(CalcNo=\"23\",$EU37,IF(CalcNo=\"11\",$ER37,IF(CalcNo=\"21\",$ER37,IF(CalcNo=\"14\",$ES37,IF(CalcNo=\"24\",$ES37,IF(CalcNo=\"32\",$EX37,IF(CalcNo=\"42\",$EX37,IF(CalcNo=\"33\",$EY37,IF(CalcNo=\"43\",$EY37,IF(CalcNo=\"31\",$EV37,IF(CalcNo=\"41\",$EV37,IF(CalcNo=\"34\",$EW37,IF(CalcNo=\"44\",$EW37,)))))))))))))))),\"\")","v":50.5},{"v":35.896108086935484,"d":"35.9"},{"v":706.88795,"d":"707"},{"v":0.9395108320042531,"d":"0.94"},{"v":56.69370831153303,"d":"56.7"},{"v":25.008385627279914,"d":"25.0"},{"v":18.591315464905676,"d":"18.6"},{"v":16.661875971188984,"d":"16.7"},{"v":0.8316612910307803,"d":"83%"},{"v":947.4805482130106,"d":"947"},{"v":0.18280972127614814,"d":"0.18"},{"v":2.8291112548152983,"d":"2.829"},1.03062,1.073,1.14154,1.03062,90.8,1.03062,1.073,1.14154,{"v":65,"d":"65.00"},1.03062,1.073,1.14154,{"v":102,"d":"102.00"},1.03062,1.073,1.14154,{"v":90.8,"d":"90.80"},1.0127469901095905,1.4118789851268314,1.1240022585776352,{"v":213.4,"d":"213.40"},{"$nulls":3},1000,{"$nulls":3},1000,{"$nulls":3},1000,{"$nulls":3},1000,null,null,{"$f":"IF($BK$17=\"11\",BN37,IF($BK$17=\"21\",BQ37,IF($BK$17=\"12\",BN37,IF($BK$17=\"22\",BQ37,IF($BK$17=\"13\",BN37,IF($BK$17=\"23\",BQ37,IF($BK$17=\"14\",BN37,IF($BK$17=\"24\",BQ37,IF($BK$17=\"31\",BT37,IF($BK$17=\"41\",BW37,IF($BK$17=\"32\",BT37,IF($BK$17=\"42\",BW37,IF($BK$17=\"33\",BT37,IF($BK$17=\"43\",BW37,IF($BK$17=\"34\",BT37,IF($BK$17=\"44\",BW37,))))))))))))))))","v":{"v":9.83388495,"d":"9.83E+00"}},{"v":7.34809176,"d":"7.35E+00"},{"v":8.7092260316846474E-5,"d":"8.71E-05"},{"v":9.83388495,"d":"9.83E+00"},{"v":7.34809176,"d":"7.35E+00"},{"v":8.7092260316846474E-5,"d":"8.71E-05"},{"v":4.40919038,"d":"4.41E+00"},{"$f":"BO37","v":{"v":7.34809176,"d":"7.35E+00"}},{"$f":"+BP37","v":{"v":8.7092260316846474E-5,"d":"8.71E-05"}},0,0,0,0,0,0,{"v":0,"d":"0.00E+00"},{"v":-6.8508316E-6,"d":"-6.85E-06"},{"v":0.00134885717,"d":"1.35E-03"},{"v":-0.0982181286,"d":"-9.82E-02"},{"v":-4.58595439,"d":"-4.59E+00"},{"v":706.88795,"d":"7.07E+02"},{"v":0,"d":"0.00E+00"},{"v":-4.49073504e-08,"d":"-4.49E-08"},{"v":5.6690645e-05,"d":"5.67E-05"},{"v":0.00927573899,"d":"9.28E-03"},{"v":16.8738289,"d":"1.69E+01"},{"v":-9.80174159e-05,"d":"-9.80E-05"},{"v":-0.434880115,"d":"-4.35E-01"},{"v":1303.87044,"d":"1.30E+03"},null,{"v":1.79784276e-06,"d":"1.80E-06"},{"v":-9.07916296e-05,"d":"-9.08E-05"},{"v":-0.0257030455,"d":"-2.57E-02"},{"v":-7.54374666,"d":"-7.54E+00"},{"v":590.36035,"d":"5.90E+02"},null,{"v":-6.74342574e-08,"d":"-6.74E-08"},{"v":7.52092382e-05,"d":"7.52E-05"},{"v":0.00250923249,"d":"2.51E-03"},{"v":12.028917,"d":"1.20E+01"},{"v":-1.09199772E-4,"d":"-1.09E-04"},{"v":-0.185729009,"d":"-1.86E-01"},{"v":1085.68188,"d":"1.09E+03"},null,{"v":-2.63676133E-6,"d":"-2.64E-06"},{"v":0.000700394591,"d":"7.00E-04"},{"v":-0.0813428132,"d":"-8.13E-02"},{"v":-4.79072109,"d":"-4.79E+00"},{"v":886.036637,"d":"8.86E+02"},null,{"v":-3.73588594e-08,"d":"-3.74E-08"},{"v":5.40959731e-05,"d":"5.41E-05"},{"v":0.0170417803,"d":"1.70E-02"},{"v":20.0392132,"d":"2.00E+01"},{"v":-1.13402026E-5,"d":"-1.13E-05"},{"v":-0.296920475,"d":"-2.97E-01"},{"v":1367.93126,"d":"1.37E+03"},null,{"v":-6.8508316E-6,"d":"-6.85E-06"},{"v":0.00134885717,"d":"1.35E-03"},{"v":-0.0982181286,"d":"-9.82E-02"},{"v":-4.58595439,"d":"-4.59E+00"},{"v":706.88795,"d":"7.07E+02"},null,{"v":-4.49073504e-08,"d":"-4.49E-08"},{"v":5.6690645e-05,"d":"5.67E-05"},{"v":0.00927573899,"d":"9.28E-03"},{"v":16.8738289,"d":"1.69E+01"},{"$f":" -0.0000980174159","v":{"v":-9.80174159e-05,"d":"-9.80E-05"}},{"v":-0.434880115,"d":"-4.35E-01"},{"v":1303.87044,"d":"1.30E+03"},{"v":2.80004514e-08,"d":"2.80E-08"},{"v":-1.28084119E-5,"d":"-1.28E-05"},{"v":1.82357105E-3,"d":"1.82E-03"},{"v":-0.105351927,"d":"-1.05E-01"},{"v":-1.02217889,"d":"-1.02E+00"},{"v":1472.63465,"d":"1.47E+03"},null,{"v":-1.03375606E-7,"d":"-1.03E-07"},{"v":2.12519465E-4,"d":"2.13E-04"},{"v":-0.0109587505,"d":"-1.10E-02"},{"v":56.7120937,"d":"5.67E+01"},{"v":-0.000256049074,"d":"-3E-04"},{"v":0.249375647,"d":"2E-01"},{"v":1886.73926,"d":"2E+03"},50.5,null,50.5,null,{"$f":"ER37-5","v":45.5},{"$nulls":3},17.5,{"$f":"Tavg_cold","v":17},17.5,17.5,17.5,{"$nulls":5},0.5,{"v":1.175,"d":"1.18"},null,{"v":0.4800158342057211,"d":"48.00%"},{"$f":"DU37","v":{"v":706.88795,"d":"706.9"}},{"$f":"EI37","v":{"v":1472.63465,"d":"1472.6"}},{"$f":"FP38","v":{"v":0.5496923483363644,"d":"54.97%"}},{"v":706.88795,"d":"706.89"},{"v":0,"d":"0.00"},{"v":663.138651,"d":"663.14"},{"v":0,"d":"0.00%"},{"v":17.5,"d":"17.50"},21.150000000000002,{"v":3.650000000000002,"d":"3.65"},null,null,{"v":17.5,"d":"17.50"},null,null,15.69066559142683,null,{"v":0,"d":"0.0%"},null,{"v":2334.1781978570243,"d":"2334.18"},{"v":16999.11362775623,"d":"16999.11"},{"v":1167.0890989285122,"d":"1167.09"},{"v":1167.089098928512,"d":"1167.09"},{"v":7.2478490515896785E-3,"d":"0.01"},{"v":7.2478490515896785E-3,"d":"0.01"},{"v":38.49069218350365,"d":"38.49"},{"v":75.86519639489639,"d":"75.87"},{"v":0.06865587962321068,"d":"7%"},null,{"v":3557.0118570174286,"d":"3557.01"},{"v":2138.4979049636813,"d":"2138.50"},{"v":1778.5059285087143,"d":"1778.51"},{"v":1778.5059285087143,"d":"1778.51"},{"v":1778.5059285087143,"d":"1778.51"},{"v":0.011112703645172665,"d":"0.0111"},{"v":0.011112703645172665,"d":"0.0111"},{"v":0.011112703645172665,"d":"0.01"},{"v":55.47783951997643,"d":"55.48"},{"v":55.47783951997643,"d":"55.48"},{"v":46.852372742145086,"d":"46.85"},{"v":19.415087041495514,"d":"19.42"},{"v":19.415087041495514,"d":"19.42"},{"v":1999.864655238314,"d":"2000"},706.88795,1999.864655238314,17.5,17.5,{"v":1999.864655238314,"d":"2000"},1,{"v":1999.864655238314,"d":"2000"},0.5,{"v":1.175,"d":"1.18"},null,{"v":0.4800158342057211,"d":"48.00%"},{"v":706.88795,"d":"706.9"},{"v":1472.63465,"d":"1472.6"},{"$f":"HR38","v":{"v":0.5496923483363644,"d":"54.97%"}},{"v":706.88795,"d":"706.89"},{"v":0,"d":"0.00"},{"v":663.138651,"d":"663.14"},{"v":0,"d":"0.00%"},{"v":17.5,"d":"17.50"},21.150000000000002,{"v":3.650000000000002,"d":"3.65"},null,null,{"v":17.5,"d":"17.50"},null,null,15.69066559142683,null,{"$error":"#DIV/0!"},null,{"v":2334.1781978570243,"d":"2334.18"},{"v":16999.11362775623,"d":"16999.11"}]
[null,{"v":1,"d":"100%"},10,{"v":9757.896337639077,"d":"9758"},839,{"v":19.582207794636734,"d":"19.6"},{"v":2199.744151575901,"d":"2200"},{"v":2199.744151575901,"d":"2200"},{"$f":"IF(Geg_dP<AB38,ROUND(((IF('Briza 22 & 26'!$M$4=\"High Perform. 208/230V (US/EU)\",cal!HK38,H38)/Watts)/((Tr_cool-Tv_cool)*1.163))*FlowH2O,IF(UnitsNo=1,0,IF(UnitsNo=2,2))),\"\")","v":946},{"v":24.39399701732463,"d":"24.4"},46.5,{"$f":"IF(Geg_dP<$AB38,IF(CalcNo=\"12\",$ET38,IF(CalcNo=\"22\",$ET38,IF(CalcNo=\"13\",$EU38,IF(CalcNo=\"23\",$EU38,IF(CalcNo=\"11\",$ER38,IF(CalcNo=\"21\",$ER38,IF(CalcNo=\"14\",$ES38,IF(CalcNo=\"24\",$ES38,IF(CalcNo=\"32\",$EX38,IF(CalcNo=\"42\",$EX38,IF(CalcNo=\"33\",$EY38,IF(CalcNo=\"43\",$EY38,IF(CalcNo=\"31\",$EV38,IF(CalcNo=\"41\",$EV38,IF(CalcNo=\"34\",$EW38,IF(CalcNo=\"44\",$EW38,)))))))))))))))),\"\")","v":54.5},{"$f":"IF(Geg_dP<$AB38,($CF38*(($N38*CFMs)^4))+($CG38*(($N38*CFMs)^3))+($CH38*(($N38*CFMs)^2))+($CI38*($N38*CFMs))+$CJ38,\"\")","v":{"v":51.22249248842971,"d":"51.2"}},{"v":809.495999,"d":"809"},{"v":1.0758851661350346,"d":"1.08"},{"v":55.38321421226928,"d":"55.4"},{"v":24.67467291403525,"d":"24.7"},{"v":18.923271239401487,"d":"18.9"},{"v":16.775896668998776,"d":"16.8"},{"v":0.8146072630477551,"d":"81%"},{"v":1048.5357220807407,"d":"1049"},{"v":0.227797262971212,"d":"0.23"},{"v":2.7174243656464334,"d":"2.717"},1.03062,1.073,1.14154,1.03062,120.18,1.03062,1.073,1.14154,{"v":86,"d":"86.00"},1.03062,1.073,1.14154,{"v":139,"d":"139.00"},1.03062,1.073,1.14154,120.18,1.0127469901095905,1.4118789851268314,1.1240022585776352,{"$f":"AR37","v":{"v":213.4,"d":"213.40"}},{"$nulls":3},1000,{"$nulls":3},1000,{"$nulls":3},1000,{"$nulls":3},1000,null,null,{"v":-458.60775,"d":"-4.59E+02"},{"v":-306.698719,"d":"-3.07E+02"},{"v":1.8304780500024638,"d":"1.83E+00"},{"v":-458.60775,"d":"-4.59E+02"},{"v":-306.698719,"d":"-3.07E+02"},{"v":1.8304780500024638,"d":"1.83E+00"},{"v":38.7384562,"d":"3.87E+01"},{"$f":"BO38","v":{"v":-306.698719,"d":"-3.07E+02"}},{"$f":"+BP38","v":{"v":1.8304780500024638,"d":"1.83E+00"}},0,0,0,0,0,0,{"v":0,"d":"0.00E+00"},{"v":-3.21801744e-06,"d":"-3.22E-06"},{"v":0.00079753316,"d":"7.98E-04"},{"v":-0.0689371611,"d":"-6.89E-02"},{"v":-4.21141057,"d":"-4.21E+00"},{"v":809.495999,"d":"8.09E+02"},{"v":0,"d":"0.00E+00"},{"v":-1.90442089e-07,"d":"-1.90E-07"},{"v":0.000163212102,"d":"1.63E-04"},{"v":0.02265741,"d":"2.27E-02"},{"v":23.9750343,"d":"2.40E+01"},{"v":-5.77737251e-05,"d":"-5.78E-05"},{"v":-0.506832466,"d":"-5.07E-01"},{"v":1496.67276,"d":"1.50E+03"},null,{"v":-2.33545249e-06,"d":"-2.34E-06"},{"v":0.000599097243,"d":"5.99E-04"},{"v":-0.0637296129,"d":"-6.37E-02"},{"v":-5.42733864,"d":"-5.43E+00"},{"v":686.540428,"d":"6.87E+02"},null,{"v":-2.70987265E-7,"d":"-2.71E-07"},{"v":2.06715754E-4,"d":"2.07E-04"},{"v":0.011897685,"d":"1.19E-02"},{"v":16.4444626,"d":"1.64E+01"},{"v":-8.92734155e-05,"d":"-8.93E-05"},{"v":-0.216008064,"d":"-2.16E-01"},{"v":1248.77608,"d":"1.25E+03"},null,{"v":-1.70757422E-6,"d":"-1.71E-06"},{"v":0.00057362341,"d":"5.74E-04"},{"v":-0.0787921144,"d":"-7.88E-02"},{"v":-2.59939364,"d":"-2.60E+00"},{"v":990.134221,"d":"9.90E+02"},null,{"v":-3.48551808e-07,"d":"-3.49E-07"},{"v":0.000287846762,"d":"2.88E-04"},{"v":0.0202506766,"d":"2.03E-02"},{"v":29.8714018,"d":"2.99E+01"},{"v":-1.23356558E-4,"d":"-1.23E-04"},{"v":-0.260979592,"d":"-2.61E-01"},{"v":1587.54713,"d":"1.59E+03"},null,{"v":-3.21801744e-06,"d":"-3.22E-06"},{"v":0.00079753316,"d":"7.98E-04"},{"v":-0.0689371611,"d":"-6.89E-02"},{"v":-4.21141057,"d":"-4.21E+00"},{"v":809.495999,"d":"8.09E+02"},null,{"v":-1.90442089e-07,"d":"-1.90E-07"},{"v":0.000163212102,"d":"1.63E-04"},{"v":0.02265741,"d":"2.27E-02"},{"v":23.9750343,"d":"2.40E+01"},{"v":-5.77737251e-05,"d":"-5.78E-05"},{"v":-0.506832466,"d":"-5.07E-01"},{"v":1496.67276,"d":"1.50E+03"},{"$f":"ED37","v":{"v":2.80004514e-08,"d":"2.80E-08"}},{"v":-1.28084119E-5,"d":"-1.28E-05"},{"v":1.82357105E-3,"d":"1.82E-03"},{"v":-0.105351927,"d":"-1.05E-01"},{"v":-1.02217889,"d":"-1.02E+00"},{"v":1472.63465,"d":"1.47E+03"},{"$f":"EJ37","v":0},{"v":-1.03375606E-7,"d":"-1.03E-07"},{"v":2.12519465E-4,"d":"2.13E-04"},{"v":-0.0109587505,"d":"-1.10E-02"},{"v":56.7120937,"d":"5.67E+01"},{"v":-0.000256049074,"d":"-3E-04"},{"v":0.249375647,"d":"2E-01"},{"v":1886.73926,"d":"2E+03"},54.5,null,54.5,null,{"$f":"ER38-5","v":49.5},{"$nulls":3},17.5,{"$f":"Tavg_cold","v":17},17.5,17.5,17.5,{"$nulls":5},0.5,{"v":1.175,"d":"1.18"},null,{"v":0.5496923483363644,"d":"54.97%"},{"$f":"DU38","v":{"v":809.495999,"d":"809.5"}},{"$f":"EI38","v":{"v":1472.63465,"d":"1472.6"}},{"$f":"FN38/FO38","v":{"v":0.5496923483363644,"d":"54.97%"}},{"v":809.495999,"d":"809.50"},{"v":0,"d":"0.00"},{"v":663.138651,"d":"663.14"},{"v":0,"d":"0.00%"},{"$f":"FC38","v":{"v":17.5,"d":"17.50"}},21.150000000000002,{"$f":"ABS(FV38-FU38)","v":{"v":3.650000000000002,"d":"3.65"}},null,null,{"$f":"IF(FM38<=FP38,FU38,FU38+(FT38*FW38))","v":{"v":17.5,"d":"17.50"}},null,null,15.69066559142683,null,{"v":0,"d":"0.0%"},null,{"v":2334.1781978570243,"d":"2334.18"},{"v":15971.583439743736,"d":"15971.58"},{"v":1167.0890989285122,"d":"1167.09"},{"v":1167.089098928512,"d":"1167.09"},{"v":7.2478490515896785E-3,"d":"0.01"},{"v":7.2478490515896785E-3,"d":"0.01"},{"v":38.49069218350365,"d":"38.49"},{"v":74.53038807255128,"d":"74.53"},{"v":0.0730728486209028,"d":"7%"},null,{"v":3557.0118570174286,"d":"3557.01"},{"v":2183.267949090766,"d":"2183.27"},{"v":1778.5059285087143,"d":"1778.51"},{"v":1778.5059285087143,"d":"1778.51"},{"v":1778.5059285087143,"d":"1778.51"},{"v":0.011112703645172665,"d":"0.0111"},{"v":0.011112703645172665,"d":"0.0111"},{"v":0.011112703645172665,"d":"0.01"},{"v":55.47783951997643,"d":"55.48"},{"v":55.47783951997643,"d":"55.48"},{"v":47.19288658740504,"d":"47.19"},{"v":19.415087041495514,"d":"19.42"},{"v":19.415087041495514,"d":"19.42"},{"v":2199.744151575901,"d":"2200"},809.495999,2199.744151575901,17.5,17.5,{"v":2199.744151575901,"d":"2200"},1,{"v":2199.744151575901,"d":"2200"},0.5,{"v":1.175,"d":"1.18"},null,{"v":0.5496923483363644,"d":"54.97%"},{"v":809.495999,"d":"809.5"},{"v":1472.63465,"d":"1472.6"},{"$f":"HP38/HQ38","v":{"v":0.5496923483363644,"d":"54.97%"}},{"v":809.495999,"d":"809.50"},{"v":0,"d":"0.00"},{"v":663.138651,"d":"663.14"},{"v":0,"d":"0.00%"},{"v":17.5,"d":"17.50"},21.150000000000002,{"$f":"ABS(HX38-HW38)","v":{"v":3.650000000000002,"d":"3.65"}},null,null,{"$f":"IF(HO38<=HR38,HW38,HW38+(HV38*HY38))","v":{"v":17.5,"d":"17.50"}},null,null,15.69066559142683,null,{"$error":"#DIV/0!"},null,{"v":2334.1781978570243,"d":"2334.18"},{"v":15971.583439743736,"d":"15971.58"}]
[null,{"$f":"IF(LangNo=1,NL!A39,IF(LangNo=2,EN!A39,IF(LangNo=3,DE!A39,IF(LangNo=4,FR!A39,IF(LangNo=5,NR!A39,IF(LangNo=6,SP!A39,IF(LangNo=7,SW!A39,IF(LangNo=8,TS!A39,IF(LangNo=9,ExtraTaal1!A39,IF(LangNo=10,ExtraTaal2!A39,IF(LangNo=11,ExtraTaal3!A39,)))))))))))","v":"Briza 22 (230V) height 54,5 cm, width 22 cm, length 125 cm (Type 06)"},{"$nulls":24},0,"m³/h","n-value","n-value","n-value","m³/h","n-value","n-value","n-value","m³/h","n-value","n-value","n-value","m³/h","n-value","n-value","n-value","m³/h","n-value","n-value","n-value",{"$f":"AF39","v":"m³/h"},"n-value","n-value","n-value",{"$f":"AJ39","v":"m³/h"},"n-value","n-value","n-value",{"$f":"AN39","v":"m³/h"},"n-value","n-value","n-value",{"$f":"AR39","v":"m³/h"},null,{"$f":"IF($BK$17=\"11\",BO39,IF($BK$17=\"21\",BR39,IF($BK$17=\"12\",BO39,IF($BK$17=\"22\",BR39,IF($BK$17=\"13\",BO39,IF($BK$17=\"23\",BR39,IF($BK$17=\"14\",BO39,IF($BK$17=\"24\",BR39,IF($BK$17=\"31\",BU39,IF($BK$17=\"41\",BX39,IF($BK$17=\"32\",BU39,IF($BK$17=\"42\",BX39,IF($BK$17=\"33\",BU39,IF($BK$17=\"43\",BX39,IF($BK$17=\"34\",BU39,IF($BK$17=\"44\",BX39,))))))))))))))))","v":22},{"$f":"(BN39+IF(CaseNo=1,0,IF(CaseNo=2,$BN$2,)))*MilInch","v":54.5},{"$f":"(BJ39+IF(CaseNo=1,0,IF(CaseNo=2,$BN$3,)))*MilInch","v":22},{"$f":"(BP39+IF(CaseNo=1,0,IF(CaseNo=2,$BN$4,)))*MilInch","v":95},54.5,22,95,54.5,22,95,54.5,26,95,54.5,26,95,{"$f":"CF39","v":"T06"},{"$nulls":5},"T06",{"$nulls":7},{"$f":"CF39","v":"T06"},{"$nulls":13},{"$f":"CF39","v":"T06"},{"$nulls":13},{"$f":"CF39","v":"T06"},{"$nulls":13},{"$f":"CF39","v":"T06"},{"$nulls":13},"T06",{"$nulls":8},{"$f":"ER39","v":"T06"},{"$nulls":54},0,{"$error":"#VALUE!"},{"$f":"IF(Geg_dP<$AB39,((($BL$18*($HE39/Cubics)^4+$BL$19*($HE39/Cubics)^3+$BL$20*($HE39/Cubics)^2+$BL$21*($HE39/Cubics)^1+$BL$22)*((CF_Regime_Cool_noExp)^$Y39)))*CF_Addit*Watts*CF_Altit,Lim_dP)","v":{"$error":"#VALUE!"}},{"$error":"#VALUE!"},{"$error":"#VALUE!"},{"$error":"#VALUE!"},{"$error":"#VALUE!"},{"$error":"#VALUE!"},"T06"]
[null,{"$f":"IF($AL$5=1,$C40/10,IF($AL$5=2,$C40/10,IF($AL$5=3,0,IF($AL$5=4,$C40/10,))))","v":{"v":0.2,"d":"20%"}},2,{"$f":"IF(Geg_dP<AB40,((($BK$40*($N40/Cubics)^4+$BK$41*($N40/Cubics)^3+$BK$43*($N40/Cubics)^2+$BK$45*($N40/Cubics)^1+$BK$46)*((CF_Regime_Heat_noExp)^$AA40)))*CF_Addit*Watts*CF_Altit,Lim_dP)","v":{"v":4291.017691579899,"d":"4291"}},{"$f":"IF(Geg_dP<$AB40,ROUND((($D40/Watts)/((Tv_heat-Tr_heat)*1.163))*FlowH2O,IF(UnitsNo=1,0,IF(UnitsNo=2,2))),\"\")","v":369},{"$f":"IF(Geg_dP<$AB40,IF((($BM$40*(E40/FlowH2O)^$BM$41))*kPa>0,(($BM$40*(E40/FlowH2O)^$BM$41))*kPa,0),\"\")","v":{"v":1.5453521305701372,"d":"1.5"}},{"$f":"IF(Geg_dP<$AB40,((($BL$40*($N40/Cubics)^4+$BL$41*($N40/Cubics)^3+$BL$43*($N40/Cubics)^2+$BL$45*($N40/Cubics)^1+$BL$46)*((CF_Regime_Cool_noExp)^$Y40)))*CF_Addit*Watts*CF_Altit,Lim_dP)","v":{"v":787.4651303097044,"d":"787"}},{"$f":"IF(Geg_dP<$AB40,((G40/Watts)/(IF((237.3*LN((RH*EXP(17.27*(Tl_cool/(Tl_cool+237.3))))))/(17.27-LN((RH*EXP(17.27*(Tl_cool/(Tl_cool+237.3))))))<EZ40,1,IF(1/(1+((2258*((0.622/((101325/(1*611*EXP(17.27*(EZ40/(EZ40+237.3))))))-1)*1000-(0.622/((101325/(RH*611*EXP(17.27*(Tl_cool/(Tl_cool+237.3))))))-1)*1000))/(1005*(Tavg_cold-Tl_cool))))>1,1,1/(1+((2258*((0.622/((101325/(1*611*EXP(17.27*(EZ40/(EZ40+237.3))))))-1)*1000-(0.622/((101325/(RH*611*EXP(17.27*(Tl_cool/(Tl_cool+237.3))))))-1)*1000))/(1005*(Tavg_cold-Tl_cool))))))))*Watts,\"\")","v":{"v":787.4651303097044,"d":"787"}},{"$f":"IF(Geg_dP<AB40,ROUND(((IF('Briza 22 & 26'!$M$4=\"High Perform. 208/230V (US/EU)\",cal!HK40,H40)/Watts)/((Tr_cool-Tv_cool)*1.163))*FlowH2O,IF(UnitsNo=1,0,IF(UnitsNo=2,2))),\"\")","v":339},{"$f":"IF(Geg_dP<$AB40,IF((($BM$45*(I40/FlowH2O)^$BM$46))*kPa>0,(($BM$45*(I40/FlowH2O)^$BM$46))*kPa,0),\"\")","v":{"v":1.321057401378075,"d":"1.3"}},{"$f":"IF(Geg_dP<AB40,IF($L40-8<0,0,$L40-8),\"\")","v":{"v":28,"d":"28.0"}},{"$f":"IF(Geg_dP<$AB40,IF(CalcNo=\"12\",$ET40,IF(CalcNo=\"22\",$ET40,IF(CalcNo=\"13\",$EU40,IF(CalcNo=\"23\",$EU40,IF(CalcNo=\"11\",$ER40,IF(CalcNo=\"21\",$ER40,IF(CalcNo=\"14\",$ES40,IF(CalcNo=\"24\",$ES40,IF(CalcNo=\"32\",$EX40,IF(CalcNo=\"42\",$EX40,IF(CalcNo=\"33\",$EY40,IF(CalcNo=\"43\",$EY40,IF(CalcNo=\"31\",$EV40,IF(CalcNo=\"41\",$EV40,IF(CalcNo=\"34\",$EW40,IF(CalcNo=\"44\",$EW40,)))))))))))))))),\"\")","v":{"v":36,"d":"36.0"}},{"$f":"IF(Geg_dP<$AB40,($CF40*(($N40/Cubics)^4))+($CG40*(($N40/Cubics)^3))+($CH40*(($N40/Cubics)^2))+($CI40*($N40/Cubics))+$CJ40,\"\")","v":{"v":7.244521390926631,"d":"7.2"}},{"$f":"IF(Geg_dP<$AB40,(BZ40*Geg_dP^5+CA40*Geg_dP^4+CB40*Geg_dP^3+CC40*Geg_dP^2+CD40*Geg_dP+CE40)*CF_Case*Cubics,\"\")","v":{"v":333.863698,"d":"334"}},{"$f":"IF(Geg_dP<$AB40,(($N40/Cubics)/3600)/(($BJ$47/100)*($BP$47/100))*FeetMins,\"\")","v":{"v":0.3372360585858586,"d":"0.34"}},{"$f":"IF(Geg_dP<$AB40,((($D40/Watts)/(((p_atm*0.028964)/(8.31447*(20+273.15)))*(($N40/3600)/Cubics)*(1005+1870*((0.622)/(((p_atm)/($E$14*pvs_heat_in))-1)))))+Tl_heat)*Celc1+Celc2,\"\")","v":{"v":57.72653279232437,"d":"57.7"}},{"$f":"IF(Geg_dP<$AB40,(27.8*LN(($GN40+36)/45.5))*Celc1+Celc2,\"\")","v":{"v":25.26859687005706,"d":"25.3"}},{"$f":"IF(Geg_dP<$AB40,(Tl_cool-(($G40/Watts)/(1006*$N40*kgss)))*Celc1+Celc2,\"\")","v":{"v":19.98964250377915,"d":"20.0"}},{"$f":"IF(Geg_dP<$AB40,IF((27.8*LN(($HA40+36)/45.5))*Celc1+Celc2>R40,R40,(27.8*LN(($HA40+36)/45.5))*Celc1+Celc2),\"\")","v":{"v":17.13904323255153,"d":"17.1"}},{"$f":"IF(Geg_dP<$AB40,IF($H40>$G40,1,IF(($GT40/$GR40)<0,0,$GT40/$GR40)),\"\")","v":{"v":0.762428945397192,"d":"76%"}},{"$f":"IF(Geg_dP<$AB40,$CK40*($N40/Cubics)^2+$CL40*($N40/Cubics)^1+$CM40,\"\")","v":{"v":433.21562454042123,"d":"433"}},{"$f":"M40/((N40/Cubics)/3.6)","v":{"v":0.07811654026349361,"d":"0.08"}},{"$f":"(G40/Watts)/(N40/Cubics)","v":{"v":2.3586425688896084,"d":"2.359"}},0.993243,1.23546,1.10433,0.993243,9.56,0.993243,1.23546,1.10433,{"v":8.2,"d":"8.20"},0.993243,1.23546,1.10433,{"v":8,"d":"8.00"},0.993243,1.23546,1.10433,9.56,1.0288573703986699,1.5348139398733884,1.1401126388667442,{"v":20.5,"d":"20.50"},0.993243,1.23546,1.10433,{"v":8.2,"d":"8.20"},0.993243,1.23546,1.10433,{"v":8,"d":"8.00"},0.9933058028578283,1.2349800450330226,1.1045610713258731,9.56,0.9756960835435103,1.0199429606771673,1.0869513520115845,{"v":20.5,"d":"20.50"},null,null,{"$f":"IF($BK$17=\"11\",BN40,IF($BK$17=\"21\",BQ40,IF($BK$17=\"12\",BN40,IF($BK$17=\"22\",BQ40,IF($BK$17=\"13\",BN40,IF($BK$17=\"23\",BQ40,IF($BK$17=\"14\",BN40,IF($BK$17=\"24\",BQ40,IF($BK$17=\"31\",BT40,IF($BK$17=\"41\",BW40,IF($BK$17=\"32\",BT40,IF($BK$17=\"42\",BW40,IF($BK$17=\"33\",BT40,IF($BK$17=\"43\",BW40,IF($BK$17=\"34\",BT40,IF($BK$17=\"44\",BW40,))))))))))))))))","v":{"v":0,"d":"0.00E+00"}},{"v":0,"d":"0.00E+00"},{"v":2.76485e-05,"d":"2.76E-05"},null,null,{"$f":"BP45","v":{"v":2.76485e-05,"d":"2.76E-05"}},null,{"$f":"BO40","v":0},{"v":1.5054193678754681E-4,"d":"1.51E-04"},null,null,{"$f":"BV45","v":{"v":2.31369945e-05,"d":"2.31E-05"}},null,null,{"$f":"BS40","v":{"v":1.5054193678754681E-4,"d":"1.51E-04"}},{"$f":"IF($BK$17=\"11\",CN40,IF($BK$17=\"21\",CN40,IF($BK$17=\"12\",DP40,IF($BK$17=\"22\",DP40,IF($BK$17=\"13\",ED40,IF($BK$17=\"23\",ED40,IF($BK$17=\"14\",DB40,IF($BK$17=\"24\",DB40,IF($BK$17=\"31\",CN40,IF($BK$17=\"41\",CN40,IF($BK$17=\"32\",DP40,IF($BK$17=\"42\",DP40,IF($BK$17=\"33\",ED40,IF($BK$17=\"43\",ED40,IF($BK$17=\"34\",DB40,IF($BK$17=\"44\",DB40,))))))))))))))))","v":{"v":0,"d":"0.00E+00"}},{"v":0.0530261178,"d":"5.30E-02"},{"v":-1.2148844,"d":"-1.21E+00"},{"v":8.03936939,"d":"8.04E+00"},{"v":-41.1089952,"d":"-4.11E+01"},{"v":333.863698,"d":"3.34E+02"},{"v":0,"d":"0.00E+00"},{"v":-1.47596311e-08,"d":"-1.48E-08"},{"v":1.04912322E-5,"d":"1.05E-05"},{"v":2.47179709E-3,"d":"2.47E-03"},{"v":5.79913969,"d":"5.80E+00"},{"v":-0.000175869436,"d":"-1.76E-04"},{"v":-0.161037479,"d":"-1.61E-01"},{"v":506.583474,"d":"5.07E+02"},null,{"v":-0.00060080235,"d":"-6.01E-04"},{"v":0.0514974222,"d":"5.15E-02"},{"v":-0.541681963,"d":"-5.42E-01"},{"v":-20.250915,"d":"-2.03E+01"},{"v":176.686527,"d":"1.77E+02"},null,{"v":-2.18858217e-08,"d":"-2.19E-08"},{"v":7.07329117e-06,"d":"7.07E-06"},{"v":2.31510533E-3,"d":"2.32E-03"},{"v":4.88882292,"d":"4.89E+00"},{"v":-0.000327221403,"d":"-3.27E-04"},{"v":0.0213728802,"d":"2.14E-02"},{"v":339.920119,"d":"3.40E+02"},null,{"v":-0.0187337773,"d":"-1.87E-02"},{"v":0.333384732,"d":"3.33E-01"},{"v":-2.09912446,"d":"-2.10E+00"},{"v":-23.5038124,"d":"-2.35E+01"},{"v":276.311046,"d":"2.76E+02"},null,{"v":3.05381566e-09,"d":"3.05E-09"},{"v":2.13831424e-06,"d":"2.14E-06"},{"v":0.00295510523,"d":"2.96E-03"},{"v":5.43433942,"d":"5.43E+00"},{"v":0.000252542207,"d":"2.53E-04"},{"v":-0.142612997,"d":"-1.43E-01"},{"v":481.317633,"d":"4.81E+02"},null,{"v":0.0530261178,"d":"5.30E-02"},{"v":-1.2148844,"d":"-1.21E+00"},{"v":8.03936939,"d":"8.04E+00"},{"v":-41.1089952,"d":"-4.11E+01"},{"v":333.863698,"d":"3.34E+02"},null,{"v":-1.47596311e-08,"d":"-1.48E-08"},{"v":1.04912322E-5,"d":"1.05E-05"},{"v":2.47179709E-3,"d":"2.47E-03"},{"v":5.79913969,"d":"5.80E+00"},{"v":-0.000175869436,"d":"-1.76E-04"},{"v":-0.161037479,"d":"-1.61E-01"},{"v":506.583474,"d":"5.07E+02"},null,{"v":0.00150282307,"d":"1.50E-03"},{"v":-0.0635175437,"d":"-6.35E-02"},{"v":0.601129394,"d":"6.01E-01"},{"v":-19.4832174,"d":"-1.95E+01"},{"v":491.419191,"d":"4.91E+02"},null,{"v":-5.84906791e-08,"d":"-5.85E-08"},{"v":5.07145896e-05,"d":"5.07E-05"},{"v":-1.53317308E-3,"d":"-1.53E-03"},{"v":9.27560972,"d":"9.28E+00"},{"v":1.45371261E-5,"d":"1E-05"},{"v":-0.1043705,"d":"-1E-01"},{"v":653.572617,"d":"7E+02"},36,null,36,null,{"$f":"EX40","v":35.5},null,35.5,null,{"$f":"IF($BK$17=\"11\",FA40,IF($BK$17=\"21\",FA40,IF($BK$17=\"12\",FC40,IF($BK$17=\"22\",FC40,IF($BK$17=\"13\",FD40,IF($BK$17=\"23\",FD40,IF($BK$17=\"14\",FB40,IF($BK$17=\"24\",FB40,IF($BK$17=\"31\",FE40,IF($BK$17=\"41\",FE40,IF($BK$17=\"32\",FG40,IF($BK$17=\"42\",FG40,IF($BK$17=\"33\",FH40,IF($BK$17=\"43\",FH40,IF($BK$17=\"34\",FF40,IF($BK$17=\"44\",FF40,))))))))))))))))","v":17.5},{"$f":"Tavg_cold","v":17},{"$f":"IF($GC40<=$FC40,$FC40,IF($FM40<=$FP40,$FC40,$FZ40))","v":17.5},{"$f":"IF($N40>$FN40,Tavg_cold+(0.5*(Tr_cool-Tavg_cold)),Tavg_cold+($FJ40*(Tr_cool-Tavg_cold)))","v":17.5},{"$f":"IF($GC40<=$FC40,$FC40,IF($FM40<=$FP40,$FC40,$FZ40))","v":17.5},{"$f":"FH40*1.04","v":18.2},{"$f":"IF($GC40<=$FU40,$FU40,IF($FM40<=$FP40,Tavg_cold,$GA40))","v":17.5},{"$f":"FH40*1.05","v":18.375},{"$f":"IF($GC40<=$FU40,$FU40,IF($FM40<=$FP40,Tavg_cold,$GA40))","v":17.5},null,{"$f":"0.5*(1-((FN40-N40)/FN40))","v":0.5},{"$f":"(0.025*Tl_cool)+0.5","v":{"v":1.175,"d":"1.18"}},{"$f":"(0.13*Tl_cool)-2.04","v":1.4700000000000002},{"$f":"FQ40/FO40","v":{"v":0.6793867722597753,"d":"67.94%"}},{"$f":"DU40","v":{"v":333.863698,"d":"333.9"}},{"$f":"EI40","v":{"v":491.419191,"d":"491.4"}},{"$f":"FN40/FO40","v":{"v":0.6793867722597753,"d":"67.94%"}},{"$f":"N40/Cubics","v":{"v":333.863698,"d":"333.86"}},{"$f":"IF(FQ40-(FP40*FO40)<=0,0,FQ40-(FP40*FO40))","v":{"v":0,"d":"0.00"}},{"$f":"FO40*(1-FP40)","v":{"v":157.55549299999998,"d":"157.56"}},{"$f":"IF((FR40/FS40)>1,1,FR40/FS40)","v":{"v":0,"d":"0.00%"}},{"$f":"FC40","v":{"v":17.5,"d":"17.50"}},{"$f":"Tr_cool*FK40","v":21.150000000000002},{"$f":"ABS(FV40-FU40)","v":{"v":3.650000000000002,"d":"3.65"}},{"$f":"Tv_cool*FL40","v":{"v":23.520000000000003,"d":"23.52"}},{"$f":"ABS(FX40-FU40)","v":{"v":6.020000000000003,"d":"6.02"}},{"$f":"IF(FM40<=FP40,FU40,FU40+(FT40*FW40))","v":{"v":17.5,"d":"17.50"}},{"$f":"FU40+(FT40*FY40)","v":{"v":17.5,"d":"17.50"}},null,{"$f":"(237.3*LN((RH*EXP(17.27*(Tl_cool/(Tl_cool+237.3))))))/(17.27-LN((RH*EXP(17.27*(Tl_cool/(Tl_cool+237.3))))))","v":15.69066559142683},null,{"$f":"(H40-G40)/H40","v":{"v":0,"d":"0.0%"}},null,{"$f":"(611*EXP(17.27*(Tl_heat/(Tl_heat+237.7))))","v":{"v":2334.1781978570243,"d":"2334.18"}},{"$f":"(611*EXP(17.27*((($P40-Celc2)/Celc1)/((($P40-Celc2)/Celc1)+237.7))))","v":{"v":17848.343216382367,"d":"17848.34"}},{"$f":"RH*$GG40","v":{"v":1167.0890989285122,"d":"1167.09"}},{"$f":"(GL40*p_atm)/(GL40+0.622)","v":{"v":1167.089098928512,"d":"1167.09"}},{"$f":"0.622*($GI40/(p_atm-$GI40))","v":{"v":7.2478490515896785E-3,"d":"0.01"}},{"v":7.2478490515896785E-3,"d":"0.01"},{"$f":"(1.005*Tl_heat)+($GK40*(2500+(1.87*Tl_heat)))","v":{"v":38.49069218350365,"d":"38.49"}},{"$f":"(1.005*(($P40-Celc2)/Celc1))+($GL40*(2500+(1.87*(($P40-Celc2)/Celc1))))","v":{"v":76.91718336168745,"d":"76.92"}},{"v":0.06538921202822243,"d":"7%"},null,{"$f":"(611*EXP(17.27*(Tl_cool/(Tl_cool+237.7))))","v":{"v":3557.0118570174286,"d":"3557.01"}},{"$f":"(611*EXP(17.27*((($R40-Celc2)/Celc1)/((($R40-Celc2)/Celc1)+237.7))))","v":{"v":2332.684165843403,"d":"2332.68"}},{"$f":"RH*$GQ40","v":{"v":1778.5059285087143,"d":"1778.51"}},{"$f":"(GW40*p_atm)/(GW40+0.622)","v":{"v":1778.5059285087143,"d":"1778.51"}},{"$f":"T40*GR40","v":{"v":1778.5059285087143,"d":"1778.51"}},{"$f":"0.622*($GS40/(p_atm-$GS40))","v":{"v":0.011112703645172665,"d":"0.0111"}},{"$f":"IF(H40=G40,GV40,(0.53475935828878*($GZ40-(1.005*(($R40-Celc2)/Celc1))))/(1336.8983957219))","v":{"v":0.011112703645172665,"d":"0.0111"}},{"$f":"0.622*($GU40/(p_atm-$GU40))","v":{"v":0.011112703645172665,"d":"0.01"}},{"$f":"(1.005*Tl_cool)+($GV40*(2500+(1.87*Tl_cool)))","v":{"v":55.47783951997643,"d":"55.48"}},{"$f":"GY40-((((H40-G40)/Watts)/1000)/(N40/$L$15))","v":{"v":55.47783951997643,"d":"55.48"}},{"$f":"(1.005*(($R40-Celc2)/Celc1))+($GX40*(2500+(1.87*(($R40-Celc2)/Celc1))))","v":{"v":48.286749708959334,"d":"48.29"}},{"v":19.415087041495514,"d":"19.42"},{"v":19.415087041495514,"d":"19.42"},{"$f":"H40","v":{"v":787.4651303097044,"d":"787"}},333.863698,{"$f":"IF(Geg_dP<$AB40,((($BL$40*($HE40/Cubics)^4+$BL$41*($HE40/Cubics)^3+$BL$43*($HE40/Cubics)^2+$BL$45*($HE40/Cubics)^1+$BL$46)*((CF_Regime_Cool_noExp)^$Y40)))*CF_Addit*Watts*CF_Altit,Lim_dP)","v":787.4651303097044},17.5,17.5,{"v":787.4651303097044,"d":"787"},1,{"v":787.4651303097044,"d":"787"},{"$f":"0.5*(1-((HP40-HE40)/HP40))","v":0.5},{"$f":"(0.025*Tl_cool)+0.5","v":{"v":1.175,"d":"1.18"}},{"$f":"(0.13*Tl_cool)-2.04","v":1.4700000000000002},{"$f":"HS40/HQ40","v":{"v":0.6793867722597753,"d":"67.94%"}},{"$f":"DU40","v":{"v":333.863698,"d":"333.9"}},{"v":491.419191,"d":"491.4"},{"$f":"HP40/HQ40","v":{"v":0.6793867722597753,"d":"67.94%"}},{"v":333.863698,"d":"333.86"},{"$f":"IF(HS40-(HR40*HQ40)<=0,0,HS40-(HR40*HQ40))","v":{"v":0,"d":"0.00"}},{"$f":"HQ40*(1-HR40)","v":{"v":157.55549299999998,"d":"157.56"}},{"$f":"IF((HT40/HU40)>1,1,HT40/HU40)","v":{"v":0,"d":"0.00%"}},{"v":17.5,"d":"17.50"},{"$f":"Tr_cool*HM40","v":21.150000000000002},{"$f":"ABS(HX40-HW40)","v":{"v":3.650000000000002,"d":"3.65"}},{"$f":"Tv_cool*HN40","v":{"v":23.520000000000003,"d":"23.52"}},{"$f":"ABS(HZ40-HW40)","v":{"v":6.020000000000003,"d":"6.02"}},{"$f":"IF(HO40<=HR40,HW40,HW40+(HV40*HY40))","v":{"v":17.5,"d":"17.50"}},{"$f":"HW40+(HV40*IA40)","v":{"v":17.5,"d":"17.50"}},null,{"$f":"(237.3*LN((RH*EXP(17.27*(Tl_cool/(Tl_cool+237.3))))))/(17.27-LN((RH*EXP(17.27*(Tl_cool/(Tl_cool+237.3))))))","v":15.69066559142683},null,{"$f":"(BG40-BF40)/BG40","v":{"v":0.06164801323482148,"d":"6.2%"}},null,{"$f":"(611*EXP(17.27*(Tl_heat/(Tl_heat+237.7))))","v":{"v":2334.1781978570243,"d":"2334.18"}},{"$f":"(611*EXP(17.27*((($P40-Celc2)/Celc1)/((($P40-Celc2)/Celc1)+237.7))))","v":{"v":17848.343216382367,"d":"17848.34"}}]
[null,{"$f":"IF($AL$5=1,$C41/10,IF($AL$5=2,$C41/10,IF($AL$5=3,0,IF($AL$5=4,$C41/10,))))","v":{"v":0.4,"d":"40%"}},4,{"v":7376.496484577707,"d":"7376"},634,{"v":4.204780840849393,"d":"4.2"},{"v":1367.09150506205,"d":"1367"},{"v":1367.09150506205,"d":"1367"},{"$f":"IF(Geg_dP<AB41,ROUND(((IF('Briza 22 & 26'!$M$4=\"High Perform. 208/230V (US/EU)\",cal!HK41,H41)/Watts)/((Tr_cool-Tv_cool)*1.163))*FlowH2O,IF(UnitsNo=1,0,IF(UnitsNo=2,2))),\"\")","v":588},{"v":3.658029693502845,"d":"3.7"},{"v":36,"d":"36.0"},{"$f":"IF(Geg_dP<$AB41,IF(CalcNo=\"12\",$ET41,IF(CalcNo=\"22\",$ET41,IF(CalcNo=\"13\",$EU41,IF(CalcNo=\"23\",$EU41,IF(CalcNo=\"11\",$ER41,IF(CalcNo=\"21\",$ER41,IF(CalcNo=\"14\",$ES41,IF(CalcNo=\"24\",$ES41,IF(CalcNo=\"32\",$EX41,IF(CalcNo=\"42\",$EX41,IF(CalcNo=\"33\",$EY41,IF(CalcNo=\"43\",$EY41,IF(CalcNo=\"31\",$EV41,IF(CalcNo=\"41\",$EV41,IF(CalcNo=\"34\",$EW41,IF(CalcNo=\"44\",$EW41,)))))))))))))))),\"\")","v":{"v":44,"d":"44.0"}},{"v":17.456415028346257,"d":"17.5"},{"v":614.416243,"d":"614"},{"v":0.6206224676767677,"d":"0.62"},{"v":55.24059557860466,"d":"55.2"},{"v":24.63811269820185,"d":"24.6"},{"v":20.386780625775728,"d":"20.4"},{"v":17.273083165092565,"d":"17.3"},{"v":0.7439665671235521,"d":"74%"},{"v":645.616528470606,"d":"646"},{"v":0.1022809777866607,"d":"0.10"},{"v":2.2250250064792803,"d":"2.225"},0.993243,1.23546,1.10433,0.993243,30.18,0.993243,1.23546,1.10433,{"v":24,"d":"24.00"},0.993243,1.23546,1.10433,{"v":34,"d":"34.00"},0.993243,1.23546,1.10433,30.18,1.0288573703986699,1.5348139398733884,1.1401126388667442,74.38,0.993243,1.23546,1.10433,{"v":24,"d":"24.00"},0.993243,1.23546,1.10433,{"v":34,"d":"34.00"},0.9933058028578283,1.2349800450330226,1.1045610713258731,30.18,0.9756960835435103,1.0199429606771673,1.0869513520115845,74.38,null,null,{"v":0,"d":"0.00E+00"},{"v":0,"d":"0.00E+00"},{"v":1.84936,"d":"1.85E+00"},null,null,{"$f":"BP46","v":{"v":1.84936,"d":"1.85E+00"}},null,{"$f":"BO41","v":0},{"v":1.816675973943781,"d":"1.82E+00"},null,null,{"$f":"BV46","v":{"v":1.88247875,"d":"1.88E+00"}},null,null,{"$f":"BS41","v":{"v":1.816675973943781,"d":"1.82E+00"}},{"v":0,"d":"0.00E+00"},{"v":0.00116427438,"d":"1.16E-03"},{"v":-0.0713398843,"d":"-7.13E-02"},{"v":1.17535322,"d":"1.18E+00"},{"v":-21.6618605,"d":"-2.17E+01"},{"v":614.416243,"d":"6.14E+02"},{"v":0,"d":"0.00E+00"},{"v":-2.49871093e-08,"d":"-2.50E-08"},{"v":2.77116175e-05,"d":"2.77E-05"},{"v":0.00407552483,"d":"4.08E-03"},{"v":10.2866837,"d":"1.03E+01"},{"v":-0.000129651193,"d":"-1.30E-04"},{"v":-0.158420843,"d":"-1.58E-01"},{"v":791.897142,"d":"7.92E+02"},null,{"v":0.000468375929,"d":"4.68E-04"},{"v":-0.0205942689,"d":"-2.06E-02"},{"v":0.223779627,"d":"2.24E-01"},{"v":-16.1634061,"d":"-1.62E+01"},{"v":394.918032,"d":"3.95E+02"},null,{"v":-1.72936768e-10,"d":"-1.73E-10"},{"v":4.35649577e-06,"d":"4.36E-06"},{"v":0.00681848909,"d":"6.82E-03"},{"v":9.27352279,"d":"9.27E+00"},{"v":-0.000233541947,"d":"-2.34E-04"},{"v":0.0246298405,"d":"2.46E-02"},{"v":579.954527,"d":"5.80E+02"},null,{"v":-9.39929828e-05,"d":"-9.40E-05"},{"v":0.00710278655,"d":"7.10E-03"},{"v":-0.266980273,"d":"-2.67E-01"},{"v":-13.1982894,"d":"-1.32E+01"},{"v":633.385627,"d":"6.33E+02"},null,{"v":-9.97266737e-09,"d":"-9.97E-09"},{"v":1.23083568E-5,"d":"1.23E-05"},{"v":0.008161207,"d":"8.16E-03"},{"v":13.1623185,"d":"1.32E+01"},{"v":1.03911902E-4,"d":"1.04E-04"},{"v":-0.177356831,"d":"-1.77E-01"},{"v":905.231846,"d":"9.05E+02"},null,{"v":0.00116427438,"d":"1.16E-03"},{"v":-0.0713398843,"d":"-7.13E-02"},{"v":1.17535322,"d":"1.18E+00"},{"v":-21.6618605,"d":"-2.17E+01"},{"v":614.416243,"d":"6.14E+02"},null,{"v":-2.49871093e-08,"d":"-2.50E-08"},{"v":2.77116175e-05,"d":"2.77E-05"},{"v":0.00407552483,"d":"4.08E-03"},{"v":10.2866837,"d":"1.03E+01"},{"v":-0.000129651193,"d":"-1.30E-04"},{"v":-0.158420843,"d":"-1.58E-01"},{"v":791.897142,"d":"7.92E+02"},null,{"v":2.52191543E-5,"d":"2.52E-05"},{"v":-4.03221966E-3,"d":"-4.03E-03"},{"v":0.150854342,"d":"1.51E-01"},{"v":-12.9740359,"d":"-1.30E+01"},{"v":1054.95399,"d":"1.05E+03"},null,{"v":-2.51712998E-8,"d":"-2.52E-08"},{"v":4.64601994e-05,"d":"4.65E-05"},{"v":0.00732719922,"d":"7.33E-03"},{"v":23.2550569,"d":"2.33E+01"},{"v":-2.29328908e-05,"d":"-2E-05"},{"v":-0.0827780442,"d":"-8E-02"},{"v":1159.2224,"d":"1E+03"},44,null,44,null,{"$f":"EX41","v":46},null,46,null,17.5,{"$f":"Tavg_cold","v":17},17.5,17.5,17.5,{"$f":"FH41*1.04","v":18.2},17.5,{"$f":"FH41*1.05","v":18.375},17.5,null,0.5,{"v":1.175,"d":"1.18"},1.4700000000000002,{"$f":"FQ41/FO41","v":{"v":0.5824104641757883,"d":"58.24%"}},{"$f":"DU41","v":{"v":614.416243,"d":"614.4"}},{"$f":"EI41","v":{"v":1054.95399,"d":"1055.0"}},{"$f":"FN41/FO41","v":{"v":0.5824104641757883,"d":"58.24%"}},{"v":614.416243,"d":"614.42"},{"v":0,"d":"0.00"},{"$f":"FO41*(1-FP41)","v":{"v":440.537747,"d":"440.54"}},{"$f":"IF((FR41/FS41)>1,1,FR41/FS41)","v":{"v":0,"d":"0.00%"}},{"$f":"FC41","v":{"v":17.5,"d":"17.50"}},21.150000000000002,{"$f":"ABS(FV41-FU41)","v":{"v":3.650000000000002,"d":"3.65"}},{"v":23.520000000000003,"d":"23.52"},{"$f":"ABS(FX41-FU41)","v":{"v":6.020000000000003,"d":"6.02"}},{"$f":"IF(FM41<=FP41,FU41,FU41+(FT41*FW41))","v":{"v":17.5,"d":"17.50"}},{"v":17.5,"d":"17.50"},null,15.69066559142683,null,{"v":0,"d":"0.0%"},null,{"v":2334.1781978570243,"d":"2334.18"},{"v":15863.042056621447,"d":"15863.04"},{"v":1167.0890989285122,"d":"1167.09"},{"v":1167.089098928512,"d":"1167.09"},{"v":7.2478490515896785E-3,"d":"0.01"},{"v":7.2478490515896785E-3,"d":"0.01"},{"v":38.49069218350365,"d":"38.49"},{"v":74.38512336724358,"d":"74.39"},{"v":0.07357284276009048,"d":"7%"},null,{"v":3557.0118570174286,"d":"3557.01"},{"v":2390.572382015863,"d":"2390.57"},{"v":1778.5059285087143,"d":"1778.51"},{"v":1778.5059285087143,"d":"1778.51"},{"v":1778.5059285087143,"d":"1778.51"},{"v":0.011112703645172665,"d":"0.0111"},{"v":0.011112703645172665,"d":"0.0111"},{"v":0.011112703645172665,"d":"0.01"},{"v":55.47783951997643,"d":"55.48"},{"v":55.47783951997643,"d":"55.48"},{"v":48.694126351904515,"d":"48.69"},{"v":19.415087041495514,"d":"19.42"},{"v":19.415087041495514,"d":"19.42"},{"v":1367.09150506205,"d":"1367"},614.416243,1367.09150506205,17.5,17.5,{"v":1367.09150506205,"d":"1367"},1,{"v":1367.09150506205,"d":"1367"},0.5,{"v":1.175,"d":"1.18"},1.4700000000000002,{"$f":"HS41/HQ41","v":{"v":0.5824104641757883,"d":"58.24%"}},{"v":614.416243,"d":"614.4"},{"v":1054.95399,"d":"1055.0"},{"$f":"HP41/HQ41","v":{"v":0.5824104641757883,"d":"58.24%"}},{"v":614.416243,"d":"614.42"},{"v":0,"d":"0.00"},{"$f":"HQ41*(1-HR41)","v":{"v":440.537747,"d":"440.54"}},{"$f":"IF((HT41/HU41)>1,1,HT41/HU41)","v":{"v":0,"d":"0.00%"}},{"v":17.5,"d":"17.50"},21.150000000000002,{"$f":"ABS(HX41-HW41)","v":{"v":3.650000000000002,"d":"3.65"}},{"$f":"Tv_cool*HN41","v":{"v":23.520000000000003,"d":"23.52"}},{"$f":"ABS(HZ41-HW41)","v":{"v":6.020000000000003,"d":"6.02"}},{"$f":"IF(HO41<=HR41,HW41,HW41+(HV41*HY41))","v":{"v":17.5,"d":"17.50"}},{"$f":"HW41+(HV41*IA41)","v":{"v":17.5,"d":"17.50"}},null,15.69066559142683,null,{"v":0.06164801323482148,"d":"6.2%"},null,{"v":2334.1781978570243,"d":"2334.18"},{"v":15863.042056621447,"d":"15863.04"}]
[null,{"$f":"IF($AL$5=1,$C42/10,IF($AL$5=2,$C42/10,IF($AL$5=3,0.25,IF($AL$5=4,$C42/10,))))","v":{"v":0.5,"d":"50%"}},5,{"v":150.1817637989142,"d":"150"},13,{"v":0.003175074008007952,"d":"0.0"},{"v":60.77215315250204,"d":"61"},{"v":60.77215315250204,"d":"61"},{"$f":"IF(Geg_dP<AB42,ROUND(((IF('Briza 22 & 26'!$M$4=\"High Perform. 208/230V (US/EU)\",cal!HK42,H42)/Watts)/((Tr_cool-Tv_cool)*1.163))*FlowH2O,IF(UnitsNo=1,0,IF(UnitsNo=2,2))),\"\")","v":26},{"v":0.01144107112666796,"d":"0.0"},{"v":0,"d":"0.0"},{"$f":"IF(Geg_dP<$AB42,0,\"\")","v":{"v":0,"d":"0.0"}},{"v":0,"d":"0.0"},0,{"v":0,"d":"0.00"},{"$error":"#DIV/0!"},{"$error":"#DIV/0!"},{"$error":"#DIV/0!"},{"$error":"#DIV/0!"},{"$error":"#DIV/0!"},0,{"$error":"#DIV/0!"},{"$error":"#DIV/0!"},0.993243,1.23546,1.10433,0.993243,44.260000000000005,0.993243,1.23546,1.10433,{"$f":"AF41+((AF43-AF41)/2)","v":{"v":36,"d":"36.00"}},0.993243,1.23546,1.10433,{"$f":"AJ41+((AJ43-AJ41)/2)","v":{"v":54.5,"d":"54.50"}},0.993243,1.23546,1.10433,{"$f":"AN41+((AN43-AN41)/2)","v":{"v":44.260000000000005,"d":"44.26"}},1.0288573703986699,1.5348139398733884,1.1401126388667442,{"v":103,"d":"103.00"},0.993243,1.23546,1.10433,{"v":36,"d":"36.00"},0.993243,1.23546,1.10433,{"v":54.5,"d":"54.50"},0.9933058028578283,1.2349800450330226,1.1045610713258731,{"v":44.260000000000005,"d":"44.26"},0.9756960835435103,1.0199429606771673,1.0869513520115845,{"v":103,"d":"103.00"},{"$nulls":17},{"v":0,"d":"0.00E+00"},{"v":0,"d":"0.00E+00"},{"v":0,"d":"0.00E+00"},{"v":0,"d":"0.00E+00"},{"v":0,"d":"0.00E+00"},{"v":0,"d":"0.00E+00"},{"v":0,"d":"0.00E+00"},{"v":0,"d":"0.00E+00"},{"v":0,"d":"0.00E+00"},{"v":0,"d":"0.00E+00"},{"v":0,"d":"0.00E+00"},{"v":0,"d":"0.00E+00"},{"v":0,"d":"0.00E+00"},{"v":0,"d":"0.00E+00"},{"$nulls":44},{"v":-0.000197717031,"d":"-1.98E-04"},{"v":-0.0126163872,"d":"-1.26E-02"},{"v":-8.87564995,"d":"-8.88E+00"},{"v":1273.46339,"d":"1.27E+03"},null,{"v":-2.46569e-08,"d":"-2.47E-08"},{"v":5.50362569e-05,"d":"5.50E-05"},{"v":0.00874510616,"d":"8.75E-03"},{"v":36.5565696,"d":"3.66E+01"},{"v":-2.1181508e-05,"d":"-2E-05"},{"v":-0.104779165,"d":"-1E-01"},{"v":1396.44198,"d":"1E+03"},{"$nulls":8},{"v":17,"d":"17.0"},{"$f":"((FA43-FA41)/2)+FA41","v":17},17,17,17,{"$f":"((FE43-FE41)/2)+FE41","v":18.2},17,{"$f":"((FG43-FG41)/2)+FG41","v":18.375},17,null,{"v":0,"d":"0.0"},{"v":1.175,"d":"1.18"},1.4700000000000002,{"v":0,"d":"0.00%"},{"$f":"((FN43-FN41)/2)+FN41","v":{"v":727.1343955,"d":"727.1"}},{"$f":"((FO43-FO41)/2)+FO41","v":{"v":1277.268035,"d":"1277.3"}},{"$f":"FN42/FO42","v":{"v":0.5692888067147158,"d":"56.93%"}},{"v":0,"d":"0.00"},{"v":0,"d":"0.00"},{"v":550.1336395000002,"d":"550.13"},{"v":0,"d":"0.00%"},{"$f":"FC42","v":{"v":17,"d":"17.00"}},21.150000000000002,{"$f":"ABS(FV42-FU42)","v":{"v":4.150000000000002,"d":"4.15"}},{"v":23.520000000000003,"d":"23.52"},{"$f":"ABS(FX42-FU42)","v":{"v":6.520000000000003,"d":"6.52"}},{"$f":"IF(FM42<=FP42,FU42,FU42+(FT42*FW42))","v":{"v":17,"d":"17.00"}},{"v":17,"d":"17.00"},null,15.69066559142683,null,{"v":0,"d":"0.0%"},null,{"v":2334.1781978570243,"d":"2334.18"},{"$error":"#DIV/0!"},{"v":1167.0890989285122,"d":"1167.09"},{"v":1167.089098928512,"d":"1167.09"},{"v":7.2478490515896785E-3,"d":"0.01"},{"v":7.2478490515896785E-3,"d":"0.01"},{"v":38.49069218350365,"d":"38.49"},{"$error":"#DIV/0!"},{"$error":"#DIV/0!"},null,{"v":3557.0118570174286,"d":"3557.01"},{"$error":"#DIV/0!"},{"v":1778.5059285087143,"d":"1778.51"},{"v":1778.5059285087143,"d":"1778.51"},{"$error":"#DIV/0!"},{"v":0.011112703645172665,"d":"0.0111"},{"v":0.011112703645172665,"d":"0.0111"},{"$error":"#DIV/0!"},{"v":55.47783951997643,"d":"55.48"},{"$error":"#DIV/0!"},{"$error":"#DIV/0!"},{"v":19.415087041495514,"d":"19.42"},{"$error":"#DIV/0!"},{"v":60.77215315250204,"d":"61"},0,60.77215315250204,{"v":17,"d":"17.0"},17,{"v":60.77215315250204,"d":"61"},1,{"v":60.77215315250204,"d":"61"},{"v":0,"d":"0.0"},{"v":1.175,"d":"1.18"},1.4700000000000002,{"v":0,"d":"0.00%"},{"$f":"((HP43-HP41)/2)+HP41","v":{"v":727.1343955,"d":"727.1"}},{"$f":"((HQ43-HQ41)/2)+HQ41","v":{"v":1277.268035,"d":"1277.3"}},{"$f":"HP42/HQ42","v":{"v":0.5692888067147158,"d":"56.93%"}},{"v":0,"d":"0.00"},{"v":0,"d":"0.00"},{"v":550.1336395000002,"d":"550.13"},{"v":0,"d":"0.00%"},{"v":17,"d":"17.00"},21.150000000000002,{"$f":"ABS(HX42-HW42)","v":{"v":4.150000000000002,"d":"4.15"}},{"v":23.520000000000003,"d":"23.52"},{"$f":"ABS(HZ42-HW42)","v":{"v":6.520000000000003,"d":"6.52"}},{"$f":"IF(HO42<=HR42,HW42,HW42+(HV42*HY42))","v":{"v":17,"d":"17.00"}},{"v":17,"d":"17.00"},null,15.69066559142683,null,{"v":0.06164801323482148,"d":"6.2%"},null,{"v":2334.1781978570243,"d":"2334.18"},{"$error":"#DIV/0!"}]
[null,{"$f":"IF($AL$5=1,$C43/10,IF($AL$5=2,$C43/10,IF($AL$5=3,0.5,IF($AL$5=4,$C43/10,))))","v":{"v":0.6,"d":"60%"}},6,{"v":9594.988586267133,"d":"9595"},825,{"v":6.8429733559153245,"d":"6.8"},{"v":1812.3138199647178,"d":"1812"},{"v":1812.3138199647178,"d":"1812"},{"$f":"IF(Geg_dP<AB43,ROUND(((IF('Briza 22 & 26'!$M$4=\"High Perform. 208/230V (US/EU)\",cal!HK43,H43)/Watts)/((Tr_cool-Tv_cool)*1.163))*FlowH2O,IF(UnitsNo=1,0,IF(UnitsNo=2,2))),\"\")","v":779},{"v":6.154110464529949,"d":"6.2"},{"v":43,"d":"43.0"},{"$f":"IF(Geg_dP<$AB43,IF(CalcNo=\"12\",$ET43,IF(CalcNo=\"22\",$ET43,IF(CalcNo=\"13\",$EU43,IF(CalcNo=\"23\",$EU43,IF(CalcNo=\"11\",$ER43,IF(CalcNo=\"21\",$ER43,IF(CalcNo=\"14\",$ES43,IF(CalcNo=\"24\",$ES43,IF(CalcNo=\"32\",$EX43,IF(CalcNo=\"42\",$EX43,IF(CalcNo=\"33\",$EY43,IF(CalcNo=\"43\",$EY43,IF(CalcNo=\"31\",$EV43,IF(CalcNo=\"41\",$EV43,IF(CalcNo=\"34\",$EW43,IF(CalcNo=\"44\",$EW43,)))))))))))))))),\"\")","v":{"v":51,"d":"51.0"}},{"v":35.66096241004066,"d":"35.7"},{"v":839.852548,"d":"840"},{"v":0.8483359070707069,"d":"0.85"},{"v":53.53491473549,"d":"53.5"},{"v":24.197094901512546,"d":"24.2"},{"v":20.586303703876375,"d":"20.6"},{"v":17.340181998411264,"d":"17.3"},{"v":0.7348813445576046,"d":"73%"},{"v":827.9295578750758,"d":"828"},{"v":0.15285952871354078,"d":"0.15"},{"v":2.1578952451600086,"d":"2.158"},0.993243,1.23546,1.10433,0.993243,58.34,0.993243,1.23546,1.10433,{"v":48,"d":"48.00"},0.993243,1.23546,1.10433,{"v":75,"d":"75.00"},0.993243,1.23546,1.10433,58.34,1.0288573703986699,1.5348139398733884,1.1401126388667442,152.28,0.993243,1.23546,1.10433,{"v":48,"d":"48.00"},0.993243,1.23546,1.10433,{"v":75,"d":"75.00"},0.9933058028578283,1.2349800450330226,1.1045610713258731,58.34,0.9756960835435103,1.0199429606771673,1.0869513520115845,152.28,null,null,{"$f":"IF($BK$17=\"11\",BN43,IF($BK$17=\"21\",BQ43,IF($BK$17=\"12\",BN43,IF($BK$17=\"22\",BQ43,IF($BK$17=\"13\",BN43,IF($BK$17=\"23\",BQ43,IF($BK$17=\"14\",BN43,IF($BK$17=\"24\",BQ43,IF($BK$17=\"31\",BT43,IF($BK$17=\"41\",BW43,IF($BK$17=\"32\",BT43,IF($BK$17=\"42\",BW43,IF($BK$17=\"33\",BT43,IF($BK$17=\"43\",BW43,IF($BK$17=\"34\",BT43,IF($BK$17=\"44\",BW43,))))))))))))))))","v":{"v":-1.29262917E-3,"d":"-1.29E-03"}},{"$f":"IF($BK$17=\"11\",BO43,IF($BK$17=\"21\",BR43,IF($BK$17=\"12\",BO43,IF($BK$17=\"22\",BR43,IF($BK$17=\"13\",BO43,IF($BK$17=\"23\",BR43,IF($BK$17=\"14\",BO43,IF($BK$17=\"24\",BR43,IF($BK$17=\"31\",BU43,IF($BK$17=\"41\",BX43,IF($BK$17=\"32\",BU43,IF($BK$17=\"42\",BX43,IF($BK$17=\"33\",BU43,IF($BK$17=\"43\",BX43,IF($BK$17=\"34\",BU43,IF($BK$17=\"44\",BX43,))))))))))))))))","v":{"v":-0.000357819643,"d":"-3.58E-04"}},null,{"v":-1.29262917E-3,"d":"-1.29E-03"},{"v":-0.000357819643,"d":"-3.58E-04"},null,{"v":-0.000717079886,"d":"-7.17E-04"},{"$f":"BO43","v":{"v":-0.000357819643,"d":"-3.58E-04"}},null,{"v":-0.00083308044,"d":"-8.33E-04"},{"v":-0.000457853351,"d":"-4.58E-04"},null,{"$f":"BQ43","v":{"v":-0.000717079886,"d":"-7.17E-04"}},{"$f":"BU43","v":{"v":-0.000457853351,"d":"-4.58E-04"}},null,{"v":0,"d":"0.00E+00"},{"v":1.4331384e-05,"d":"1.43E-05"},{"v":-2.0459998E-3,"d":"-2.05E-03"},{"v":0.0499635061,"d":"5.00E-02"},{"v":-12.4204786,"d":"-1.24E+01"},{"v":839.852548,"d":"8.40E+02"},{"v":0,"d":"0.00E+00"},{"v":-3.32257927e-08,"d":"-3.32E-08"},{"v":4.55560017E-5,"d":"4.56E-05"},{"v":6.25707911E-3,"d":"6.26E-03"},{"v":17.9555993,"d":"1.80E+01"},{"v":-9.95628585e-05,"d":"-9.96E-05"},{"v":-0.205524983,"d":"-2.06E-01"},{"v":1070.76713,"d":"1.07E+03"},null,{"v":-1.80621664e-05,"d":"-1.81E-05"},{"v":0.00252487818,"d":"2.52E-03"},{"v":-0.123174814,"d":"-1.23E-01"},{"v":-10.6002073,"d":"-1.06E+01"},{"v":619.966449,"d":"6.20E+02"},null,{"v":-9.61446823e-09,"d":"-9.61E-09"},{"v":1.52077752E-5,"d":"1.52E-05"},{"v":0.0103183818,"d":"1.03E-02"},{"v":16.8356072,"d":"1.68E+01"},{"v":-1.82105923E-4,"d":"-1.82E-04"},{"v":0.0123028384,"d":"1.23E-02"},{"v":816.598573,"d":"8.17E+02"},null,{"v":4.51863693e-07,"d":"4.52E-07"},{"v":0.000167227658,"d":"1.67E-04"},{"v":-0.0567494432,"d":"-5.67E-02"},{"v":-9.6531175,"d":"-9.65E+00"},{"v":978.445009,"d":"9.78E+02"},null,{"v":-6.38854367E-9,"d":"-6.39E-09"},{"v":1.1816687e-05,"d":"1.18E-05"},{"v":0.0188631746,"d":"1.89E-02"},{"v":27.2490695,"d":"2.72E+01"},{"v":9.28647293E-5,"d":"9.29E-05"},{"v":-0.239578381,"d":"-2.40E-01"},{"v":1303.35096,"d":"1.30E+03"},null,{"v":1.4331384e-05,"d":"1.43E-05"},{"v":-2.0459998E-3,"d":"-2.05E-03"},{"v":0.0499635061,"d":"5.00E-02"},{"v":-12.4204786,"d":"-1.24E+01"},{"v":839.852548,"d":"8.40E+02"},null,{"v":-3.32257927e-08,"d":"-3.32E-08"},{"v":4.55560017E-5,"d":"4.56E-05"},{"v":6.25707911E-3,"d":"6.26E-03"},{"v":17.9555993,"d":"1.80E+01"},{"v":-9.95628585e-05,"d":"-9.96E-05"},{"v":-0.205524983,"d":"-2.06E-01"},{"v":1070.76713,"d":"1.07E+03"},null,{"v":7.9552602e-07,"d":"7.96E-07"},{"v":-0.000265416451,"d":"-2.65E-04"},{"v":0.00833838521,"d":"8.34E-03"},{"v":-7.63423335,"d":"-7.63E+00"},{"v":1499.58208,"d":"1.50E+03"},null,{"v":-2.41425003e-08,"d":"-2.41E-08"},{"v":6.36123145e-05,"d":"6.36E-05"},{"v":0.0101630131,"d":"1.02E-02"},{"v":49.8580823,"d":"4.99E+01"},{"v":-1.94301253e-05,"d":"-2E-05"},{"v":-0.126780286,"d":"-1E-01"},{"v":1633.66155,"d":"2E+03"},51,null,51,null,{"$f":"EX43","v":53.5},null,53.5,null,17.5,{"$f":"Tavg_cold","v":17},17.5,17.5,17.5,18.2,17.5,{"$f":"FH43*1.05","v":18.375},17.5,null,0.5,{"v":1.175,"d":"1.18"},1.4700000000000002,{"v":0.5600577382199713,"d":"56.01%"},{"$f":"DU43","v":{"v":839.852548,"d":"839.9"}},{"$f":"EI43","v":{"v":1499.58208,"d":"1499.6"}},{"$f":"FN43/FO43","v":{"v":0.5600577382199713,"d":"56.01%"}},{"v":839.852548,"d":"839.85"},{"v":0,"d":"0.00"},{"v":659.729532,"d":"659.73"},{"v":0,"d":"0.00%"},{"v":17.5,"d":"17.50"},21.150000000000002,{"v":3.650000000000002,"d":"3.65"},{"v":23.520000000000003,"d":"23.52"},{"v":6.020000000000003,"d":"6.02"},{"v":17.5,"d":"17.50"},{"v":17.5,"d":"17.50"},null,15.69066559142683,null,{"v":0,"d":"0.0%"},null,{"v":2334.1781978570243,"d":"2334.18"},{"v":14613.120122865594,"d":"14613.12"},{"v":1167.0890989285122,"d":"1167.09"},{"v":1167.089098928512,"d":"1167.09"},{"v":7.2478490515896785E-3,"d":"0.01"},{"v":7.2478490515896785E-3,"d":"0.01"},{"v":38.49069218350365,"d":"38.49"},{"v":72.64779621259771,"d":"72.65"},{"v":0.07986583899370896,"d":"8%"},null,{"v":3557.0118570174286,"d":"3557.01"},{"v":2420.126652663046,"d":"2420.13"},{"v":1778.5059285087143,"d":"1778.51"},{"v":1778.5059285087143,"d":"1778.51"},{"v":1778.505928508714,"d":"1778.51"},{"v":0.011112703645172665,"d":"0.0111"},{"v":0.011112703645172665,"d":"0.0111"},{"v":0.011112703645172665,"d":"0.01"},{"v":55.47783951997643,"d":"55.48"},{"v":55.47783951997643,"d":"55.48"},{"v":48.89879328576142,"d":"48.90"},{"v":19.415087041495514,"d":"19.42"},{"v":19.415087041495514,"d":"19.42"},{"v":1812.3138199647178,"d":"1812"},839.852548,1812.3138199647178,17.5,17.5,{"v":1812.3138199647178,"d":"1812"},1,{"v":1812.3138199647178,"d":"1812"},0.5,{"v":1.175,"d":"1.18"},1.4700000000000002,{"v":0.5600577382199713,"d":"56.01%"},{"v":839.852548,"d":"839.9"},{"v":1499.58208,"d":"1499.6"},{"$f":"HP43/HQ43","v":{"v":0.5600577382199713,"d":"56.01%"}},{"v":839.852548,"d":"839.85"},{"v":0,"d":"0.00"},{"v":659.729532,"d":"659.73"},{"v":0,"d":"0.00%"},{"v":17.5,"d":"17.50"},21.150000000000002,{"v":3.650000000000002,"d":"3.65"},{"v":23.520000000000003,"d":"23.52"},{"v":6.020000000000003,"d":"6.02"},{"v":17.5,"d":"17.50"},{"v":17.5,"d":"17.50"},null,15.69066559142683,null,{"v":0.06164801323482148,"d":"6.2%"},null,{"v":2334.1781978570243,"d":"2334.18"},{"v":14613.120122865594,"d":"14613.12"}]
[null,{"$f":"IF($AL$5=1,$C44/10,IF($AL$5=2,$C44/10,IF($AL$5=3,0.75,IF($AL$5=4,$C44/10,))))","v":{"v":0.7,"d":"70%"}},7,{"v":150.1817637989142,"d":"150"},13,{"v":0.003175074008007952,"d":"0.0"},{"v":60.77215315250204,"d":"61"},{"v":60.77215315250204,"d":"61"},{"$f":"IF(Geg_dP<AB44,ROUND(((IF('Briza 22 & 26'!$M$4=\"High Perform. 208/230V (US/EU)\",cal!HK44,H44)/Watts)/((Tr_cool-Tv_cool)*1.163))*FlowH2O,IF(UnitsNo=1,0,IF(UnitsNo=2,2))),\"\")","v":26},{"v":0.01144107112666796,"d":"0.0"},{"v":0,"d":"0.0"},{"$f":"IF(Geg_dP<$AB44,0,\"\")","v":{"v":0,"d":"0.0"}},{"v":0,"d":"0.0"},0,{"v":0,"d":"0.00"},{"$error":"#DIV/0!"},{"$error":"#DIV/0!"},{"$error":"#DIV/0!"},{"$error":"#DIV/0!"},{"$error":"#DIV/0!"},0,{"$error":"#DIV/0!"},{"$error":"#DIV/0!"},0.993243,1.23546,1.10433,0.993243,77.16,0.993243,1.23546,1.10433,{"$f":"AF43+((AF45-AF43)/2)","v":{"v":64.5,"d":"64.50"}},0.993243,1.23546,1.10433,{"$f":"AJ43+((AJ45-AJ43)/2)","v":{"v":99.5,"d":"99.50"}},0.993243,1.23546,1.10433,{"$f":"AN43+((AN45-AN43)/2)","v":77.16},1.0288573703986699,1.5348139398733884,1.1401126388667442,{"v":177,"d":"177.00"},0.993243,1.23546,1.10433,{"v":64.5,"d":"64.50"},0.993243,1.23546,1.10433,{"v":99.5,"d":"99.50"},0.9933058028578283,1.2349800450330226,1.1045610713258731,77.16,0.9756960835435103,1.0199429606771673,1.0869513520115845,{"v":177,"d":"177.00"},{"$nulls":17},{"v":0,"d":"0.00E+00"},{"v":0,"d":"0.00E+00"},{"v":0,"d":"0.00E+00"},{"v":0,"d":"0.00E+00"},{"v":0,"d":"0.00E+00"},{"v":0,"d":"0.00E+00"},{"v":0,"d":"0.00E+00"},{"v":0,"d":"0.00E+00"},{"v":0,"d":"0.00E+00"},{"v":0,"d":"0.00E+00"},{"v":0,"d":"0.00E+00"},{"v":0,"d":"0.00E+00"},{"v":0,"d":"0.00E+00"},{"v":0,"d":"0.00E+00"},{"$nulls":43},{"v":-2.73555321E-6,"d":"-2.74E-06"},{"v":0.00071732745,"d":"7.17E-04"},{"v":-0.0649101066,"d":"-6.49E-02"},{"v":-4.6986485,"d":"-4.70E+00"},{"v":1592.45937,"d":"1.59E+03"},null,{"v":-4.65236291e-08,"d":"-4.65E-08"},{"v":1.07284522E-4,"d":"1.07E-04"},{"v":0.00362918888,"d":"3.63E-03"},{"v":63.600097,"d":"6.36E+01"},{"v":-1.36411791E-4,"d":"-1E-04"},{"v":0.0486644725,"d":"5E-02"},{"v":1761.22088,"d":"2E+03"},{"$nulls":8},17,{"$f":"((FA45-FA43)/2)+FA43","v":17},17,17,17,{"$f":"((FE45-FE43)/2)+FE43","v":18.2},17,{"$f":"((FG45-FG43)/2)+FG43","v":18.375},17,null,{"v":0,"d":"0.0"},{"v":1.175,"d":"1.18"},1.4700000000000002,{"v":0,"d":"0.00%"},{"$f":"((FN45-FN43)/2)+FN43","v":{"v":955.7496739999999,"d":"955.7"}},{"$f":"((FO45-FO43)/2)+FO43","v":{"v":1587.913015,"d":"1587.9"}},{"$f":"FN44/FO44","v":{"v":0.6018904467509512,"d":"60.19%"}},{"v":0,"d":"0.00"},{"v":0,"d":"0.00"},{"v":632.1633410000002,"d":"632.16"},{"v":0,"d":"0.00%"},{"v":17,"d":"17.00"},21.150000000000002,{"v":4.150000000000002,"d":"4.15"},{"v":23.520000000000003,"d":"23.52"},{"v":6.520000000000003,"d":"6.52"},{"v":17,"d":"17.00"},{"v":17,"d":"17.00"},null,15.69066559142683,null,{"v":0,"d":"0.0%"},null,{"v":2334.1781978570243,"d":"2334.18"},{"$error":"#DIV/0!"},{"v":1167.0890989285122,"d":"1167.09"},{"v":1167.089098928512,"d":"1167.09"},{"v":7.2478490515896785E-3,"d":"0.01"},{"v":7.2478490515896785E-3,"d":"0.01"},{"v":38.49069218350365,"d":"38.49"},{"$error":"#DIV/0!"},{"$error":"#DIV/0!"},null,{"v":3557.0118570174286,"d":"3557.01"},{"$error":"#DIV/0!"},{"v":1778.5059285087143,"d":"1778.51"},{"v":1778.5059285087143,"d":"1778.51"},{"$error":"#DIV/0!"},{"v":0.011112703645172665,"d":"0.0111"},{"v":0.011112703645172665,"d":"0.0111"},{"$error":"#DIV/0!"},{"v":55.47783951997643,"d":"55.48"},{"$error":"#DIV/0!"},{"$error":"#DIV/0!"},{"v":19.415087041495514,"d":"19.42"},{"$error":"#DIV/0!"},{"v":60.77215315250204,"d":"61"},0,60.77215315250204,{"v":17,"d":"17.0"},17,{"v":60.77215315250204,"d":"61"},1,{"v":60.77215315250204,"d":"61"},{"v":0,"d":"0.0"},{"v":1.175,"d":"1.18"},1.4700000000000002,{"v":0,"d":"0.00%"},{"$f":"((HP45-HP43)/2)+HP43","v":{"v":955.7496739999999,"d":"955.7"}},{"v":1592.45937,"d":"1592.5"},{"$f":"HP44/HQ44","v":{"v":0.600172093558657,"d":"60.02%"}},{"v":0,"d":"0.00"},{"v":0,"d":"0.00"},{"v":636.7096960000001,"d":"636.71"},{"v":0,"d":"0.00%"},{"v":17,"d":"17.00"},21.150000000000002,{"v":4.150000000000002,"d":"4.15"},{"v":23.520000000000003,"d":"23.52"},{"v":6.520000000000003,"d":"6.52"},{"v":17,"d":"17.00"},{"v":17,"d":"17.00"},null,15.69066559142683,null,{"v":0.06164801323482148,"d":"6.2%"},null,{"v":2334.1781978570243,"d":"2334.18"},{"$error":"#DIV/0!"}]
[null,{"$f":"IF($AL$5=1,$C45/10,IF($AL$5=2,$C45/10,IF($AL$5=3,1,IF($AL$5=4,$C45/10,))))","v":{"v":0.8,"d":"80%"}},8,{"v":11633.709333979707,"d":"11634"},1000,{"v":9.766783812364137,"d":"9.8"},{"v":2251.0150320970106,"d":"2251"},{"v":2251.0150320970106,"d":"2251"},{"$f":"IF(Geg_dP<AB45,ROUND(((IF('Briza 22 & 26'!$M$4=\"High Perform. 208/230V (US/EU)\",cal!HK45,H45)/Watts)/((Tr_cool-Tv_cool)*1.163))*FlowH2O,IF(UnitsNo=1,0,IF(UnitsNo=2,2))),\"\")","v":968},{"v":9.196657767510153,"d":"9.2"},{"v":49,"d":"49.0"},{"$f":"IF(Geg_dP<$AB45,IF(CalcNo=\"12\",$ET45,IF(CalcNo=\"22\",$ET45,IF(CalcNo=\"13\",$EU45,IF(CalcNo=\"23\",$EU45,IF(CalcNo=\"11\",$ER45,IF(CalcNo=\"21\",$ER45,IF(CalcNo=\"14\",$ES45,IF(CalcNo=\"24\",$ES45,IF(CalcNo=\"32\",$EX45,IF(CalcNo=\"42\",$EX45,IF(CalcNo=\"33\",$EY45,IF(CalcNo=\"43\",$EY45,IF(CalcNo=\"31\",$EV45,IF(CalcNo=\"41\",$EV45,IF(CalcNo=\"34\",$EW45,IF(CalcNo=\"44\",$EW45,)))))))))))))))),\"\")","v":{"v":57,"d":"57.0"}},{"v":62.847337908541164,"d":"62.8"},{"v":1071.6468,"d":"1072"},{"v":1.0824715151515152,"d":"1.08"},{"v":51.86561652728416,"d":"51.9"},{"v":23.75860234702287,"d":"23.8"},{"v":20.756835807330418,"d":"20.8"},{"v":17.397403195646138,"d":"17.4"},{"v":0.7272151413719579,"d":"73%"},{"v":989.6661210384195,"d":"990"},{"v":0.2111240536254559,"d":"0.21"},{"v":2.10051952947278,"d":"2.101"},0.993243,1.23546,1.10433,0.993243,95.98,0.993243,1.23546,1.10433,{"v":81,"d":"81.00"},0.993243,1.23546,1.10433,{"v":124,"d":"124.00"},0.993243,1.23546,1.10433,95.98,1.0288573703986699,1.5348139398733884,1.1401126388667442,214.28,0.993243,1.23546,1.10433,{"v":81,"d":"81.00"},0.993243,1.23546,1.10433,{"v":124,"d":"124.00"},0.9933058028578283,1.2349800450330226,1.1045610713258731,95.98,0.9756960835435103,1.0199429606771673,1.0869513520115845,214.28,null,null,{"$f":"IF($BK$17=\"11\",BN45,IF($BK$17=\"21\",BQ45,IF($BK$17=\"12\",BN45,IF($BK$17=\"22\",BQ45,IF($BK$17=\"13\",BN45,IF($BK$17=\"23\",BQ45,IF($BK$17=\"14\",BN45,IF($BK$17=\"24\",BQ45,IF($BK$17=\"31\",BT45,IF($BK$17=\"41\",BW45,IF($BK$17=\"32\",BT45,IF($BK$17=\"42\",BW45,IF($BK$17=\"33\",BT45,IF($BK$17=\"43\",BW45,IF($BK$17=\"34\",BT45,IF($BK$17=\"44\",BW45,))))))))))))))))","v":{"v":7.44299974,"d":"7.44E+00"}},{"v":4.44618655,"d":"4.45E+00"},{"v":2.76485e-05,"d":"2.76E-05"},{"v":7.44299974,"d":"7.44E+00"},{"v":4.44618655,"d":"4.45E+00"},{"v":2.76485e-05,"d":"2.76E-05"},{"v":2.90603525,"d":"2.91E+00"},{"$f":"BO45","v":{"v":4.44618655,"d":"4.45E+00"}},{"$f":"+BP45","v":{"v":2.76485e-05,"d":"2.76E-05"}},{"v":8.09348721,"d":"8.09E+00"},{"v":5.75895288,"d":"5.76E+00"},{"v":2.31369945e-05,"d":"2.31E-05"},{"$f":"BQ45","v":{"v":2.90603525,"d":"2.91E+00"}},{"$f":"BU45","v":{"v":5.75895288,"d":"5.76E+00"}},{"$f":"+BV45","v":{"v":2.31369945e-05,"d":"2.31E-05"}},{"v":0,"d":"0.00E+00"},{"v":1.82284485E-6,"d":"1.82E-06"},{"v":-0.000492484591,"d":"-4.92E-04"},{"v":0.0191241067,"d":"1.91E-02"},{"v":-9.80045097,"d":"-9.80E+00"},{"v":1071.6468,"d":"1.07E+03"},{"v":0,"d":"0.00E+00"},{"v":-2.62430427e-08,"d":"-2.62E-08"},{"v":4.60135908e-05,"d":"4.60E-05"},{"v":0.0116905212,"d":"1.17E-02"},{"v":29.7735064,"d":"2.98E+01"},{"v":-8.85022581e-05,"d":"-8.85E-05"},{"v":-0.234547771,"d":"-2.35E-01"},{"v":1342.65686,"d":"1.34E+03"},null,{"v":1.32555195E-5,"d":"1.33E-05"},{"v":-0.00202280057,"d":"-2.02E-03"},{"v":0.0876597969,"d":"8.77E-02"},{"v":-11.5752397,"d":"-1.16E+01"},{"v":868.3853,"d":"8.68E+02"},null,{"v":-1.73502826e-08,"d":"-1.74E-08"},{"v":3.07575653e-05,"d":"3.08E-05"},{"v":0.0116161229,"d":"1.16E-02"},{"v":28.7808782,"d":"2.88E+01"},{"v":-1.61340502E-4,"d":"-1.61E-04"},{"v":0.00666754608,"d":"6.67E-03"},{"v":1060.99878,"d":"1.06E+03"},null,{"v":-6.64342441e-07,"d":"-6.64E-07"},{"v":0.000235662601,"d":"2.36E-04"},{"v":-0.0418729571,"d":"-4.19E-02"},{"v":-7.28165848,"d":"-7.28E+00"},{"v":1274.56628,"d":"1.27E+03"},null,{"v":-8.57437566e-09,"d":"-8.57E-09"},{"v":2.00880197e-05,"d":"2.01E-05"},{"v":0.0256526754,"d":"2.57E-02"},{"v":49.8482277,"d":"4.98E+01"},{"v":7.19528822e-05,"d":"7.20E-05"},{"v":-0.272119015,"d":"-2.72E-01"},{"v":1663.05535,"d":"1.66E+03"},null,{"v":1.82284485E-6,"d":"1.82E-06"},{"v":-0.000492484591,"d":"-4.92E-04"},{"v":0.0191241067,"d":"1.91E-02"},{"v":-9.80045097,"d":"-9.80E+00"},{"v":1071.6468,"d":"1.07E+03"},null,{"v":-2.62430427e-08,"d":"-2.62E-08"},{"v":4.60135908e-05,"d":"4.60E-05"},{"v":0.0116905212,"d":"1.17E-02"},{"v":29.7735064,"d":"2.98E+01"},{"$f":" -0.0000885022581","v":{"v":-8.85022581e-05,"d":"-8.85E-05"}},{"v":-0.234547771,"d":"-2.35E-01"},{"v":1342.65686,"d":"1.34E+03"},{"v":4.28774956E-8,"d":"4.29E-08"},{"v":-2.23456933e-05,"d":"-2.23E-05"},{"v":0.00382786707,"d":"3.83E-03"},{"v":-0.255133766,"d":"-2.55E-01"},{"v":0.589142168,"d":"5.89E-01"},{"v":1676.24395,"d":"1.68E+03"},{"$f":" 0.0000000000349978885","v":{"v":3.49978885e-11,"d":"3.50E-11"}},{"v":-1.8439779e-07,"d":"-1.84E-07"},{"v":0.000274761761,"d":"2.75E-04"},{"v":-0.0499680459,"d":"-5.00E-02"},{"v":81.7597201,"d":"8.18E+01"},{"v":-0.000253393457,"d":"-3E-04"},{"v":0.224109231,"d":"2E-01"},{"v":1888.78022,"d":"2E+03"},57,null,57,null,{"$f":"EX45","v":58.5},null,58.5,null,17.5,{"$f":"Tavg_cold","v":17},17.5,17.5,17.5,18.2,17.5,{"$f":"FH45*1.05","v":18.375},17.5,null,0.5,{"v":1.175,"d":"1.18"},1.4700000000000002,{"v":0.6393143432374506,"d":"63.93%"},{"$f":"DU45","v":{"v":1071.6468,"d":"1071.6"}},{"$f":"EI45","v":{"v":1676.24395,"d":"1676.2"}},{"$f":"FP46","v":{"v":0.7314426876827803,"d":"73.14%"}},{"v":1071.6468,"d":"1071.65"},{"v":0,"d":"0.00"},{"v":450.16757,"d":"450.17"},{"v":0,"d":"0.00%"},{"v":17.5,"d":"17.50"},21.150000000000002,{"v":3.650000000000002,"d":"3.65"},{"v":23.520000000000003,"d":"23.52"},{"v":6.020000000000003,"d":"6.02"},{"v":17.5,"d":"17.50"},{"v":17.5,"d":"17.50"},null,15.69066559142683,null,{"v":0,"d":"0.0%"},null,{"v":2334.1781978570243,"d":"2334.18"},{"v":13472.653603744153,"d":"13472.65"},{"v":1167.0890989285122,"d":"1167.09"},{"v":1167.089098928512,"d":"1167.09"},{"v":7.2478490515896785E-3,"d":"0.01"},{"v":7.2478490515896785E-3,"d":"0.01"},{"v":38.49069218350365,"d":"38.49"},{"v":70.9475267172671,"d":"70.95"},{"v":0.0866265201536963,"d":"9%"},null,{"v":3557.0118570174286,"d":"3557.01"},{"v":2445.639298919712,"d":"2445.64"},{"v":1778.5059285087143,"d":"1778.51"},{"v":1778.5059285087143,"d":"1778.51"},{"v":1778.5059285087143,"d":"1778.51"},{"v":0.011112703645172665,"d":"0.0111"},{"v":0.011112703645172665,"d":"0.0111"},{"v":0.011112703645172665,"d":"0.01"},{"v":55.47783951997643,"d":"55.48"},{"v":55.47783951997643,"d":"55.48"},{"v":49.07372183573349,"d":"49.07"},{"v":19.415087041495514,"d":"19.42"},{"v":19.415087041495514,"d":"19.42"},{"v":2251.0150320970106,"d":"2251"},1071.6468,2251.0150320970106,17.5,17.5,{"v":2251.0150320970106,"d":"2251"},1,{"v":2251.0150320970106,"d":"2251"},0.5,{"v":1.175,"d":"1.18"},1.4700000000000002,{"v":0.6393143432374506,"d":"63.93%"},{"v":1071.6468,"d":"1071.6"},{"v":1676.24395,"d":"1676.2"},{"$f":"HR46","v":{"v":0.7314426876827803,"d":"73.14%"}},{"v":1071.6468,"d":"1071.65"},{"v":0,"d":"0.00"},{"v":450.16757,"d":"450.17"},{"v":0,"d":"0.00%"},{"v":17.5,"d":"17.50"},21.150000000000002,{"v":3.650000000000002,"d":"3.65"},{"v":23.520000000000003,"d":"23.52"},{"v":6.020000000000003,"d":"6.02"},{"v":17.5,"d":"17.50"},{"v":17.5,"d":"17.50"},null,15.69066559142683,null,{"v":0.06164801323482148,"d":"6.2%"},null,{"v":2334.1781978570243,"d":"2334.18"},{"v":13472.653603744153,"d":"13472.65"}]
[null,{"v":1,"d":"100%"},10,{"v":12855.596219027644,"d":"12856"},1105,{"v":11.747461684507567,"d":"11.7"},{"v":2532.557050177167,"d":"2533"},{"v":2532.557050177167,"d":"2533"},{"$f":"IF(Geg_dP<AB46,ROUND(((IF('Briza 22 & 26'!$M$4=\"High Perform. 208/230V (US/EU)\",cal!HK46,H46)/Watts)/((Tr_cool-Tv_cool)*1.163))*FlowH2O,IF(UnitsNo=1,0,IF(UnitsNo=2,2))),\"\")","v":1089},{"v":11.434823207772123,"d":"11.4"},52.5,{"$f":"IF(Geg_dP<$AB46,IF(CalcNo=\"12\",$ET46,IF(CalcNo=\"22\",$ET46,IF(CalcNo=\"13\",$EU46,IF(CalcNo=\"23\",$EU46,IF(CalcNo=\"11\",$ER46,IF(CalcNo=\"21\",$ER46,IF(CalcNo=\"14\",$ES46,IF(CalcNo=\"24\",$ES46,IF(CalcNo=\"32\",$EX46,IF(CalcNo=\"42\",$EX46,IF(CalcNo=\"33\",$EY46,IF(CalcNo=\"43\",$EY46,IF(CalcNo=\"31\",$EV46,IF(CalcNo=\"41\",$EV46,IF(CalcNo=\"34\",$EW46,IF(CalcNo=\"44\",$EW46,)))))))))))))))),\"\")","v":60.5},{"$f":"IF(Geg_dP<$AB46,($CF46*(($N46*CFMs)^4))+($CG46*(($N46*CFMs)^3))+($CH46*(($N46*CFMs)^2))+($CI46*($N46*CFMs))+$CJ46,\"\")","v":{"v":88.46964652577635,"d":"88.5"}},{"v":1226.07638,"d":"1226"},{"v":1.2384609898989898,"d":"1.24"},{"v":50.77729770401351,"d":"50.8"},{"v":23.468951675913807,"d":"23.5"},{"v":20.8606874382416,"d":"20.9"},{"v":17.432192477371743,"d":"17.4"},{"v":0.7225906636735239,"d":"72%"},{"v":1089.5664374920361,"d":"1090"},{"v":0.2597641816513869,"d":"0.26"},{"v":2.0655785328620127,"d":"2.066"},0.993243,1.23546,1.10433,0.993243,126.06,0.993243,1.23546,1.10433,{"v":107,"d":"107.00"},0.993243,1.23546,1.10433,{"v":153,"d":"153.00"},0.993243,1.23546,1.10433,126.06,1.0288573703986699,1.5348139398733884,1.1401126388667442,{"$f":"AR45","v":214.28},0.993243,1.23546,1.10433,{"v":107,"d":"107.00"},0.993243,1.23546,1.10433,{"v":153,"d":"153.00"},0.9933058028578283,1.2349800450330226,1.1045610713258731,126.06,0.9756960835435103,1.0199429606771673,1.0869513520115845,214.28,null,null,{"v":84.8995644,"d":"8.49E+01"},{"v":120.804193,"d":"1.21E+02"},{"v":1.84936,"d":"1.85E+00"},{"v":84.8995644,"d":"8.49E+01"},{"v":120.804193,"d":"1.21E+02"},{"v":1.84936,"d":"1.85E+00"},{"v":701.364403,"d":"7.01E+02"},{"$f":"BO46","v":{"v":120.804193,"d":"1.21E+02"}},{"$f":"+BP46","v":{"v":1.84936,"d":"1.85E+00"}},{"v":139.9444,"d":"1.40E+02"},{"v":91.2780902,"d":"9.13E+01"},{"v":1.88247875,"d":"1.88E+00"},{"$f":"BQ46","v":{"v":701.364403,"d":"7.01E+02"}},{"$f":"BU46","v":{"v":91.2780902,"d":"9.13E+01"}},{"$f":"+BV46","v":{"v":1.88247875,"d":"1.88E+00"}},{"v":0,"d":"0.00E+00"},{"v":-6.25686601e-07,"d":"-6.26E-07"},{"v":1.3273657E-4,"d":"1.33E-04"},{"v":-0.0203921958,"d":"-2.04E-02"},{"v":-7.82847202,"d":"-7.83E+00"},{"v":1226.07638,"d":"1.23E+03"},{"v":0,"d":"0.00E+00"},{"v":-1.1536069E-7,"d":"-1.15E-07"},{"v":0.000134551716,"d":"1.35E-04"},{"v":0.0286507081,"d":"2.87E-02"},{"v":41.0775582,"d":"4.11E+01"},{"v":-8.66752851e-05,"d":"-8.67E-05"},{"v":-0.243230506,"d":"-2.43E-01"},{"v":1518.08139,"d":"1.52E+03"},null,{"v":3.1363692e-06,"d":"3.14E-06"},{"v":-0.000556144885,"d":"-5.56E-04"},{"v":0.0193920682,"d":"1.94E-02"},{"v":-9.03941284,"d":"-9.04E+00"},{"v":1023.41928,"d":"1.02E+03"},null,{"v":-1.078692E-7,"d":"-1.08E-07"},{"v":0.00012776729,"d":"1.28E-04"},{"v":0.0178721212,"d":"1.79E-02"},{"v":37.8755182,"d":"3.79E+01"},{"v":-0.000132042639,"d":"-1.32E-04"},{"v":-0.0284881463,"d":"-2.85E-02"},{"v":1249.43403,"d":"1.25E+03"},null,{"v":-3.4852144e-06,"d":"-3.49E-06"},{"v":0.000863443813,"d":"8.63E-04"},{"v":-0.0767409023,"d":"-7.67E-02"},{"v":-5.51975488,"d":"-5.52E+00"},{"v":1489.11507,"d":"1.49E+03"},null,{"v":8.04105015e-08,"d":"8.04E-08"},{"v":-1.51368748E-4,"d":"-1.51E-04"},{"v":0.175379436,"d":"1.75E-01"},{"v":55.4350999,"d":"5.54E+01"},{"v":-4.51481572e-05,"d":"-4.51E-05"},{"v":-0.0719063053,"d":"-7.19E-02"},{"v":1830.71179,"d":"1.83E+03"},null,{"v":-6.25686601e-07,"d":"-6.26E-07"},{"v":1.3273657E-4,"d":"1.33E-04"},{"v":-0.0203921958,"d":"-2.04E-02"},{"v":-7.82847202,"d":"-7.83E+00"},{"v":1226.07638,"d":"1.23E+03"},null,{"v":-1.1536069E-7,"d":"-1.15E-07"},{"v":0.000134551716,"d":"1.35E-04"},{"v":0.0286507081,"d":"2.87E-02"},{"v":41.0775582,"d":"4.11E+01"},{"v":-8.66752851e-05,"d":"-8.67E-05"},{"v":-0.243230506,"d":"-2.43E-01"},{"v":1518.08139,"d":"1.52E+03"},{"$f":"ED45","v":{"v":4.28774956E-8,"d":"4.29E-08"}},{"v":-2.23456933e-05,"d":"-2.23E-05"},{"v":0.00382786707,"d":"3.83E-03"},{"v":-0.255133766,"d":"-2.55E-01"},{"v":0.589142168,"d":"5.89E-01"},{"v":1676.24395,"d":"1.68E+03"},{"$f":"EJ45","v":{"v":3.49978885e-11,"d":"3.50E-11"}},{"v":-1.8439779e-07,"d":"-1.84E-07"},{"v":0.000274761761,"d":"2.75E-04"},{"v":-0.0499680459,"d":"-5.00E-02"},{"v":81.7597201,"d":"8.18E+01"},{"v":-0.000253393457,"d":"-3E-04"},{"v":0.224109231,"d":"2E-01"},{"v":1888.78022,"d":"2E+03"},60.5,null,60.5,null,{"$f":"EX46","v":61.5},null,61.5,null,17.5,{"$f":"Tavg_cold","v":17},17.5,17.5,17.5,18.2,17.5,{"$f":"FH46*1.05","v":18.375},17.5,null,0.5,{"v":1.175,"d":"1.18"},1.4700000000000002,{"v":0.7314426876827803,"d":"73.14%"},{"$f":"DU46","v":{"v":1226.07638,"d":"1226.1"}},{"$f":"EI46","v":{"v":1676.24395,"d":"1676.2"}},{"$f":"FN46/FO46","v":{"v":0.7314426876827803,"d":"73.14%"}},{"v":1226.07638,"d":"1226.08"},{"v":0,"d":"0.00"},{"v":450.16757,"d":"450.17"},{"v":0,"d":"0.00%"},{"v":17.5,"d":"17.50"},21.150000000000002,{"v":3.650000000000002,"d":"3.65"},{"v":23.520000000000003,"d":"23.52"},{"v":6.020000000000003,"d":"6.02"},{"v":17.5,"d":"17.50"},{"v":17.5,"d":"17.50"},null,15.69066559142683,null,{"v":0,"d":"0.0%"},null,{"v":2334.1781978570243,"d":"2334.18"},{"v":12771.02035942329,"d":"12771.02"},{"v":1167.0890989285122,"d":"1167.09"},{"v":1167.089098928512,"d":"1167.09"},{"v":7.2478490515896785E-3,"d":"0.01"},{"v":7.2478490515896785E-3,"d":"0.01"},{"v":38.49069218350365,"d":"38.49"},{"v":69.83901579494959,"d":"69.84"},{"v":0.09138573630628954,"d":"9%"},null,{"v":3557.0118570174286,"d":"3557.01"},{"v":2461.291043351021,"d":"2461.29"},{"v":1778.5059285087143,"d":"1778.51"},{"v":1778.5059285087143,"d":"1778.51"},{"v":1778.5059285087143,"d":"1778.51"},{"v":0.011112703645172665,"d":"0.0111"},{"v":0.011112703645172665,"d":"0.0111"},{"v":0.011112703645172665,"d":"0.01"},{"v":55.47783951997643,"d":"55.48"},{"v":55.47783951997643,"d":"55.48"},{"v":49.18025084018233,"d":"49.18"},{"v":19.415087041495514,"d":"19.42"},{"v":19.415087041495514,"d":"19.42"},{"v":2532.557050177167,"d":"2533"},1226.07638,2532.557050177167,17.5,17.5,{"v":2532.557050177167,"d":"2533"},1,{"v":2532.557050177167,"d":"2533"},0.5,{"v":1.175,"d":"1.18"},1.4700000000000002,{"v":0.7314426876827803,"d":"73.14%"},{"v":1226.07638,"d":"1226.1"},{"v":1676.24395,"d":"1676.2"},{"$f":"HP46/HQ46","v":{"v":0.7314426876827803,"d":"73.14%"}},{"v":1226.07638,"d":"1226.08"},{"v":0,"d":"0.00"},{"v":450.16757,"d":"450.17"},{"v":0,"d":"0.00%"},{"v":17.5,"d":"17.50"},21.150000000000002,{"v":3.650000000000002,"d":"3.65"},{"v":23.520000000000003,"d":"23.52"},{"v":6.020000000000003,"d":"6.02"},{"v":17.5,"d":"17.50"},{"v":17.5,"d":"17.50"},null,15.69066559142683,null,{"v":0.06164801323482148,"d":"6.2%"},null,{"v":2334.1781978570243,"d":"2334.18"},{"v":12771.02035942329,"d":"12771.02"}]
[null,{"$f":"IF(LangNo=1,NL!A47,IF(LangNo=2,EN!A47,IF(LangNo=3,DE!A47,IF(LangNo=4,FR!A47,IF(LangNo=5,NR!A47,IF(LangNo=6,SP!A47,IF(LangNo=7,SW!A47,IF(LangNo=8,TS!A47,IF(LangNo=9,ExtraTaal1!A47,IF(LangNo=10,ExtraTaal2!A47,IF(LangNo=11,ExtraTaal3!A47,)))))))))))","v":"Briza 22 (230V) height 54,5 cm, width 22 cm, length 155 cm (Type 08)"},{"$nulls":24},0,"m³/h","n-value","n-value","n-value","m³/h","n-value","n-value","n-value","m³/h","n-value","n-value","n-value","m³/h","n-value","n-value","n-value","m³/h","n-value","n-value","n-value","m³/h","n-value","n-value","n-value","m³/h","n-value","n-value","n-value","m³/h","n-value","n-value","n-value","m³/h",null,{"$f":"IF($BK$17=\"11\",BO47,IF($BK$17=\"21\",BR47,IF($BK$17=\"12\",BO47,IF($BK$17=\"22\",BR47,IF($BK$17=\"13\",BO47,IF($BK$17=\"23\",BR47,IF($BK$17=\"14\",BO47,IF($BK$17=\"24\",BR47,IF($BK$17=\"31\",BU47,IF($BK$17=\"41\",BX47,IF($BK$17=\"32\",BU47,IF($BK$17=\"42\",BX47,IF($BK$17=\"33\",BU47,IF($BK$17=\"43\",BX47,IF($BK$17=\"34\",BU47,IF($BK$17=\"44\",BX47,))))))))))))))))","v":22},{"$f":"(BN47+IF(CaseNo=1,0,IF(CaseNo=2,$BN$2,)))*MilInch","v":54.5},{"$f":"(BJ47+IF(CaseNo=1,0,IF(CaseNo=2,$BN$3,)))*MilInch","v":22},{"$f":"(BP47+IF(CaseNo=1,0,IF(CaseNo=2,$BN$4,)))*MilInch","v":125},54.5,22,125,54.5,22,125,54.5,26,125,54.5,26,125,{"$f":"CF47","v":"T08"},{"$nulls":5},"T08",{"$nulls":7},{"$f":"CF47","v":"T08"},{"$nulls":13},{"$f":"CF47","v":"T08"},{"$nulls":13},{"$f":"CF47","v":"T08"},{"$nulls":13},{"$f":"CF47","v":"T08"},{"$nulls":13},"T08",{"$nulls":8},{"$f":"ER47","v":"T08"},{"$nulls":54},0,{"$error":"#VALUE!"},{"$f":"IF(Geg_dP<$AB47,((($BL$18*($HE47/Cubics)^4+$BL$19*($HE47/Cubics)^3+$BL$20*($HE47/Cubics)^2+$BL$21*($HE47/Cubics)^1+$BL$22)*((CF_Regime_Cool_noExp)^$Y47)))*CF_Addit*Watts*CF_Altit,Lim_dP)","v":{"$error":"#VALUE!"}},{"$error":"#VALUE!"},{"$error":"#VALUE!"},{"$error":"#VALUE!"},{"$error":"#VALUE!"},{"$error":"#VALUE!"},"T08"]
[null,{"$f":"IF($AL$5=1,$C48/10,IF($AL$5=2,$C48/10,IF($AL$5=3,0,IF($AL$5=4,$C48/10,))))","v":{"v":0.2,"d":"20%"}},2,{"$f":"IF(Geg_dP<AB48,(($BK$48*($N48/Cubics)^4+$BK$49*($N48/Cubics)^3+$BK$51*($N48/Cubics)^2+$BK$53*($N48/Cubics)^1+$BK$54)*(CF_Regime_Heat_noExp^$AA48))*CF_Addit*Watts*CF_Altit,Lim_dP)","v":{"v":4329.266319278102,"d":"4329"}},{"$f":"IF(Geg_dP<$AB48,ROUND((($D48/Watts)/((Tv_heat-Tr_heat)*1.163))*FlowH2O,IF(UnitsNo=1,0,IF(UnitsNo=2,2))),\"\")","v":372},{"$f":"IF(Geg_dP<$AB48,IF((($BM$48*(E48/FlowH2O)^$BM$49))*kPa>0,(($BM$48*(E48/FlowH2O)^$BM$49))*kPa,0),\"\")","v":{"v":1.2702460699469025,"d":"1.3"}},{"$f":"IF(Geg_dP<$AB48,((($BL$48*($N48/Cubics)^4+$BL$49*($N48/Cubics)^3+$BL$51*($N48/Cubics)^2+$BL$53*($N48/Cubics)^1+$BL$54)*((CF_Regime_Cool_noExp)^$Y48)))*CF_Addit*Watts*CF_Altit,Lim_dP)","v":{"v":851.0865493923309,"d":"851"}},{"$f":"IF(Geg_dP<$AB48,((G48/Watts)/(IF((237.3*LN((RH*EXP(17.27*(Tl_cool/(Tl_cool+237.3))))))/(17.27-LN((RH*EXP(17.27*(Tl_cool/(Tl_cool+237.3))))))<EZ48,1,IF(1/(1+((2258*((0.622/((101325/(1*611*EXP(17.27*(EZ48/(EZ48+237.3))))))-1)*1000-(0.622/((101325/(RH*611*EXP(17.27*(Tl_cool/(Tl_cool+237.3))))))-1)*1000))/(1005*(Tavg_cold-Tl_cool))))>1,1,1/(1+((2258*((0.622/((101325/(1*611*EXP(17.27*(EZ48/(EZ48+237.3))))))-1)*1000-(0.622/((101325/(RH*611*EXP(17.27*(Tl_cool/(Tl_cool+237.3))))))-1)*1000))/(1005*(Tavg_cold-Tl_cool))))))))*Watts,\"\")","v":{"v":851.0865493923309,"d":"851"}},{"$f":"IF(Geg_dP<AB48,ROUND(((IF('Briza 22 & 26'!$M$4=\"High Perform. 208/230V (US/EU)\",cal!HK48,H48)/Watts)/((Tr_cool-Tv_cool)*1.163))*FlowH2O,IF(UnitsNo=1,0,IF(UnitsNo=2,2))),\"\")","v":366},{"$f":"IF(Geg_dP<$AB48,IF((($BM$53*(I48/FlowH2O)^$BM$54))*kPa>0,(($BM$53*(I48/FlowH2O)^$BM$54))*kPa,0),\"\")","v":{"v":1.2249426971189705,"d":"1.2"}},{"$f":"IF(Geg_dP<AB48,IF($L48-8<0,0,$L48-8),\"\")","v":{"v":25,"d":"25.0"}},{"$f":"IF(Geg_dP<$AB48,IF(CalcNo=\"12\",$ET48,IF(CalcNo=\"22\",$ET48,IF(CalcNo=\"13\",$EU48,IF(CalcNo=\"23\",$EU48,IF(CalcNo=\"11\",$ER48,IF(CalcNo=\"21\",$ER48,IF(CalcNo=\"14\",$ES48,IF(CalcNo=\"24\",$ES48,IF(CalcNo=\"32\",$EX48,IF(CalcNo=\"42\",$EX48,IF(CalcNo=\"33\",$EY48,IF(CalcNo=\"43\",$EY48,IF(CalcNo=\"31\",$EV48,IF(CalcNo=\"41\",$EV48,IF(CalcNo=\"34\",$EW48,IF(CalcNo=\"44\",$EW48,)))))))))))))))),\"\")","v":{"v":33,"d":"33.0"}},{"$f":"IF(Geg_dP<$AB48,($CF48*(($N48/Cubics)^4))+($CG48*(($N48/Cubics)^3))+($CH48*(($N48/Cubics)^2))+($CI48*($N48/Cubics))+$CJ48,\"\")","v":{"v":7.249867816056731,"d":"7.2"}},{"$f":"IF(Geg_dP<$AB48,(BZ48*Geg_dP^5+CA48*Geg_dP^4+CB48*Geg_dP^3+CC48*Geg_dP^2+CD48*Geg_dP+CE48)*CF_Case*Cubics,\"\")","v":{"v":392.201869,"d":"392"}},{"$f":"IF(Geg_dP<$AB48,(($N48/Cubics)/3600)/(($BJ$55/100)*($BP$55/100))*FeetMins,\"\")","v":{"v":0.31948669680677744,"d":"0.32"}},{"$f":"IF(Geg_dP<$AB48,((($D48/Watts)/(((p_atm*0.028964)/(8.31447*(20+273.15)))*(($N48/3600)/Cubics)*(1005+1870*((0.622)/(((p_atm)/($E$14*pvs_heat_in))-1)))))+Tl_heat)*Celc1+Celc2,\"\")","v":{"v":52.40115053884146,"d":"52.4"}},{"$f":"IF(Geg_dP<$AB48,(27.8*LN(($GN48+36)/45.5))*Celc1+Celc2,\"\")","v":{"v":23.900031768032814,"d":"23.9"}},{"$f":"IF(Geg_dP<$AB48,(Tl_cool-(($G48/Watts)/(1006*$N48*kgss)))*Celc1+Celc2,\"\")","v":{"v":20.55026158425467,"d":"20.6"}},{"$f":"IF(Geg_dP<$AB48,IF((27.8*LN(($HA48+36)/45.5))*Celc1+Celc2>R48,R48,(27.8*LN(($HA48+36)/45.5))*Celc1+Celc2),\"\")","v":{"v":17.328073153165487,"d":"17.3"}},{"$f":"IF(Geg_dP<$AB48,IF($H48>$G48,1,IF(($GT48/$GR48)<0,0,$GT48/$GR48)),\"\")","v":{"v":0.7365132262538178,"d":"74%"}},{"$f":"IF(Geg_dP<$AB48,$CK48*($N48/Cubics)^2+$CL48*($N48/Cubics)^1+$CM48,\"\")","v":{"v":430.8612716089725,"d":"431"}},{"$f":"M48/((N48/Cubics)/3.6)","v":{"v":0.06654614931935532,"d":"0.07"}},{"$f":"(G48/Watts)/(N48/Cubics)","v":{"v":2.1700216563535317,"d":"2.170"}},0.98023,1.29011,1.0896,0.98023,9.5,0.98023,1.29011,1.0896,{"v":8,"d":"8.00"},0.98023,1.29011,1.0896,{"v":7,"d":"7.00"},0.98023,1.29011,1.0896,{"v":9.5,"d":"9.50"},1.0115144976993358,1.35606862651545,1.09,{"v":22.6,"d":"22.60"},0.98023,1.29011,1.0896,{"v":8,"d":"8.00"},0.98023,1.29011,1.0896,{"v":7,"d":"7.00"},0.9802277199313987,1.2901116929825902,1.091482988399473,{"v":9.5,"d":"9.50"},0.9834917127786522,0.9132397252503823,1.0947469812467265,{"v":22.6,"d":"22.60"},null,null,{"$f":"IF($BK$17=\"11\",BN48,IF($BK$17=\"21\",BQ48,IF($BK$17=\"12\",BN48,IF($BK$17=\"22\",BQ48,IF($BK$17=\"13\",BN48,IF($BK$17=\"23\",BQ48,IF($BK$17=\"14\",BN48,IF($BK$17=\"24\",BQ48,IF($BK$17=\"31\",BT48,IF($BK$17=\"41\",BW48,IF($BK$17=\"32\",BT48,IF($BK$17=\"42\",BW48,IF($BK$17=\"33\",BT48,IF($BK$17=\"43\",BW48,IF($BK$17=\"34\",BT48,IF($BK$17=\"44\",BW48,))))))))))))))))","v":{"v":0,"d":"0.00E+00"}},{"v":0,"d":"0.00E+00"},{"v":2.30561e-06,"d":"2.31E-06"},null,null,{"$f":"BP53","v":{"v":2.30561e-06,"d":"2.31E-06"}},null,{"$f":"BO48","v":0},{"v":1.6685748191072182E-4,"d":"1.67E-04"},null,null,{"$f":"BV53","v":{"v":1.44758035E-7,"d":"1.45E-07"}},null,null,{"$f":"BS48","v":{"v":1.6685748191072182E-4,"d":"1.67E-04"}},{"$f":"IF($BK$17=\"11\",CN48,IF($BK$17=\"21\",CN48,IF($BK$17=\"12\",DP48,IF($BK$17=\"22\",DP48,IF($BK$17=\"13\",ED48,IF($BK$17=\"23\",ED48,IF($BK$17=\"14\",DB48,IF($BK$17=\"24\",DB48,IF($BK$17=\"31\",CN48,IF($BK$17=\"41\",CN48,IF($BK$17=\"32\",DP48,IF($BK$17=\"42\",DP48,IF($BK$17=\"33\",ED48,IF($BK$17=\"43\",ED48,IF($BK$17=\"34\",DB48,IF($BK$17=\"44\",DB48,))))))))))))))))","v":{"v":0,"d":"0.00E+00"}},{"v":0.0204079807,"d":"2.04E-02"},{"$f":"IF($BK$17=\"11\",CP48,IF($BK$17=\"21\",CP48,IF($BK$17=\"12\",DR48,IF($BK$17=\"22\",DR48,IF($BK$17=\"13\",EF48,IF($BK$17=\"23\",EF48,IF($BK$17=\"14\",DD48,IF($BK$17=\"24\",DD48,IF($BK$17=\"31\",CP48,IF($BK$17=\"41\",CP48,IF($BK$17=\"32\",DR48,IF($BK$17=\"42\",DR48,IF($BK$17=\"33\",EF48,IF($BK$17=\"43\",EF48,IF($BK$17=\"34\",DD48,IF($BK$17=\"44\",DD48,))))))))))))))))","v":{"v":-0.481030484,"d":"-4.81E-01"}},{"$f":"IF($BK$17=\"11\",CQ48,IF($BK$17=\"21\",CQ48,IF($BK$17=\"12\",DS48,IF($BK$17=\"22\",DS48,IF($BK$17=\"13\",EG48,IF($BK$17=\"23\",EG48,IF($BK$17=\"14\",DE48,IF($BK$17=\"24\",DE48,IF($BK$17=\"31\",CQ48,IF($BK$17=\"41\",CQ48,IF($BK$17=\"32\",DS48,IF($BK$17=\"42\",DS48,IF($BK$17=\"33\",EG48,IF($BK$17=\"43\",EG48,IF($BK$17=\"34\",DE48,IF($BK$17=\"44\",DE48,))))))))))))))))","v":{"v":3.05319486,"d":"3.05E+00"}},{"$f":"IF($BK$17=\"11\",CR48,IF($BK$17=\"21\",CR48,IF($BK$17=\"12\",DT48,IF($BK$17=\"22\",DT48,IF($BK$17=\"13\",EH48,IF($BK$17=\"23\",EH48,IF($BK$17=\"14\",DF48,IF($BK$17=\"24\",DF48,IF($BK$17=\"31\",CR48,IF($BK$17=\"41\",CR48,IF($BK$17=\"32\",DT48,IF($BK$17=\"42\",DT48,IF($BK$17=\"33\",EH48,IF($BK$17=\"43\",EH48,IF($BK$17=\"34\",DF48,IF($BK$17=\"44\",DF48,))))))))))))))))","v":{"v":-34.2166834,"d":"-3.42E+01"}},{"$f":"IF($BK$17=\"11\",CS48,IF($BK$17=\"21\",CS48,IF($BK$17=\"12\",DU48,IF($BK$17=\"22\",DU48,IF($BK$17=\"13\",EI48,IF($BK$17=\"23\",EI48,IF($BK$17=\"14\",DG48,IF($BK$17=\"24\",DG48,IF($BK$17=\"31\",CS48,IF($BK$17=\"41\",CS48,IF($BK$17=\"32\",DU48,IF($BK$17=\"42\",DU48,IF($BK$17=\"33\",EI48,IF($BK$17=\"43\",EI48,IF($BK$17=\"34\",DG48,IF($BK$17=\"44\",DG48,))))))))))))))))","v":{"v":392.201869,"d":"3.92E+02"}},{"$f":"IF($BK$17=\"11\",CT48,IF($BK$17=\"21\",CT48,IF($BK$17=\"12\",DV48,IF($BK$17=\"22\",DV48,IF($BK$17=\"13\",EJ48,IF($BK$17=\"23\",EJ48,IF($BK$17=\"14\",DH48,IF($BK$17=\"24\",DH48,IF($BK$17=\"31\",CT48,IF($BK$17=\"41\",CT48,IF($BK$17=\"32\",DV48,IF($BK$17=\"42\",DV48,IF($BK$17=\"33\",EJ48,IF($BK$17=\"43\",EJ48,IF($BK$17=\"34\",DH48,IF($BK$17=\"44\",DH48,))))))))))))))))","v":{"v":0,"d":"0.00E+00"}},{"$f":"IF($BK$17=\"11\",CU48,IF($BK$17=\"21\",CU48,IF($BK$17=\"12\",DW48,IF($BK$17=\"22\",DW48,IF($BK$17=\"13\",EK48,IF($BK$17=\"23\",EK48,IF($BK$17=\"14\",DI48,IF($BK$17=\"24\",DI48,IF($BK$17=\"31\",CU48,IF($BK$17=\"41\",CU48,IF($BK$17=\"32\",DW48,IF($BK$17=\"42\",DW48,IF($BK$17=\"33\",EK48,IF($BK$17=\"43\",EK48,IF($BK$17=\"34\",DI48,IF($BK$17=\"44\",DI48,))))))))))))))))","v":{"v":-2.46056401e-08,"d":"-2.46E-08"}},{"$f":"IF($BK$17=\"11\",CV48,IF($BK$17=\"21\",CV48,IF($BK$17=\"12\",DX48,IF($BK$17=\"22\",DX48,IF($BK$17=\"13\",EL48,IF($BK$17=\"23\",EL48,IF($BK$17=\"14\",DJ48,IF($BK$17=\"24\",DJ48,IF($BK$17=\"31\",CV48,IF($BK$17=\"41\",CV48,IF($BK$17=\"32\",DX48,IF($BK$17=\"42\",DX48,IF($BK$17=\"33\",EL48,IF($BK$17=\"43\",EL48,IF($BK$17=\"34\",DJ48,IF($BK$17=\"44\",DJ48,))))))))))))))))","v":{"v":1.95887534e-05,"d":"1.96E-05"}},{"$f":"IF($BK$17=\"11\",CW48,IF($BK$17=\"21\",CW48,IF($BK$17=\"12\",DY48,IF($BK$17=\"22\",DY48,IF($BK$17=\"13\",EM48,IF($BK$17=\"23\",EM48,IF($BK$17=\"14\",DK48,IF($BK$17=\"24\",DK48,IF($BK$17=\"31\",CW48,IF($BK$17=\"41\",CW48,IF($BK$17=\"32\",DY48,IF($BK$17=\"42\",DY48,IF($BK$17=\"33\",EM48,IF($BK$17=\"43\",EM48,IF($BK$17=\"34\",DK48,IF($BK$17=\"44\",DK48,))))))))))))))))","v":{"v":-2.22791317E-4,"d":"-2.23E-04"}},{"$f":"IF($BK$17=\"11\",CX48,IF($BK$17=\"21\",CX48,IF($BK$17=\"12\",DZ48,IF($BK$17=\"22\",DZ48,IF($BK$17=\"13\",EN48,IF($BK$17=\"23\",EN48,IF($BK$17=\"14\",DL48,IF($BK$17=\"24\",DL48,IF($BK$17=\"31\",CX48,IF($BK$17=\"41\",CX48,IF($BK$17=\"32\",DZ48,IF($BK$17=\"42\",DZ48,IF($BK$17=\"33\",EN48,IF($BK$17=\"43\",EN48,IF($BK$17=\"34\",DL48,IF($BK$17=\"44\",DL48,))))))))))))))))","v":{"v":5.80850317,"d":"5.81E+00"}},{"$f":"IF($BK$17=\"11\",CY48,IF($BK$17=\"21\",CY48,IF($BK$17=\"12\",EA48,IF($BK$17=\"22\",EA48,IF($BK$17=\"13\",EO48,IF($BK$17=\"23\",EO48,IF($BK$17=\"14\",DM48,IF($BK$17=\"24\",DM48,IF($BK$17=\"31\",CY48,IF($BK$17=\"41\",CY48,IF($BK$17=\"32\",EA48,IF($BK$17=\"42\",EA48,IF($BK$17=\"33\",EO48,IF($BK$17=\"43\",EO48,IF($BK$17=\"34\",DM48,IF($BK$17=\"44\",DM48,))))))))))))))))","v":{"v":-0.000174063503,"d":"-1.74E-04"}},{"$f":"IF($BK$17=\"11\",CZ48,IF($BK$17=\"21\",CZ48,IF($BK$17=\"12\",EB48,IF($BK$17=\"22\",EB48,IF($BK$17=\"13\",EP48,IF($BK$17=\"23\",EP48,IF($BK$17=\"14\",DN48,IF($BK$17=\"24\",DN48,IF($BK$17=\"31\",CZ48,IF($BK$17=\"41\",CZ48,IF($BK$17=\"32\",EB48,IF($BK$17=\"42\",EB48,IF($BK$17=\"33\",EP48,IF($BK$17=\"43\",EP48,IF($BK$17=\"34\",DN48,IF($BK$17=\"44\",DN48,))))))))))))))))","v":{"v":-0.106555127,"d":"-1.07E-01"}},{"$f":"IF($BK$17=\"11\",DA48,IF($BK$17=\"21\",DA48,IF($BK$17=\"12\",EC48,IF($BK$17=\"22\",EC48,IF($BK$17=\"13\",EQ48,IF($BK$17=\"23\",EQ48,IF($BK$17=\"14\",DO48,IF($BK$17=\"24\",DO48,IF($BK$17=\"31\",DA48,IF($BK$17=\"41\",DA48,IF($BK$17=\"32\",EC48,IF($BK$17=\"42\",EC48,IF($BK$17=\"33\",EQ48,IF($BK$17=\"43\",EQ48,IF($BK$17=\"34\",DO48,IF($BK$17=\"44\",DO48,))))))))))))))))","v":{"v":499.427241,"d":"4.99E+02"}},{"$nulls":3},{"v":7.10542736e-15,"d":"7.11E-15"},{"v":-40.351507,"d":"-4.04E+01"},{"v":322.812056,"d":"3.23E+02"},null,null,{"v":-3.07079261e-07,"d":"-3.07E-07"},{"v":0.00177192887,"d":"1.77E-03"},{"v":4.36,"d":"4.36E+00"},null,{"v":-0.218579582,"d":"-2.19E-01"},{"v":361.700488,"d":"3.62E+02"},null,{"v":0.0388238165,"d":"3.88E-02"},{"v":-0.361792656,"d":"-3.62E-01"},{"v":-0.780370553,"d":"-7.80E-01"},{"v":-32.3945608,"d":"-3.24E+01"},{"v":330.518118,"d":"3.31E+02"},null,{"v":-3.26494052E-8,"d":"-3.26E-08"},{"v":2.16361472E-5,"d":"2.16E-05"},{"v":-0.000154734297,"d":"-1.55E-04"},{"v":5.22885277,"d":"5.23E+00"},{"v":-0.000148106017,"d":"-1.48E-04"},{"v":-0.0320190882,"d":"-3.20E-02"},{"v":392.828591,"d":"3.93E+02"},null,{"v":0.0204079807,"d":"2.04E-02"},{"v":-0.481030484,"d":"-4.81E-01"},{"v":3.05319486,"d":"3.05E+00"},{"v":-34.2166834,"d":"-3.42E+01"},{"v":392.201869,"d":"3.92E+02"},null,{"v":-2.46056401e-08,"d":"-2.46E-08"},{"v":1.95887534e-05,"d":"1.96E-05"},{"v":-2.22791317E-4,"d":"-2.23E-04"},{"v":5.80850317,"d":"5.81E+00"},{"$f":" -0.000174063503","v":{"v":-0.000174063503,"d":"-1.74E-04"}},{"v":-0.106555127,"d":"-1.07E-01"},{"v":499.427241,"d":"4.99E+02"},null,{"v":0.00173596413,"d":"1.74E-03"},{"v":-0.0778586341,"d":"-7.79E-02"},{"v":0.726412037,"d":"7.26E-01"},{"v":-24.1770866,"d":"-2.42E+01"},{"v":701.431049,"d":"7.01E+02"},null,{"v":-2.85397623e-08,"d":"-2.85E-08"},{"v":3.96869605e-05,"d":"3.97E-05"},{"v":-0.00315406368,"d":"-3.15E-03"},{"v":17.5148436,"d":"1.75E+01"},{"v":-1.65487531E-5,"d":"-2E-05"},{"v":-0.0488521569,"d":"-5E-02"},{"v":680.891141,"d":"7E+02"},33,null,33,null,{"$f":"EX48","v":33},null,33,null,{"$f":"IF($BK$17=\"11\",FA48,IF($BK$17=\"21\",FA48,IF($BK$17=\"12\",FC48,IF($BK$17=\"22\",FC48,IF($BK$17=\"13\",FD48,IF($BK$17=\"23\",FD48,IF($BK$17=\"14\",FB48,IF($BK$17=\"24\",FB48,IF($BK$17=\"31\",FE48,IF($BK$17=\"41\",FE48,IF($BK$17=\"32\",FG48,IF($BK$17=\"42\",FG48,IF($BK$17=\"33\",FH48,IF($BK$17=\"43\",FH48,IF($BK$17=\"34\",FF48,IF($BK$17=\"44\",FF48,))))))))))))))))","v":17.5},{"$f":"Tavg_cold","v":17},{"$f":"IF($GC48<=$FC48,$FC48,IF($FM48<=$FP48,$FC48,$FZ48))","v":17.5},{"$f":"IF($N48>$FN48,Tavg_cold+(0.5*(Tr_cool-Tavg_cold)),Tavg_cold+($FJ48*(Tr_cool-Tavg_cold)))","v":17.5},{"$f":"IF($GC48<=$FC48,$FC48,IF($FM48<=$FP48,$FC48,$FZ48))","v":17.5},{"$f":"FH48*1.04","v":18.2},{"$f":"IF($GC48<=$FU48,$FU48,IF($FM48<=$FP48,Tavg_cold,$GA48))","v":17.5},{"$f":"FH48*1.05","v":18.375},{"$f":"IF($GC48<=$FU48,$FU48,IF($FM48<=$FP48,Tavg_cold,$GA48))","v":17.5},null,{"$f":"0.5*(1-((FN48-N48)/FN48))","v":0.5},{"$f":"(0.025*Tl_cool)+0.5","v":{"v":1.175,"d":"1.18"}},{"$f":"(0.13*Tl_cool)-2.04","v":1.4700000000000002},{"$f":"FQ48/FO48","v":{"v":0.5591452924120557,"d":"55.91%"}},{"$f":"DU48","v":{"v":392.201869,"d":"392.2"}},{"$f":"EI48","v":{"v":701.431049,"d":"701.4"}},{"$f":"FN48/FO48","v":{"v":0.5591452924120557,"d":"55.91%"}},{"$f":"N48/Cubics","v":{"v":392.201869,"d":"392.20"}},{"$f":"IF(FQ48-(FP48*FO48)<=0,0,FQ48-(FP48*FO48))","v":{"v":0,"d":"0.00"}},{"$f":"FO48*(1-FP48)","v":{"v":309.22918000000004,"d":"309.23"}},{"$f":"IF((FR48/FS48)>1,1,FR48/FS48)","v":{"v":0,"d":"0.00%"}},{"v":17.5,"d":"17.50"},{"$f":"Tr_cool*FK48","v":21.150000000000002},{"v":3.650000000000002,"d":"3.65"},{"$f":"Tv_cool*FL48","v":{"v":23.520000000000003,"d":"23.52"}},{"v":6.020000000000003,"d":"6.02"},{"v":17.5,"d":"17.50"},{"$f":"FU48+(FT48*FY48)","v":{"v":17.5,"d":"17.50"}},null,{"$f":"(237.3*LN((RH*EXP(17.27*(Tl_cool/(Tl_cool+237.3))))))/(17.27-LN((RH*EXP(17.27*(Tl_cool/(Tl_cool+237.3))))))","v":15.69066559142683},null,{"$f":"(H48-G48)/H48","v":{"v":0,"d":"0.0%"}},null,{"$f":"(611*EXP(17.27*(Tl_heat/(Tl_heat+237.7))))","v":{"v":2334.1781978570243,"d":"2334.18"}},{"$f":"(611*EXP(17.27*((($P48-Celc2)/Celc1)/((($P48-Celc2)/Celc1)+237.7))))","v":{"v":13829.893969101324,"d":"13829.89"}},{"$f":"RH*$GG48","v":{"v":1167.0890989285122,"d":"1167.09"}},{"$f":"(GL48*p_atm)/(GL48+0.622)","v":{"v":1167.089098928512,"d":"1167.09"}},{"$f":"0.622*($GI48/(p_atm-$GI48))","v":{"v":7.2478490515896785E-3,"d":"0.01"}},{"v":7.2478490515896785E-3,"d":"0.01"},{"$f":"(1.005*Tl_heat)+($GK48*(2500+(1.87*Tl_heat)))","v":{"v":38.49069218350365,"d":"38.49"}},{"$f":"(1.005*(($P48-Celc2)/Celc1))+($GL48*(2500+(1.87*(($P48-Celc2)/Celc1))))","v":{"v":71.49299674717959,"d":"71.49"}},{"v":0.08438886816746508,"d":"8%"},null,{"$f":"(611*EXP(17.27*(Tl_cool/(Tl_cool+237.7))))","v":{"v":3557.0118570174286,"d":"3557.01"}},{"$f":"(611*EXP(17.27*((($R48-Celc2)/Celc1)/((($R48-Celc2)/Celc1)+237.7))))","v":{"v":2414.7644130640556,"d":"2414.76"}},{"$f":"RH*$GQ48","v":{"v":1778.5059285087143,"d":"1778.51"}},{"$f":"(GW48*p_atm)/(GW48+0.622)","v":{"v":1778.5059285087143,"d":"1778.51"}},{"$f":"T48*GR48","v":{"v":1778.5059285087143,"d":"1778.51"}},{"$f":"0.622*($GS48/(p_atm-$GS48))","v":{"v":0.011112703645172665,"d":"0.0111"}},{"$f":"IF(H48=G48,GV48,(0.53475935828878*($GZ48-(1.005*(($R48-Celc2)/Celc1))))/(1336.8983957219))","v":{"v":0.011112703645172665,"d":"0.0111"}},{"$f":"0.622*($GU48/(p_atm-$GU48))","v":{"v":0.011112703645172665,"d":"0.01"}},{"$f":"(1.005*Tl_cool)+($GV48*(2500+(1.87*Tl_cool)))","v":{"v":55.47783951997643,"d":"55.48"}},{"$f":"GY48-((((H48-G48)/Watts)/1000)/(N48/$L$15))","v":{"v":55.47783951997643,"d":"55.48"}},{"$f":"(1.005*(($R48-Celc2)/Celc1))+($GX48*(2500+(1.87*(($R48-Celc2)/Celc1))))","v":{"v":48.861821973054646,"d":"48.86"}},{"v":19.415087041495514,"d":"19.42"},{"v":19.415087041495514,"d":"19.42"},{"$f":"H48","v":{"v":851.0865493923309,"d":"851"}},392.201869,{"$f":"IF(Geg_dP<$AB48,((($BL$48*($HE48/Cubics)^4+$BL$49*($HE48/Cubics)^3+$BL$51*($HE48/Cubics)^2+$BL$53*($HE48/Cubics)^1+$BL$54)*((CF_Regime_Cool_noExp)^$Y48)))*CF_Addit*Watts*CF_Altit,Lim_dP)","v":851.0865493923309},17.5,17.5,{"v":851.0865493923309,"d":"851"},1,{"v":851.0865493923309,"d":"851"},{"$f":"0.5*(1-((HP48-HE48)/HP48))","v":0.5},{"$f":"(0.025*Tl_cool)+0.5","v":{"v":1.175,"d":"1.18"}},{"$f":"(0.13*Tl_cool)-2.04","v":1.4700000000000002},{"$f":"HS48/HQ48","v":{"v":0.5591452924120557,"d":"55.91%"}},{"$f":"DU48","v":{"v":392.201869,"d":"392.2"}},{"v":701.431049,"d":"701.4"},{"$f":"HP48/HQ48","v":{"v":0.5591452924120557,"d":"55.91%"}},{"v":392.201869,"d":"392.20"},{"$f":"IF(HS48-(HR48*HQ48)<=0,0,HS48-(HR48*HQ48))","v":{"v":0,"d":"0.00"}},{"$f":"HQ48*(1-HR48)","v":{"v":309.22918000000004,"d":"309.23"}},{"$f":"IF((HT48/HU48)>1,1,HT48/HU48)","v":{"v":0,"d":"0.00%"}},{"v":17.5,"d":"17.50"},{"$f":"Tr_cool*HM48","v":21.150000000000002},{"$f":"ABS(HX48-HW48)","v":{"v":3.650000000000002,"d":"3.65"}},{"$f":"Tv_cool*HN48","v":{"v":23.520000000000003,"d":"23.52"}},{"$f":"ABS(HZ48-HW48)","v":{"v":6.020000000000003,"d":"6.02"}},{"$f":"IF(HO48<=HR48,HW48,HW48+(HV48*HY48))","v":{"v":17.5,"d":"17.50"}},{"$f":"HW48+(HV48*IA48)","v":{"v":17.5,"d":"17.50"}},null,{"$f":"(237.3*LN((RH*EXP(17.27*(Tl_cool/(Tl_cool+237.3))))))/(17.27-LN((RH*EXP(17.27*(Tl_cool/(Tl_cool+237.3))))))","v":15.69066559142683},null,{"$f":"(BG48-BF48)/BG48","v":{"v":0.16579836172705312,"d":"16.6%"}},null,{"$f":"(611*EXP(17.27*(Tl_heat/(Tl_heat+237.7))))","v":{"v":2334.1781978570243,"d":"2334.18"}},{"$f":"(611*EXP(17.27*((($P48-Celc2)/Celc1)/((($P48-Celc2)/Celc1)+237.7))))","v":{"v":13829.893969101324,"d":"13829.89"}}]
[null,{"$f":"IF($AL$5=1,$C49/10,IF($AL$5=2,$C49/10,IF($AL$5=3,0,IF($AL$5=4,$C49/10,))))","v":{"v":0.4,"d":"40%"}},4,{"$f":"IF(Geg_dP<AB49,((($BK$48*($N49/Cubics)^4+$BK$49*($N49/Cubics)^3+$BK$51*($N49/Cubics)^2+$BK$53*($N49/Cubics)^1+$BK$54)*((CF_Regime_Heat_noExp)^$AA49)))*CF_Addit*Watts*CF_Altit,Lim_dP)","v":{"v":7707.378506952319,"d":"7707"}},663,{"v":4.617539207566194,"d":"4.6"},{"v":1532.5657350229121,"d":"1533"},{"v":1532.5657350229121,"d":"1533"},{"$f":"IF(Geg_dP<AB49,ROUND(((IF('Briza 22 & 26'!$M$4=\"High Perform. 208/230V (US/EU)\",cal!HK49,H49)/Watts)/((Tr_cool-Tv_cool)*1.163))*FlowH2O,IF(UnitsNo=1,0,IF(UnitsNo=2,2))),\"\")","v":659},{"v":4.555550966362862,"d":"4.6"},{"v":34,"d":"34.0"},{"$f":"IF(Geg_dP<$AB49,IF(CalcNo=\"12\",$ET49,IF(CalcNo=\"22\",$ET49,IF(CalcNo=\"13\",$EU49,IF(CalcNo=\"23\",$EU49,IF(CalcNo=\"11\",$ER49,IF(CalcNo=\"21\",$ER49,IF(CalcNo=\"14\",$ES49,IF(CalcNo=\"24\",$ES49,IF(CalcNo=\"32\",$EX49,IF(CalcNo=\"42\",$EX49,IF(CalcNo=\"33\",$EY49,IF(CalcNo=\"43\",$EY49,IF(CalcNo=\"31\",$EV49,IF(CalcNo=\"41\",$EV49,IF(CalcNo=\"34\",$EW49,IF(CalcNo=\"44\",$EW49,)))))))))))))))),\"\")","v":{"v":42,"d":"42.0"}},{"v":17.835695984517578,"d":"17.8"},{"v":706.450383,"d":"706"},{"v":0.5754727785923753,"d":"0.58"},{"v":52.02438592548739,"d":"52.0"},{"v":23.80060691708679,"d":"23.8"},{"v":20.552141775749657,"d":"20.6"},{"v":17.328704959738953,"d":"17.3"},{"v":0.7364279958940718,"d":"74%"},{"v":641.5232398664856,"d":"642"},{"v":0.09088891037413917,"d":"0.09"},{"v":2.169389063835941,"d":"2.169"},0.98023,1.29011,1.0896,0.98023,28.38,0.98023,1.29011,1.0896,{"v":20,"d":"20.00"},0.98023,1.29011,1.0896,{"v":27,"d":"27.00"},0.98023,1.29011,1.0896,28.38,1.0115144976993358,1.35606862651545,1.09,77.72,0.98023,1.29011,1.0896,{"v":20,"d":"20.00"},0.98023,1.29011,1.0896,{"v":27,"d":"27.00"},0.9802277199313987,1.2901116929825902,1.091482988399473,28.38,0.9834917127786522,0.9132397252503823,1.0947469812467265,77.72,null,null,{"v":0,"d":"0.00E+00"},{"v":0,"d":"0.00E+00"},{"v":2.23342,"d":"2.23E+00"},null,null,{"$f":"BP54","v":{"v":2.23342,"d":"2.23E+00"}},null,{"$f":"BO49","v":0},{"v":1.8297986249451814,"d":"1.83E+00"},null,null,{"$f":"BV54","v":{"v":2.514766,"d":"2.51E+00"}},null,null,{"$f":"BS49","v":{"v":1.8297986249451814,"d":"1.83E+00"}},{"v":0,"d":"0.00E+00"},{"v":0.000503177345,"d":"5.03E-04"},{"v":-0.0294386523,"d":"-2.94E-02"},{"v":0.363138656,"d":"3.63E-01"},{"v":-20.4706961,"d":"-2.05E+01"},{"v":706.450383,"d":"7.06E+02"},{"v":0,"d":"0.00E+00"},{"v":-2.44327365e-08,"d":"-2.44E-08"},{"v":3.23344416e-05,"d":"3.23E-05"},{"v":-0.000670970333,"d":"-6.71E-04"},{"v":10.7867269,"d":"1.08E+01"},{"v":-1.12966808E-4,"d":"-1.13E-04"},{"v":-0.0963436566,"d":"-9.63E-02"},{"v":765.96384,"d":"7.66E+02"},null,null,{"v":1.77635684e-15,"d":"1.78E-15"},{"v":-1.13686838e-13,"d":"-1.14E-13"},{"v":-29.7326893,"d":"-2.97E+01"},{"v":594.653787,"d":"5.95E+02"},null,null,{"v":-2.29467888e-06,"d":"-2.29E-06"},{"v":0.00731758322,"d":"7.32E-03"},{"v":7.62657143,"d":"7.63E+00"},{"v":-8.6397475e-05,"d":"-8.64E-05"},{"v":-0.0448118615,"d":"-4.48E-02"},{"v":586.708256,"d":"5.87E+02"},null,{"v":0.00149629078,"d":"1.50E-03"},{"v":-0.0837082567,"d":"-8.37E-02"},{"v":1.15724511,"d":"1.16E+00"},{"v":-26.5402139,"d":"-2.65E+01"},{"v":756.102432,"d":"7.56E+02"},null,{"v":-2.41981525E-8,"d":"-2.42E-08"},{"v":3.16460259e-05,"d":"3.16E-05"},{"v":0.00150626327,"d":"1.51E-03"},{"v":11.1878915,"d":"1.12E+01"},{"v":-2.34739097e-05,"d":"-2.35E-05"},{"v":-0.0927170676,"d":"-9.27E-02"},{"v":733.767528,"d":"7.34E+02"},null,{"v":0.000503177345,"d":"5.03E-04"},{"v":-0.0294386523,"d":"-2.94E-02"},{"v":0.363138656,"d":"3.63E-01"},{"v":-20.4706961,"d":"-2.05E+01"},{"v":706.450383,"d":"7.06E+02"},null,{"v":-2.44327365e-08,"d":"-2.44E-08"},{"v":3.23344416e-05,"d":"3.23E-05"},{"v":-0.000670970333,"d":"-6.71E-04"},{"v":10.7867269,"d":"1.08E+01"},{"$f":" -0.000112966808","v":{"v":-1.12966808E-4,"d":"-1.13E-04"}},{"v":-0.0963436566,"d":"-9.63E-02"},{"v":765.96384,"d":"7.66E+02"},null,{"v":5.51430409e-05,"d":"5.51E-05"},{"v":-0.00830753741,"d":"-8.31E-03"},{"v":0.273813445,"d":"2.74E-01"},{"v":-14.5290258,"d":"-1.45E+01"},{"v":1407.88749,"d":"1.41E+03"},null,{"v":-1.54702403e-08,"d":"-1.55E-08"},{"v":4.16852767e-05,"d":"4.17E-05"},{"v":0.00497651494,"d":"4.98E-03"},{"v":38.416775,"d":"3.84E+01"},{"v":-2.27928596e-05,"d":"-2E-05"},{"v":-0.0187335515,"d":"-2E-02"},{"v":1174.70782,"d":"1E+03"},42,null,42,null,{"$f":"EX49","v":44.5},null,44.5,null,17.5,{"$f":"Tavg_cold","v":17},17.5,17.5,17.5,{"$f":"FH49*1.04","v":18.2},17.5,{"$f":"FH49*1.05","v":18.375},17.5,null,0.5,{"v":1.175,"d":"1.18"},1.4700000000000002,{"$f":"FQ49/FO49","v":{"v":0.5017804249400639,"d":"50.18%"}},{"$f":"DU49","v":{"v":706.450383,"d":"706.5"}},{"$f":"EI49","v":{"v":1407.88749,"d":"1407.9"}},{"$f":"FN49/FO49","v":{"v":0.5017804249400639,"d":"50.18%"}},{"v":706.450383,"d":"706.45"},{"v":0,"d":"0.00"},{"$f":"FO49*(1-FP49)","v":{"v":701.4371070000001,"d":"701.44"}},{"$f":"IF((FR49/FS49)>1,1,FR49/FS49)","v":{"v":0,"d":"0.00%"}},{"v":17.5,"d":"17.50"},21.150000000000002,{"v":3.650000000000002,"d":"3.65"},{"v":23.520000000000003,"d":"23.52"},{"v":6.020000000000003,"d":"6.02"},{"v":17.5,"d":"17.50"},{"v":17.5,"d":"17.50"},null,15.69066559142683,null,{"v":0,"d":"0.0%"},null,{"v":2334.1781978570243,"d":"2334.18"},{"v":13577.72814281667,"d":"13577.73"},{"v":1167.0890989285122,"d":"1167.09"},{"v":1167.089098928512,"d":"1167.09"},{"v":7.2478490515896785E-3,"d":"0.01"},{"v":7.2478490515896785E-3,"d":"0.01"},{"v":38.49069218350365,"d":"38.49"},{"v":71.10924183996353,"d":"71.11"},{"v":0.08595613983816308,"d":"9%"},null,{"v":3557.0118570174286,"d":"3557.01"},{"v":2415.043885382836,"d":"2415.04"},{"v":1778.5059285087143,"d":"1778.51"},{"v":1778.5059285087143,"d":"1778.51"},{"v":1778.5059285087143,"d":"1778.51"},{"v":0.011112703645172665,"d":"0.0111"},{"v":0.011112703645172665,"d":"0.0111"},{"v":0.011112703645172665,"d":"0.01"},{"v":55.47783951997643,"d":"55.48"},{"v":55.47783951997643,"d":"55.48"},{"v":48.863750637307454,"d":"48.86"},{"v":19.415087041495514,"d":"19.42"},{"v":19.415087041495514,"d":"19.42"},{"v":1532.5657350229121,"d":"1533"},706.450383,1532.5657350229121,17.5,17.5,{"v":1532.5657350229121,"d":"1533"},1,{"v":1532.5657350229121,"d":"1533"},0.5,{"v":1.175,"d":"1.18"},1.4700000000000002,{"$f":"HS49/HQ49","v":{"v":0.5017804249400639,"d":"50.18%"}},{"v":706.450383,"d":"706.5"},{"v":1407.88749,"d":"1407.9"},{"$f":"HP49/HQ49","v":{"v":0.5017804249400639,"d":"50.18%"}},{"v":706.450383,"d":"706.45"},{"v":0,"d":"0.00"},{"$f":"HQ49*(1-HR49)","v":{"v":701.4371070000001,"d":"701.44"}},{"$f":"IF((HT49/HU49)>1,1,HT49/HU49)","v":{"v":0,"d":"0.00%"}},{"v":17.5,"d":"17.50"},21.150000000000002,{"v":3.650000000000002,"d":"3.65"},{"v":23.520000000000003,"d":"23.52"},{"v":6.020000000000003,"d":"6.02"},{"v":17.5,"d":"17.50"},{"v":17.5,"d":"17.50"},null,15.69066559142683,null,{"v":0.16579836172705312,"d":"16.6%"},null,{"v":2334.1781978570243,"d":"2334.18"},{"v":13577.72814281667,"d":"13577.73"}]
[null,{"$f":"IF($AL$5=1,$C50/10,IF($AL$5=2,$C50/10,IF($AL$5=3,0.25,IF($AL$5=4,$C50/10,))))","v":{"v":0.5,"d":"50%"}},5,{"v":-78.28486902933179,"d":"-78"},-7,{"$error":"#NUM!"},{"v":-32.84190222242113,"d":"-33"},{"v":-32.84190222242113,"d":"-33"},{"$f":"IF(Geg_dP<AB50,ROUND(((IF('Briza 22 & 26'!$M$4=\"High Perform. 208/230V (US/EU)\",cal!HK50,H50)/Watts)/((Tr_cool-Tv_cool)*1.163))*FlowH2O,IF(UnitsNo=1,0,IF(UnitsNo=2,2))),\"\")","v":-14},{"$error":"#NUM!"},{"v":0,"d":"0.0"},{"$f":"IF(Geg_dP<$AB50,0,\"\")","v":{"v":0,"d":"0.0"}},{"v":0,"d":"0.0"},0,{"v":0,"d":"0.00"},{"$error":"#DIV/0!"},{"$error":"#DIV/0!"},{"$error":"#DIV/0!"},{"$error":"#DIV/0!"},{"$error":"#DIV/0!"},0,{"$error":"#DIV/0!"},{"$error":"#DIV/0!"},0.98023,1.29011,1.0896,0.98023,41.81,0.98023,1.29011,1.0896,{"$f":"AF49+((AF51-AF49)/2)","v":{"v":30,"d":"30.00"}},0.98023,1.29011,1.0896,{"$f":"AJ49+((AJ51-AJ49)/2)","v":{"v":43,"d":"43.00"}},0.98023,1.29011,1.0896,{"$f":"AN49+((AN51-AN49)/2)","v":41.81},1.0115144976993358,1.35606862651545,1.09,{"$f":"AR49+((AR51-AR49)/2)","v":120.87},0.98023,1.29011,1.0896,{"v":30,"d":"30.00"},0.98023,1.29011,1.0896,{"v":43,"d":"43.00"},0.9802277199313987,1.2901116929825902,1.091482988399473,41.81,0.9834917127786522,0.9132397252503823,1.0947469812467265,120.87,{"$nulls":17},{"v":0,"d":"0.00E+00"},{"v":0,"d":"0.00E+00"},{"v":0,"d":"0.00E+00"},{"v":0,"d":"0.00E+00"},{"v":0,"d":"0.00E+00"},{"v":0,"d":"0.00E+00"},{"v":0,"d":"0.00E+00"},{"v":0,"d":"0.00E+00"},{"v":0,"d":"0.00E+00"},{"v":0,"d":"0.00E+00"},{"v":0,"d":"0.00E+00"},{"v":0,"d":"0.00E+00"},{"v":0,"d":"0.00E+00"},{"v":0,"d":"0.00E+00"},{"$nulls":44},{"v":-2.54007374E-5,"d":"-2.54E-05"},{"v":-0.0594027166,"d":"-5.94E-02"},{"v":-8.62683955,"d":"-8.63E+00"},{"v":1729.51494,"d":"1.73E+03"},null,{"v":-1.4511666e-08,"d":"-1.45E-08"},{"v":4.693573e-05,"d":"4.69E-05"},{"v":0.00784680942,"d":"7.85E-03"},{"v":59.0430876,"d":"5.90E+01"},{"v":-2.04949834e-05,"d":"-2E-05"},{"v":-0.0318961546,"d":"-3E-02"},{"v":1429.34212,"d":"1E+03"},{"$nulls":8},{"v":17,"d":"17.0"},{"$f":"((FA51-FA49)/2)+FA49","v":17},17,17,17,{"$f":"((FE51-FE49)/2)+FE49","v":18.2},17,{"$f":"((FG51-FG49)/2)+FG49","v":18.375},17,null,{"v":0,"d":"0.0"},{"v":1.175,"d":"1.18"},1.4700000000000002,{"v":0,"d":"0.00%"},{"$f":"((FN51-FN49)/2)+FN49","v":{"v":848.2259624999999,"d":"848.2"}},{"$f":"((FO51-FO49)/2)+FO49","v":{"v":1740.9035350000001,"d":"1740.9"}},{"$f":"FN50/FO50","v":{"v":0.4872331783162241,"d":"48.72%"}},{"v":0,"d":"0.00"},{"v":0,"d":"0.00"},{"v":892.6775725000003,"d":"892.68"},{"v":0,"d":"0.00%"},{"v":17,"d":"17.00"},21.150000000000002,{"v":4.150000000000002,"d":"4.15"},{"v":23.520000000000003,"d":"23.52"},{"v":6.520000000000003,"d":"6.52"},{"v":17,"d":"17.00"},{"v":17,"d":"17.00"},null,15.69066559142683,null,{"v":0,"d":"0.0%"},null,{"v":2334.1781978570243,"d":"2334.18"},{"$error":"#DIV/0!"},{"v":1167.0890989285122,"d":"1167.09"},{"v":1167.089098928512,"d":"1167.09"},{"v":7.2478490515896785E-3,"d":"0.01"},{"v":7.2478490515896785E-3,"d":"0.01"},{"v":38.49069218350365,"d":"38.49"},{"$error":"#DIV/0!"},{"$error":"#DIV/0!"},null,{"v":3557.0118570174286,"d":"3557.01"},{"$error":"#DIV/0!"},{"v":1778.5059285087143,"d":"1778.51"},{"v":1778.5059285087143,"d":"1778.51"},{"$error":"#DIV/0!"},{"v":0.011112703645172665,"d":"0.0111"},{"v":0.011112703645172665,"d":"0.0111"},{"$error":"#DIV/0!"},{"v":55.47783951997643,"d":"55.48"},{"$error":"#DIV/0!"},{"$error":"#DIV/0!"},{"v":19.415087041495514,"d":"19.42"},{"$error":"#DIV/0!"},{"v":-32.84190222242113,"d":"-33"},0,-32.84190222242113,{"v":17,"d":"17.0"},17,{"$f":"IF(Geg_dP<$AB50,((HF50/Watts)/(IF((237.3*LN((RH*EXP(17.27*(Tl_cool/(Tl_cool+237.3))))))/(17.27-LN((RH*EXP(17.27*(Tl_cool/(Tl_cool+237.3))))))<HH50,1,IF(1/(1+((2258*((0.622/((101325/(1*611*EXP(17.27*(HH50/(HH50+237.3))))))-1)*1000-(0.622/((101325/(RH*611*EXP(17.27*(Tl_cool/(Tl_cool+237.3))))))-1)*1000))/(1005*(Tavg_cold-Tl_cool))))>1,1,1/(1+((2258*((0.622/((101325/(1*611*EXP(17.27*(HH50/(HH50+237.3))))))-1)*1000-(0.622/((101325/(RH*611*EXP(17.27*(Tl_cool/(Tl_cool+237.3))))))-1)*1000))/(1005*(Tavg_cold-Tl_cool))))))))*Watts,\"\")","v":{"v":-32.84190222242113,"d":"-33"}},1,{"v":-32.84190222242113,"d":"-33"},{"v":0,"d":"0.0"},{"v":1.175,"d":"1.18"},1.4700000000000002,{"v":0,"d":"0.00%"},{"$f":"((HP51-HP49)/2)+HP49","v":{"v":848.2259624999999,"d":"848.2"}},{"$f":"((HQ51-HQ49)/2)+HQ49","v":{"v":1740.9035350000001,"d":"1740.9"}},{"$f":"HP50/HQ50","v":{"v":0.4872331783162241,"d":"48.72%"}},{"v":0,"d":"0.00"},{"v":0,"d":"0.00"},{"v":892.6775725000003,"d":"892.68"},{"v":0,"d":"0.00%"},{"v":17,"d":"17.00"},21.150000000000002,{"v":4.150000000000002,"d":"4.15"},{"v":23.520000000000003,"d":"23.52"},{"v":6.520000000000003,"d":"6.52"},{"v":17,"d":"17.00"},{"v":17,"d":"17.00"},null,15.69066559142683,null,{"v":0.16579836172705312,"d":"16.6%"},null,{"v":2334.1781978570243,"d":"2334.18"},{"$error":"#DIV/0!"}]
[null,{"$f":"IF($AL$5=1,$C51/10,IF($AL$5=2,$C51/10,IF($AL$5=3,0.5,IF($AL$5=4,$C51/10,))))","v":{"v":0.6,"d":"60%"}},6,{"v":10638.371355643016,"d":"10638"},915,{"v":9.481628757980802,"d":"9.5"},{"v":2127.0413856362497,"d":"2127"},{"v":2127.0413856362497,"d":"2127"},{"$f":"IF(Geg_dP<AB51,ROUND(((IF('Briza 22 & 26'!$M$4=\"High Perform. 208/230V (US/EU)\",cal!HK51,H51)/Watts)/((Tr_cool-Tv_cool)*1.163))*FlowH2O,IF(UnitsNo=1,0,IF(UnitsNo=2,2))),\"\")","v":914},{"v":9.458500684121743,"d":"9.5"},{"v":41,"d":"41.0"},{"$f":"IF(Geg_dP<$AB51,IF(CalcNo=\"12\",$ET51,IF(CalcNo=\"22\",$ET51,IF(CalcNo=\"13\",$EU51,IF(CalcNo=\"23\",$EU51,IF(CalcNo=\"11\",$ER51,IF(CalcNo=\"21\",$ER51,IF(CalcNo=\"14\",$ES51,IF(CalcNo=\"24\",$ES51,IF(CalcNo=\"32\",$EX51,IF(CalcNo=\"42\",$EX51,IF(CalcNo=\"33\",$EY51,IF(CalcNo=\"43\",$EY51,IF(CalcNo=\"31\",$EV51,IF(CalcNo=\"41\",$EV51,IF(CalcNo=\"34\",$EW51,IF(CalcNo=\"44\",$EW51,)))))))))))))))),\"\")","v":{"v":49,"d":"49.0"}},{"v":37.073992288499525,"d":"37.1"},{"v":990.001542,"d":"990"},{"v":0.8064528690127076,"d":"0.81"},{"v":51.542423857001864,"d":"51.5"},{"v":23.67290080496077,"d":"23.7"},{"v":20.614158982639005,"d":"20.6"},{"v":17.34953675005941,"d":"17.3"},{"v":0.7336229276297737,"d":"73%"},{"v":835.3484046756057,"d":"835"},{"v":0.1348143074292285,"d":"0.13"},{"v":2.1485233056700124,"d":"2.149"},0.98023,1.29011,1.0896,0.98023,55.24,0.98023,1.29011,1.0896,{"v":40,"d":"40.00"},0.98023,1.29011,1.0896,{"v":59,"d":"59.00"},0.98023,1.29011,1.0896,55.24,1.0115144976993358,1.35606862651545,1.09,164.02,0.98023,1.29011,1.0896,{"v":40,"d":"40.00"},0.98023,1.29011,1.0896,{"v":59,"d":"59.00"},0.9802277199313987,1.2901116929825902,1.091482988399473,55.24,0.9834917127786522,0.9132397252503823,1.0947469812467265,164.02,null,null,{"$f":"IF($BK$17=\"11\",BN51,IF($BK$17=\"21\",BQ51,IF($BK$17=\"12\",BN51,IF($BK$17=\"22\",BQ51,IF($BK$17=\"13\",BN51,IF($BK$17=\"23\",BQ51,IF($BK$17=\"14\",BN51,IF($BK$17=\"24\",BQ51,IF($BK$17=\"31\",BT51,IF($BK$17=\"41\",BW51,IF($BK$17=\"32\",BT51,IF($BK$17=\"42\",BW51,IF($BK$17=\"33\",BT51,IF($BK$17=\"43\",BW51,IF($BK$17=\"34\",BT51,IF($BK$17=\"44\",BW51,))))))))))))))))","v":{"v":-0.000393558595,"d":"-3.94E-04"}},{"$f":"IF($BK$17=\"11\",BO51,IF($BK$17=\"21\",BR51,IF($BK$17=\"12\",BO51,IF($BK$17=\"22\",BR51,IF($BK$17=\"13\",BO51,IF($BK$17=\"23\",BR51,IF($BK$17=\"14\",BO51,IF($BK$17=\"24\",BR51,IF($BK$17=\"31\",BU51,IF($BK$17=\"41\",BX51,IF($BK$17=\"32\",BU51,IF($BK$17=\"42\",BX51,IF($BK$17=\"33\",BU51,IF($BK$17=\"43\",BX51,IF($BK$17=\"34\",BU51,IF($BK$17=\"44\",BX51,))))))))))))))))","v":{"v":-0.000247016881,"d":"-2.47E-04"}},null,{"v":-0.000393558595,"d":"-3.94E-04"},{"v":-0.000247016881,"d":"-2.47E-04"},null,{"v":-0.000592086239,"d":"-5.92E-04"},{"$f":"BO51","v":{"v":-0.000247016881,"d":"-2.47E-04"}},null,{"v":-0.000231750952,"d":"-2.32E-04"},{"v":-0.000243756968,"d":"-2.44E-04"},null,{"$f":"BQ51","v":{"v":-0.000592086239,"d":"-5.92E-04"}},{"$f":"BU51","v":{"v":-0.000243756968,"d":"-2.44E-04"}},null,{"v":0,"d":"0.00E+00"},{"v":3.81492358e-05,"d":"3.81E-05"},{"v":-0.0042371167,"d":"-4.24E-03"},{"v":0.0723943455,"d":"7.24E-02"},{"v":-14.4437581,"d":"-1.44E+01"},{"v":990.001542,"d":"9.90E+02"},{"v":0,"d":"0.00E+00"},{"v":-1.94850222e-08,"d":"-1.95E-08"},{"v":3.59021298e-05,"d":"3.59E-05"},{"v":1.39535354E-3,"d":"1.40E-03"},{"v":19.411189,"d":"1.94E+01"},{"v":-6.13336952e-05,"d":"-6.13E-05"},{"v":-0.14403187,"d":"-1.44E-01"},{"v":1038.05352,"d":"1.04E+03"},null,null,{"v":-0.0161282032,"d":"-1.61E-02"},{"v":0.789913954,"d":"7.90E-01"},{"v":-28.8763616,"d":"-2.89E+01"},{"v":873.552616,"d":"8.74E+02"},null,null,{"v":-2.92649252e-06,"d":"-2.93E-06"},{"v":0.0205109615,"d":"2.05E-02"},{"v":11.1903621,"d":"1.12E+01"},{"v":-9.31581701e-05,"d":"-9.32E-05"},{"v":-0.0497024099,"d":"-4.97E-02"},{"v":834.339743,"d":"8.34E+02"},null,{"v":2.97740218E-5,"d":"2.98E-05"},{"v":-0.00426027313,"d":"-4.26E-03"},{"v":0.105094536,"d":"1.05E-01"},{"v":-16.8982992,"d":"-1.69E+01"},{"v":1172.24787,"d":"1.17E+03"},null,{"v":-1.77832084e-08,"d":"-1.78E-08"},{"v":3.65060956e-05,"d":"3.65E-05"},{"v":0.00488625734,"d":"4.89E-03"},{"v":22.585465,"d":"2.26E+01"},{"v":-1.08774656e-05,"d":"-1.09E-05"},{"v":-0.13174025,"d":"-1.32E-01"},{"v":1065.40565,"d":"1.07E+03"},null,{"v":3.81492358e-05,"d":"3.81E-05"},{"v":-0.0042371167,"d":"-4.24E-03"},{"v":0.0723943455,"d":"7.24E-02"},{"v":-14.4437581,"d":"-1.44E+01"},{"v":990.001542,"d":"9.90E+02"},null,{"v":-1.94850222e-08,"d":"-1.95E-08"},{"v":3.59021298e-05,"d":"3.59E-05"},{"v":1.39535354E-3,"d":"1.40E-03"},{"v":19.411189,"d":"1.94E+01"},{"v":-6.13336952e-05,"d":"-6.13E-05"},{"v":-0.14403187,"d":"-1.44E-01"},{"v":1038.05352,"d":"1.04E+03"},null,{"v":3.26002407E-6,"d":"3.26E-06"},{"v":-0.00108775446,"d":"-1.09E-03"},{"v":0.0789858715,"d":"7.90E-02"},{"v":-10.550664,"d":"-1.06E+01"},{"v":2073.91958,"d":"2.07E+03"},null,{"v":-1.35530917E-8,"d":"-1.36E-08"},{"v":5.21861833E-5,"d":"5.22E-05"},{"v":0.0107171039,"d":"1.07E-02"},{"v":79.6694002,"d":"7.97E+01"},{"v":-1.81971072e-05,"d":"-2E-05"},{"v":-0.0450587576,"d":"-5E-02"},{"v":1683.97642,"d":"2E+03"},49,null,49,null,{"$f":"EX51","v":51.5},null,51.5,null,17.5,{"$f":"Tavg_cold","v":17},17.5,17.5,17.5,18.2,17.5,{"$f":"FH51*1.05","v":18.375},17.5,null,0.5,{"v":1.175,"d":"1.18"},1.4700000000000002,{"v":0.47735772956056466,"d":"47.74%"},{"$f":"DU51","v":{"v":990.001542,"d":"990.0"}},{"$f":"EI51","v":{"v":2073.91958,"d":"2073.9"}},{"$f":"FN51/FO51","v":{"v":0.47735772956056466,"d":"47.74%"}},{"v":990.001542,"d":"990.00"},{"v":0,"d":"0.00"},{"v":1083.9180380000003,"d":"1083.92"},{"v":0,"d":"0.00%"},{"v":17.5,"d":"17.50"},21.150000000000002,{"v":3.650000000000002,"d":"3.65"},{"v":23.520000000000003,"d":"23.52"},{"v":6.020000000000003,"d":"6.02"},{"v":17.5,"d":"17.50"},{"v":17.5,"d":"17.50"},null,15.69066559142683,null,{"v":0,"d":"0.0%"},null,{"v":2334.1781978570243,"d":"2334.18"},{"v":13260.91894134172,"d":"13260.92"},{"v":1167.0890989285122,"d":"1167.09"},{"v":1167.089098928512,"d":"1167.09"},{"v":7.2478490515896785E-3,"d":"0.01"},{"v":7.2478490515896785E-3,"d":"0.01"},{"v":38.49069218350365,"d":"38.49"},{"v":70.61833769897535,"d":"70.62"},{"v":0.08800966992491302,"d":"9%"},null,{"v":3557.0118570174286,"d":"3557.01"},{"v":2424.278006488704,"d":"2424.28"},{"v":1778.5059285087143,"d":"1778.51"},{"v":1778.5059285087143,"d":"1778.51"},{"v":1778.5059285087143,"d":"1778.51"},{"v":0.011112703645172665,"d":"0.0111"},{"v":0.011112703645172665,"d":"0.0111"},{"v":0.011112703645172665,"d":"0.01"},{"v":55.47783951997643,"d":"55.48"},{"v":55.47783951997643,"d":"55.48"},{"v":48.92736669466403,"d":"48.93"},{"v":19.415087041495514,"d":"19.42"},{"v":19.415087041495514,"d":"19.42"},{"v":2127.0413856362497,"d":"2127"},990.001542,2127.0413856362497,17.5,17.5,{"v":2127.0413856362497,"d":"2127"},1,{"v":2127.0413856362497,"d":"2127"},0.5,{"v":1.175,"d":"1.18"},1.4700000000000002,{"v":0.47735772956056466,"d":"47.74%"},{"v":990.001542,"d":"990.0"},{"v":2073.91958,"d":"2073.9"},{"$f":"HP51/HQ51","v":{"v":0.47735772956056466,"d":"47.74%"}},{"v":990.001542,"d":"990.00"},{"v":0,"d":"0.00"},{"v":1083.9180380000003,"d":"1083.92"},{"v":0,"d":"0.00%"},{"v":17.5,"d":"17.50"},21.150000000000002,{"v":3.650000000000002,"d":"3.65"},{"v":23.520000000000003,"d":"23.52"},{"v":6.020000000000003,"d":"6.02"},{"v":17.5,"d":"17.50"},{"v":17.5,"d":"17.50"},null,15.69066559142683,null,{"v":0.16579836172705312,"d":"16.6%"},null,{"v":2334.1781978570243,"d":"2334.18"},{"v":13260.91894134172,"d":"13260.92"}]
[null,{"$f":"IF($AL$5=1,$C52/10,IF($AL$5=2,$C52/10,IF($AL$5=3,0.75,IF($AL$5=4,$C52/10,))))","v":{"v":0.7,"d":"70%"}},7,{"v":-78.28486902933179,"d":"-78"},-7,{"$error":"#NUM!"},{"v":-32.84190222242113,"d":"-33"},{"v":-32.84190222242113,"d":"-33"},{"$f":"IF(Geg_dP<AB52,ROUND(((IF('Briza 22 & 26'!$M$4=\"High Perform. 208/230V (US/EU)\",cal!HK52,H52)/Watts)/((Tr_cool-Tv_cool)*1.163))*FlowH2O,IF(UnitsNo=1,0,IF(UnitsNo=2,2))),\"\")","v":-14},{"$error":"#NUM!"},{"v":0,"d":"0.0"},{"$f":"IF(Geg_dP<$AB52,0,\"\")","v":{"v":0,"d":"0.0"}},{"v":0,"d":"0.0"},0,{"v":0,"d":"0.00"},{"$error":"#DIV/0!"},{"$error":"#DIV/0!"},{"$error":"#DIV/0!"},{"$error":"#DIV/0!"},{"$error":"#DIV/0!"},0,{"$error":"#DIV/0!"},{"$error":"#DIV/0!"},0.98023,1.29011,1.0896,0.98023,72.12,0.98023,1.29011,1.0896,{"$f":"AF51+((AF53-AF51)/2)","v":{"v":55,"d":"55.00"}},0.98023,1.29011,1.0896,{"$f":"AJ51+((AJ53-AJ51)/2)","v":{"v":79,"d":"79.00"}},0.98023,1.29011,1.0896,{"$f":"AN51+((AN53-AN51)/2)","v":72.12},1.0115144976993358,1.35606862651545,1.09,{"v":187,"d":"187.00"},0.98023,1.29011,1.0896,{"v":55,"d":"55.00"},0.98023,1.29011,1.0896,{"v":79,"d":"79.00"},0.9802277199313987,1.2901116929825902,1.091482988399473,72.12,0.9834917127786522,0.9132397252503823,1.0947469812467265,{"v":187,"d":"187.00"},{"$nulls":17},{"v":0,"d":"0.00E+00"},{"v":0,"d":"0.00E+00"},{"v":0,"d":"0.00E+00"},{"v":0,"d":"0.00E+00"},{"v":0,"d":"0.00E+00"},{"v":0,"d":"0.00E+00"},{"v":0,"d":"0.00E+00"},{"v":0,"d":"0.00E+00"},{"v":0,"d":"0.00E+00"},{"v":0,"d":"0.00E+00"},{"v":0,"d":"0.00E+00"},{"v":0,"d":"0.00E+00"},{"v":0,"d":"0.00E+00"},{"v":0,"d":"0.00E+00"},{"$nulls":43},{"v":5.02607174e-07,"d":"5.03E-07"},{"v":-0.000329451741,"d":"-3.29E-04"},{"v":0.0189322913,"d":"1.89E-02"},{"v":-7.62828129,"d":"-7.63E+00"},{"v":2306.79781,"d":"2.31E+03"},null,{"v":-2.08654905e-08,"d":"-2.09E-08"},{"v":8.31474047e-05,"d":"8.31E-05"},{"v":-0.0011489831,"d":"-1.15E-03"},{"v":94.7533316,"d":"9.48E+01"},{"v":-1.8912531E-5,"d":"-2E-05"},{"v":-0.0035640629,"d":"-4E-03"},{"v":1794.39323,"d":"2E+03"},{"$nulls":8},17,{"$f":"((FA53-FA51)/2)+FA51","v":17},17,17,{"$f":"IF($GC52<=$FC52,$FC52,IF($FM52<=$FP52,$FC52,$FZ52))","v":17},{"$f":"((FE53-FE51)/2)+FE51","v":18.2},17,{"$f":"((FG53-FG51)/2)+FG51","v":18.375},17,null,{"v":0,"d":"0.0"},{"v":1.175,"d":"1.18"},1.4700000000000002,{"v":0,"d":"0.00%"},{"$f":"((FN53-FN51)/2)+FN51","v":{"v":1121.1084959999998,"d":"1121.1"}},{"$f":"((FO53-FO51)/2)+FO51","v":{"v":2299.9334,"d":"2299.9"}},{"$f":"FN52/FO52","v":{"v":0.4874525914533003,"d":"48.75%"}},{"v":0,"d":"0.00"},{"v":0,"d":"0.00"},{"v":1178.824904,"d":"1178.82"},{"v":0,"d":"0.00%"},{"v":17,"d":"17.00"},21.150000000000002,{"v":4.150000000000002,"d":"4.15"},{"v":23.520000000000003,"d":"23.52"},{"v":6.520000000000003,"d":"6.52"},{"v":17,"d":"17.00"},{"v":17,"d":"17.00"},null,15.69066559142683,null,{"v":0,"d":"0.0%"},null,{"v":2334.1781978570243,"d":"2334.18"},{"$error":"#DIV/0!"},{"v":1167.0890989285122,"d":"1167.09"},{"v":1167.089098928512,"d":"1167.09"},{"v":7.2478490515896785E-3,"d":"0.01"},{"v":7.2478490515896785E-3,"d":"0.01"},{"v":38.49069218350365,"d":"38.49"},{"$error":"#DIV/0!"},{"$error":"#DIV/0!"},null,{"v":3557.0118570174286,"d":"3557.01"},{"$error":"#DIV/0!"},{"v":1778.5059285087143,"d":"1778.51"},{"v":1778.5059285087143,"d":"1778.51"},{"$error":"#DIV/0!"},{"v":0.011112703645172665,"d":"0.0111"},{"v":0.011112703645172665,"d":"0.0111"},{"$error":"#DIV/0!"},{"v":55.47783951997643,"d":"55.48"},{"$error":"#DIV/0!"},{"$error":"#DIV/0!"},{"v":19.415087041495514,"d":"19.42"},{"$error":"#DIV/0!"},{"v":-32.84190222242113,"d":"-33"},0,-32.84190222242113,{"v":17,"d":"17.0"},17,{"v":-32.84190222242113,"d":"-33"},1,{"v":-32.84190222242113,"d":"-33"},{"v":0,"d":"0.0"},{"v":1.175,"d":"1.18"},1.4700000000000002,{"v":0,"d":"0.00%"},{"$f":"((HP53-HP51)/2)+HP51","v":{"v":1121.1084959999998,"d":"1121.1"}},{"v":2306.79781,"d":"2306.8"},{"$f":"HP52/HQ52","v":{"v":0.486002063613889,"d":"48.60%"}},{"v":0,"d":"0.00"},{"v":0,"d":"0.00"},{"v":1185.6893140000002,"d":"1185.69"},{"v":0,"d":"0.00%"},{"v":17,"d":"17.00"},21.150000000000002,{"v":4.150000000000002,"d":"4.15"},{"v":23.520000000000003,"d":"23.52"},{"v":6.520000000000003,"d":"6.52"},{"v":17,"d":"17.00"},{"v":17,"d":"17.00"},null,15.69066559142683,null,{"v":0.16579836172705312,"d":"16.6%"},null,{"v":2334.1781978570243,"d":"2334.18"},{"$error":"#DIV/0!"}]
[null,{"$f":"IF($AL$5=1,$C53/10,IF($AL$5=2,$C53/10,IF($AL$5=3,1,IF($AL$5=4,$C53/10,))))","v":{"v":0.8,"d":"80%"}},8,{"v":13249.920177568205,"d":"13250"},1139,{"v":15.462761700679485,"d":"15.5"},{"v":2659.531773998441,"d":"2660"},{"v":2659.531773998441,"d":"2660"},{"$f":"IF(Geg_dP<AB53,ROUND(((IF('Briza 22 & 26'!$M$4=\"High Perform. 208/230V (US/EU)\",cal!HK53,H53)/Watts)/((Tr_cool-Tv_cool)*1.163))*FlowH2O,IF(UnitsNo=1,0,IF(UnitsNo=2,2))),\"\")","v":1143},{"v":15.584305711329021,"d":"15.6"},{"v":47,"d":"47.0"},{"$f":"IF(Geg_dP<$AB53,IF(CalcNo=\"12\",$ET53,IF(CalcNo=\"22\",$ET53,IF(CalcNo=\"13\",$EU53,IF(CalcNo=\"23\",$EU53,IF(CalcNo=\"11\",$ER53,IF(CalcNo=\"21\",$ER53,IF(CalcNo=\"14\",$ES53,IF(CalcNo=\"24\",$ES53,IF(CalcNo=\"32\",$EX53,IF(CalcNo=\"42\",$EX53,IF(CalcNo=\"33\",$EY53,IF(CalcNo=\"43\",$EY53,IF(CalcNo=\"31\",$EV53,IF(CalcNo=\"41\",$EV53,IF(CalcNo=\"34\",$EW53,IF(CalcNo=\"44\",$EW53,)))))))))))))))),\"\")","v":{"v":55,"d":"55.0"}},{"v":65.78114400748828,"d":"65.8"},{"v":1252.21545,"d":"1252"},{"v":1.0200516862170086,"d":"1.02"},{"v":51.059180469714676,"d":"51.1"},{"v":23.544263465235527,"d":"23.5"},{"v":20.687459775071233,"d":"20.7"},{"v":17.374138623148855,"d":"17.4"},{"v":0.7303229967103656,"d":"73%"},{"v":998.5100266806237,"d":"999"},{"v":0.18911451573845206,"d":"0.19"},{"v":2.1238611726108645,"d":"2.124"},0.98023,1.29011,1.0896,0.98023,89,0.98023,1.29011,1.0896,{"v":70,"d":"70.00"},0.98023,1.29011,1.0896,{"v":99,"d":"99.00"},0.98023,1.29011,1.0896,{"v":89,"d":"89.00"},1.0115144976993358,1.35606862651545,1.09,213.64,0.98023,1.29011,1.0896,{"v":70,"d":"70.00"},0.98023,1.29011,1.0896,{"v":99,"d":"99.00"},0.9802277199313987,1.2901116929825902,1.091482988399473,{"v":89,"d":"89.00"},0.9834917127786522,0.9132397252503823,1.0947469812467265,213.64,null,null,{"$f":"IF($BK$17=\"11\",BN53,IF($BK$17=\"21\",BQ53,IF($BK$17=\"12\",BN53,IF($BK$17=\"22\",BQ53,IF($BK$17=\"13\",BN53,IF($BK$17=\"23\",BQ53,IF($BK$17=\"14\",BN53,IF($BK$17=\"24\",BQ53,IF($BK$17=\"31\",BT53,IF($BK$17=\"41\",BW53,IF($BK$17=\"32\",BT53,IF($BK$17=\"42\",BW53,IF($BK$17=\"33\",BT53,IF($BK$17=\"43\",BW53,IF($BK$17=\"34\",BT53,IF($BK$17=\"44\",BW53,))))))))))))))))","v":{"v":6.55496447,"d":"6.55E+00"}},{"v":4.71519413,"d":"4.72E+00"},{"v":2.30561e-06,"d":"2.31E-06"},{"v":6.55496447,"d":"6.55E+00"},{"v":4.71519413,"d":"4.72E+00"},{"v":2.30561e-06,"d":"2.31E-06"},{"v":3.44555529,"d":"3.45E+00"},{"$f":"BO53","v":{"v":4.71519413,"d":"4.72E+00"}},{"$f":"+BP53","v":{"v":2.30561e-06,"d":"2.31E-06"}},{"v":7.32434483,"d":"7.32E+00"},{"v":5.45300143,"d":"5.45E+00"},{"v":1.44758035E-7,"d":"1.45E-07"},{"$f":"BQ53","v":{"v":3.44555529,"d":"3.45E+00"}},{"$f":"BU53","v":{"v":5.45300143,"d":"5.45E+00"}},{"$f":"+BV53","v":{"v":1.44758035E-7,"d":"1.45E-07"}},{"v":0,"d":"0.00E+00"},{"v":1.04718514E-5,"d":"1.05E-05"},{"v":-0.00207129469,"d":"-2.07E-03"},{"v":0.0960342755,"d":"9.60E-02"},{"v":-13.1127941,"d":"-1.31E+01"},{"v":1252.21545,"d":"1.25E+03"},{"v":0,"d":"0.00E+00"},{"v":-1.92784983e-08,"d":"-1.93E-08"},{"v":4.35595439e-05,"d":"4.36E-05"},{"v":0.00160950811,"d":"1.61E-03"},{"v":33.3163097,"d":"3.33E+01"},{"v":-5.39743298e-05,"d":"-5.40E-05"},{"v":-0.170452173,"d":"-1.70E-01"},{"v":1296.58697,"d":"1.30E+03"},null,null,{"v":-2.22489082E-3,"d":"-2.22E-03"},{"v":0.170174687,"d":"1.70E-01"},{"v":-17.8214607,"d":"-1.78E+01"},{"v":1149.65376,"d":"1.15E+03"},null,null,{"v":5.05184172e-06,"d":"5.05E-06"},{"v":0.0214307373,"d":"2.14E-02"},{"v":21.3354464,"d":"2.13E+01"},{"v":-6.12490694e-05,"d":"-6.12E-05"},{"v":-0.0720637131,"d":"-7.21E-02"},{"v":1076.34972,"d":"1.08E+03"},null,{"v":4.36848087E-6,"d":"4.37E-06"},{"v":-0.00109748581,"d":"-1.10E-03"},{"v":0.0452535254,"d":"4.53E-02"},{"v":-13.266188,"d":"-1.33E+01"},{"v":1528.58599,"d":"1.53E+03"},null,{"v":-1.52657471E-8,"d":"-1.53E-08"},{"v":3.91115203e-05,"d":"3.91E-05"},{"v":0.0121735851,"d":"1.22E-02"},{"v":39.5921828,"d":"3.96E+01"},{"v":5.60655802e-06,"d":"5.61E-06"},{"v":-0.179528089,"d":"-1.80E-01"},{"v":1375.68904,"d":"1.38E+03"},null,{"v":1.04718514E-5,"d":"1.05E-05"},{"v":-0.00207129469,"d":"-2.07E-03"},{"v":0.0960342755,"d":"9.60E-02"},{"v":-13.1127941,"d":"-1.31E+01"},{"v":1252.21545,"d":"1.25E+03"},null,{"v":-1.92784983e-08,"d":"-1.93E-08"},{"v":4.35595439e-05,"d":"4.36E-05"},{"v":0.00160950811,"d":"1.61E-03"},{"v":33.3163097,"d":"3.33E+01"},{"$f":" -0.0000539743298","v":{"v":-5.39743298e-05,"d":"-5.40E-05"}},{"v":-0.170452173,"d":"-1.70E-01"},{"v":1296.58697,"d":"1.30E+03"},{"v":3.88721551E-8,"d":"3.89E-08"},{"v":-1.82895737e-05,"d":"-1.83E-05"},{"v":0.00276441963,"d":"2.76E-03"},{"v":-0.182628081,"d":"-1.83E-01"},{"v":-1.55862612,"d":"-1.56E+00"},{"v":2525.94722,"d":"2.53E+03"},null,{"v":-2.81778894E-8,"d":"-2.82E-08"},{"v":1.14108626E-4,"d":"1.14E-04"},{"v":-0.0130150701,"d":"-1.30E-02"},{"v":109.837263,"d":"1.10E+02"},{"v":-1.96279548e-05,"d":"-2E-05"},{"v":0.0379306318,"d":"4E-02"},{"v":1904.81004,"d":"2E+03"},55,null,55,null,{"$f":"EX53","v":57},null,57,null,17.5,{"$f":"Tavg_cold","v":17},17.5,17.5,17.5,18.2,17.5,{"$f":"FH53*1.05","v":18.375},17.5,null,0.5,{"v":1.175,"d":"1.18"},1.4700000000000002,{"v":0.49574094030357446,"d":"49.57%"},{"$f":"DU53","v":{"v":1252.21545,"d":"1252.2"}},{"$f":"EI53","v":{"v":2525.94722,"d":"2525.9"}},{"$f":"FP54","v":{"v":0.5685531148984182,"d":"56.86%"}},{"v":1252.21545,"d":"1252.22"},{"v":0,"d":"0.00"},{"v":1089.81206,"d":"1089.81"},{"v":0,"d":"0.00%"},{"v":17.5,"d":"17.50"},{"v":21.150000000000002,"d":"21.15"},{"v":3.650000000000002,"d":"3.65"},{"v":23.520000000000003,"d":"23.52"},{"v":6.020000000000003,"d":"6.02"},{"v":17.5,"d":"17.50"},{"v":17.5,"d":"17.50"},null,15.69066559142683,null,{"v":0,"d":"0.0%"},null,{"v":2334.1781978570243,"d":"2334.18"},{"v":12949.664240814944,"d":"12949.66"},{"v":1167.0890989285122,"d":"1167.09"},{"v":1167.089098928512,"d":"1167.09"},{"v":7.2478490515896785E-3,"d":"0.01"},{"v":7.2478490515896785E-3,"d":"0.01"},{"v":38.49069218350365,"d":"38.49"},{"v":70.12612846626567,"d":"70.13"},{"v":0.09012504704562634,"d":"9%"},null,{"v":3557.0118570174286,"d":"3557.01"},{"v":2435.2319953222577,"d":"2435.23"},{"v":1778.5059285087143,"d":"1778.51"},{"v":1778.5059285087143,"d":"1778.51"},{"v":1778.5059285087143,"d":"1778.51"},{"v":0.011112703645172665,"d":"0.0111"},{"v":0.011112703645172665,"d":"0.0111"},{"v":0.011112703645172665,"d":"0.01"},{"v":55.47783951997643,"d":"55.48"},{"v":55.47783951997643,"d":"55.48"},{"v":49.0025572369271,"d":"49.00"},{"v":19.415087041495514,"d":"19.42"},{"v":19.415087041495514,"d":"19.42"},{"v":2659.531773998441,"d":"2660"},1252.21545,2659.531773998441,17.5,17.5,{"v":2659.531773998441,"d":"2660"},1,{"v":2659.531773998441,"d":"2660"},0.5,{"v":1.175,"d":"1.18"},1.4700000000000002,{"v":0.49574094030357446,"d":"49.57%"},{"v":1252.21545,"d":"1252.2"},{"v":2525.94722,"d":"2525.9"},{"$f":"HR54","v":{"v":0.5685531148984182,"d":"56.86%"}},{"v":1252.21545,"d":"1252.22"},{"v":0,"d":"0.00"},{"v":1089.81206,"d":"1089.81"},{"v":0,"d":"0.00%"},{"v":17.5,"d":"17.50"},{"v":21.150000000000002,"d":"21.15"},{"v":3.650000000000002,"d":"3.65"},{"v":23.520000000000003,"d":"23.52"},{"v":6.020000000000003,"d":"6.02"},{"v":17.5,"d":"17.50"},{"v":17.5,"d":"17.50"},null,15.69066559142683,null,{"v":0.16579836172705312,"d":"16.6%"},null,{"v":2334.1781978570243,"d":"2334.18"},{"v":12949.664240814944,"d":"12949.66"}]
[null,{"v":1,"d":"100%"},10,{"v":15024.990994875396,"d":"15025"},1292,{"v":20.48999112883085,"d":"20.5"},{"v":3023.1352867120613,"d":"3023"},{"v":3023.1352867120613,"d":"3023"},{"$f":"IF(Geg_dP<AB54,ROUND(((IF('Briza 22 & 26'!$M$4=\"High Perform. 208/230V (US/EU)\",cal!HK54,H54)/Watts)/((Tr_cool-Tv_cool)*1.163))*FlowH2O,IF(UnitsNo=1,0,IF(UnitsNo=2,2))),\"\")","v":1300},{"v":20.774434419645953,"d":"20.8"},{"v":51,"d":"51.0"},{"$f":"IF(Geg_dP<$AB54,IF(CalcNo=\"12\",$ET54,IF(CalcNo=\"22\",$ET54,IF(CalcNo=\"13\",$EU54,IF(CalcNo=\"23\",$EU54,IF(CalcNo=\"11\",$ER54,IF(CalcNo=\"21\",$ER54,IF(CalcNo=\"14\",$ES54,IF(CalcNo=\"24\",$ES54,IF(CalcNo=\"32\",$EX54,IF(CalcNo=\"42\",$EX54,IF(CalcNo=\"33\",$EY54,IF(CalcNo=\"43\",$EY54,IF(CalcNo=\"31\",$EV54,IF(CalcNo=\"41\",$EV54,IF(CalcNo=\"34\",$EW54,IF(CalcNo=\"44\",$EW54,)))))))))))))))),\"\")","v":{"v":59,"d":"59.0"}},{"$f":"IF(Geg_dP<$AB54,($CF54*(($N54*CFMs)^4))+($CG54*(($N54*CFMs)^3))+($CH54*(($N54*CFMs)^2))+($CI54*($N54*CFMs))+$CJ54,\"\")","v":{"v":95.03387554408134,"d":"95.0"}},{"v":1436.13516,"d":"1436"},{"v":1.169872238514174,"d":"1.17"},{"v":50.709637756320284,"d":"50.7"},{"v":23.450844282935535,"d":"23.5"},{"v":20.743372478217854,"d":"20.7"},{"v":17.392889922423276,"d":"17.4"},{"v":0.727817095162741,"d":"73%"},{"v":1126.110007110515,"d":"1126"},{"v":0.2382240623916574,"d":"0.24"},{"v":2.1050492815119584,"d":"2.105"},0.98023,1.29011,1.0896,0.98023,119.78,0.98023,1.29011,1.0896,{"v":90,"d":"90.00"},0.98023,1.29011,1.0896,{"v":134,"d":"134.00"},0.98023,1.29011,1.0896,119.78,1.0115144976993358,1.35606862651545,1.09,{"$f":"AR53","v":213.64},0.98023,1.29011,1.0896,{"v":90,"d":"90.00"},0.98023,1.29011,1.0896,{"v":134,"d":"134.00"},0.9802277199313987,1.2901116929825902,1.091482988399473,119.78,0.9834917127786522,0.9132397252503823,1.0947469812467265,213.64,null,null,{"v":-44.5873327,"d":"-4.46E+01"},{"v":-67.2983279,"d":"-6.73E+01"},{"v":2.23342,"d":"2.23E+00"},{"v":-44.5873327,"d":"-4.46E+01"},{"v":-67.2983279,"d":"-6.73E+01"},{"v":2.23342,"d":"2.23E+00"},{"v":284.66594,"d":"2.85E+02"},{"$f":"BO54","v":{"v":-67.2983279,"d":"-6.73E+01"}},{"$f":"+BP54","v":{"v":2.23342,"d":"2.23E+00"}},{"v":-38.7146223,"d":"-3.87E+01"},{"v":-22.8575751,"d":"-2.29E+01"},{"v":2.514766,"d":"2.51E+00"},{"$f":"BQ54","v":{"v":284.66594,"d":"2.85E+02"}},{"$f":"BU54","v":{"v":-22.8575751,"d":"-2.29E+01"}},{"$f":"+BV54","v":{"v":2.514766,"d":"2.51E+00"}},{"v":0,"d":"0.00E+00"},{"v":2.23064691E-6,"d":"2.23E-06"},{"v":-6.05070076E-4,"d":"-6.05E-04"},{"v":0.0327422701,"d":"3.27E-02"},{"v":-10.7552222,"d":"-1.08E+01"},{"v":1436.13516,"d":"1.44E+03"},{"v":0,"d":"0.00E+00"},{"v":-8.8102702e-08,"d":"-8.81E-08"},{"v":0.000133619669,"d":"1.34E-04"},{"v":0.00616452711,"d":"6.16E-03"},{"v":47.5621164,"d":"4.76E+01"},{"v":-3.04172464E-5,"d":"-3.04E-05"},{"v":-0.217786307,"d":"-2.18E-01"},{"v":1501.61567,"d":"1.50E+03"},null,null,{"v":-0.0013712954,"d":"-1.37E-03"},{"v":0.138490723,"d":"1.38E-01"},{"v":-16.2009446,"d":"-1.62E+01"},{"v":1331.46073,"d":"1.33E+03"},null,null,{"v":1.58921296e-05,"d":"1.59E-05"},{"v":0.04372711,"d":"4.37E-02"},{"v":29.3877633,"d":"2.94E+01"},{"v":-4.87173314E-5,"d":"-4.87E-05"},{"v":-0.0882624891,"d":"-8.83E-02"},{"v":1241.21607,"d":"1.24E+03"},null,{"v":-1.38044212e-07,"d":"-1.38E-07"},{"v":-3.4017782e-05,"d":"-3.40E-05"},{"v":-0.0146168811,"d":"-1.46E-02"},{"v":-10.047478,"d":"-1.00E+01"},{"v":1756.34247,"d":"1.76E+03"},null,{"v":-8.34640627e-08,"d":"-8.35E-08"},{"v":0.000140637884,"d":"1.41E-04"},{"v":0.02103509,"d":"2.10E-02"},{"v":58.3067474,"d":"5.83E+01"},{"v":-6.02511174e-06,"d":"-6.03E-06"},{"v":-0.18736331,"d":"-1.87E-01"},{"v":1593.85138,"d":"1.59E+03"},null,{"v":2.23064691E-6,"d":"2.23E-06"},{"v":-6.05070076E-4,"d":"-6.05E-04"},{"v":0.0327422701,"d":"3.27E-02"},{"v":-10.7552222,"d":"-1.08E+01"},{"v":1436.13516,"d":"1.44E+03"},null,{"v":-8.8102702e-08,"d":"-8.81E-08"},{"v":0.000133619669,"d":"1.34E-04"},{"v":0.00616452711,"d":"6.16E-03"},{"v":47.5621164,"d":"4.76E+01"},{"v":-3.04172464E-5,"d":"-3.04E-05"},{"v":-0.217786307,"d":"-2.18E-01"},{"v":1501.61567,"d":"1.50E+03"},{"$f":"ED53","v":{"v":3.88721551E-8,"d":"3.89E-08"}},{"v":-1.82895737e-05,"d":"-1.83E-05"},{"v":0.00276441963,"d":"2.76E-03"},{"v":-0.182628081,"d":"-1.83E-01"},{"v":-1.55862612,"d":"-1.56E+00"},{"v":2525.94722,"d":"2.53E+03"},{"$f":"EJ53","v":0},{"v":-2.81778894E-8,"d":"-2.82E-08"},{"v":1.14108626E-4,"d":"1.14E-04"},{"v":-0.0130150701,"d":"-1.30E-02"},{"v":109.837263,"d":"1.10E+02"},{"v":-1.96279548e-05,"d":"-2E-05"},{"v":0.0379306318,"d":"4E-02"},{"v":1904.81004,"d":"2E+03"},59,null,59,null,{"$f":"EX54","v":59.5},null,59.5,null,17.5,{"$f":"Tavg_cold","v":17},17.5,17.5,17.5,18.2,17.5,{"$f":"FH54*1.05","v":18.375},17.5,null,0.5,{"v":1.175,"d":"1.18"},1.4700000000000002,{"v":0.5685531148984182,"d":"56.86%"},{"$f":"DU54","v":{"v":1436.13516,"d":"1436.1"}},{"$f":"EI54","v":{"v":2525.94722,"d":"2525.9"}},{"$f":"FN54/FO54","v":{"v":0.5685531148984182,"d":"56.86%"}},{"v":1436.13516,"d":"1436.14"},{"v":0,"d":"0.00"},{"v":1089.81206,"d":"1089.81"},{"v":0,"d":"0.00%"},{"$f":"FC54","v":{"v":17.5,"d":"17.50"}},{"v":21.150000000000002,"d":"21.15"},{"$f":"ABS(FV54-FU54)","v":{"v":3.650000000000002,"d":"3.65"}},{"v":23.520000000000003,"d":"23.52"},{"$f":"ABS(FX54-FU54)","v":{"v":6.020000000000003,"d":"6.02"}},{"$f":"IF(FM54<=FP54,FU54,FU54+(FT54*FW54))","v":{"v":17.5,"d":"17.50"}},{"v":17.5,"d":"17.50"},null,15.69066559142683,null,{"v":0,"d":"0.0%"},null,{"v":2334.1781978570243,"d":"2334.18"},{"v":12728.457318135052,"d":"12728.46"},{"v":1167.0890989285122,"d":"1167.09"},{"v":1167.089098928512,"d":"1167.09"},{"v":7.2478490515896785E-3,"d":"0.01"},{"v":7.2478490515896785E-3,"d":"0.01"},{"v":38.49069218350365,"d":"38.49"},{"v":69.77010051992386,"d":"69.77"},{"v":0.09169132360334704,"d":"9%"},null,{"v":3557.0118570174286,"d":"3557.01"},{"v":2443.616590389427,"d":"2443.62"},{"v":1778.5059285087143,"d":"1778.51"},{"v":1778.5059285087143,"d":"1778.51"},{"v":1778.5059285087143,"d":"1778.51"},{"v":0.011112703645172665,"d":"0.0111"},{"v":0.011112703645172665,"d":"0.0111"},{"v":0.011112703645172665,"d":"0.01"},{"v":55.47783951997643,"d":"55.48"},{"v":55.47783951997643,"d":"55.48"},{"v":49.05991141182059,"d":"49.06"},{"v":19.415087041495514,"d":"19.42"},{"v":19.415087041495514,"d":"19.42"},{"v":3023.1352867120613,"d":"3023"},1436.13516,3023.1352867120613,17.5,17.5,{"v":3023.1352867120613,"d":"3023"},1,{"v":3023.1352867120613,"d":"3023"},0.5,{"v":1.175,"d":"1.18"},1.4700000000000002,{"v":0.5685531148984182,"d":"56.86%"},{"v":1436.13516,"d":"1436.1"},{"v":2525.94722,"d":"2525.9"},{"$f":"HP54/HQ54","v":{"v":0.5685531148984182,"d":"56.86%"}},{"v":1436.13516,"d":"1436.14"},{"v":0,"d":"0.00"},{"v":1089.81206,"d":"1089.81"},{"v":0,"d":"0.00%"},{"v":17.5,"d":"17.50"},{"v":21.150000000000002,"d":"21.15"},{"$f":"ABS(HX54-HW54)","v":{"v":3.650000000000002,"d":"3.65"}},{"v":23.520000000000003,"d":"23.52"},{"$f":"ABS(HZ54-HW54)","v":{"v":6.020000000000003,"d":"6.02"}},{"$f":"IF(HO54<=HR54,HW54,HW54+(HV54*HY54))","v":{"v":17.5,"d":"17.50"}},{"v":17.5,"d":"17.50"},null,15.69066559142683,null,{"v":0.16579836172705312,"d":"16.6%"},null,{"v":2334.1781978570243,"d":"2334.18"},{"v":12728.457318135052,"d":"12728.46"}]
[null,{"$f":"IF(LangNo=1,NL!A55,IF(LangNo=2,EN!A55,IF(LangNo=3,DE!A55,IF(LangNo=4,FR!A55,IF(LangNo=5,NR!A55,IF(LangNo=6,SP!A55,IF(LangNo=7,SW!A55,IF(LangNo=8,TS!A55,IF(LangNo=9,ExtraTaal1!A55,IF(LangNo=10,ExtraTaal2!A55,IF(LangNo=11,ExtraTaal3!A55,)))))))))))","v":"Briza 22 (230V) height 54,5 cm, width 22 cm, length 190 cm (Type 10)"},{"$nulls":24},0,"m³/h","n-value","n-value","n-value","m³/h","n-value","n-value","n-value","m³/h","n-value","n-value","n-value","m³/h","n-value","n-value","n-value","m³/h","n-value","n-value","n-value","m³/h","n-value","n-value","n-value","m³/h","n-value","n-value","n-value","m³/h","n-value","n-value","n-value","m³/h",null,{"$f":"IF($BK$17=\"11\",BO55,IF($BK$17=\"21\",BR55,IF($BK$17=\"12\",BO55,IF($BK$17=\"22\",BR55,IF($BK$17=\"13\",BO55,IF($BK$17=\"23\",BR55,IF($BK$17=\"14\",BO55,IF($BK$17=\"24\",BR55,IF($BK$17=\"31\",BU55,IF($BK$17=\"41\",BX55,IF($BK$17=\"32\",BU55,IF($BK$17=\"42\",BX55,IF($BK$17=\"33\",BU55,IF($BK$17=\"43\",BX55,IF($BK$17=\"34\",BU55,IF($BK$17=\"44\",BX55,))))))))))))))))","v":22},{"$f":"(BN55+IF(CaseNo=1,0,IF(CaseNo=2,$BN$2,)))*MilInch","v":54.5},{"$f":"(BJ55+IF(CaseNo=1,0,IF(CaseNo=2,$BN$3,)))*MilInch","v":22},{"$f":"(BP55+IF(CaseNo=1,0,IF(CaseNo=2,$BN$4,)))*MilInch","v":155},54.5,22,155,54.5,22,155,54.5,26,155,54.5,26,155,{"$f":"CF55","v":"T10"},{"$nulls":5},"T10",{"$nulls":7},{"$f":"CF55","v":"T10"},{"$nulls":13},{"$f":"CF55","v":"T10"},{"$nulls":13},{"$f":"CF55","v":"T10"},{"$nulls":13},{"$f":"CF55","v":"T10"},{"$nulls":13},"T10",{"$nulls":8},{"$f":"ER55","v":"T10"},{"$nulls":54},0,{"$error":"#VALUE!"},{"$f":"IF(Geg_dP<$AB55,((($BL$18*($HE55/Cubics)^4+$BL$19*($HE55/Cubics)^3+$BL$20*($HE55/Cubics)^2+$BL$21*($HE55/Cubics)^1+$BL$22)*((CF_Regime_Cool_noExp)^$Y55)))*CF_Addit*Watts*CF_Altit,Lim_dP)","v":{"$error":"#VALUE!"}},{"$error":"#VALUE!"},{"$error":"#VALUE!"},{"$error":"#VALUE!"},{"$error":"#VALUE!"},{"$error":"#VALUE!"},"T10"]
[null,{"$f":"IF($AL$5=1,$C56/10,IF($AL$5=2,$C56/10,IF($AL$5=3,0,IF($AL$5=4,$C56/10,))))","v":{"v":0.2,"d":"20%"}},2,{"$f":"IF(Geg_dP<AB56,((($BK$56*($N56/Cubics)^4+$BK$57*($N56/Cubics)^3+$BK$59*($N56/Cubics)^2+$BK$61*($N56/Cubics)^1+$BK$62)*((CF_Regime_Heat_noExp)^$AA56)))*CF_Addit*Watts*CF_Altit,Lim_dP)","v":{"v":7001.651370405772,"d":"7002"}},{"$f":"IF(Geg_dP<$AB56,ROUND((($D56/Watts)/((Tv_heat-Tr_heat)*1.163))*FlowH2O,IF(UnitsNo=1,0,IF(UnitsNo=2,2))),\"\")","v":602},{"$f":"IF(Geg_dP<$AB56,IF((($BM$56*(E56/FlowH2O)^$BM$57))*kPa>0,(($BM$56*(E56/FlowH2O)^$BM$57))*kPa,0),\"\")","v":{"v":3.8851789025636574,"d":"3.9"}},{"$f":"IF(Geg_dP<$AB56,((($BL$56*($N56/Cubics)^4+$BL$57*($N56/Cubics)^3+$BL$59*($N56/Cubics)^2+$BL$61*($N56/Cubics)^1+$BL$62)*((CF_Regime_Cool_noExp)^$Y56)))*CF_Addit*Watts*CF_Altit,Lim_dP)","v":{"v":1449.7076355441104,"d":"1450"}},{"$f":"IF(Geg_dP<$AB56,((G56/Watts)/(IF((237.3*LN((RH*EXP(17.27*(Tl_cool/(Tl_cool+237.3))))))/(17.27-LN((RH*EXP(17.27*(Tl_cool/(Tl_cool+237.3))))))<EZ56,1,IF(1/(1+((2258*((0.622/((101325/(1*611*EXP(17.27*(EZ56/(EZ56+237.3))))))-1)*1000-(0.622/((101325/(RH*611*EXP(17.27*(Tl_cool/(Tl_cool+237.3))))))-1)*1000))/(1005*(Tavg_cold-Tl_cool))))>1,1,1/(1+((2258*((0.622/((101325/(1*611*EXP(17.27*(EZ56/(EZ56+237.3))))))-1)*1000-(0.622/((101325/(RH*611*EXP(17.27*(Tl_cool/(Tl_cool+237.3))))))-1)*1000))/(1005*(Tavg_cold-Tl_cool))))))))*Watts,\"\")","v":{"v":1449.7076355441104,"d":"1450"}},{"$f":"IF(Geg_dP<AB56,ROUND(((IF('Briza 22 & 26'!$M$4=\"High Perform. 208/230V (US/EU)\",cal!HK56,H56)/Watts)/((Tr_cool-Tv_cool)*1.163))*FlowH2O,IF(UnitsNo=1,0,IF(UnitsNo=2,2))),\"\")","v":623},{"$f":"IF(Geg_dP<$AB56,IF((($BM$61*(I56/FlowH2O)^$BM$62))*kPa>0,(($BM$61*(I56/FlowH2O)^$BM$62))*kPa,0),\"\")","v":{"v":4.135526212292623,"d":"4.1"}},{"$f":"IF(Geg_dP<AB56,IF($L56-8<0,0,$L56-8),\"\")","v":31.5},{"$f":"IF(Geg_dP<$AB56,IF(CalcNo=\"12\",$ET56,IF(CalcNo=\"22\",$ET56,IF(CalcNo=\"13\",$EU56,IF(CalcNo=\"23\",$EU56,IF(CalcNo=\"11\",$ER56,IF(CalcNo=\"21\",$ER56,IF(CalcNo=\"14\",$ES56,IF(CalcNo=\"24\",$ES56,IF(CalcNo=\"32\",$EX56,IF(CalcNo=\"42\",$EX56,IF(CalcNo=\"33\",$EY56,IF(CalcNo=\"43\",$EY56,IF(CalcNo=\"31\",$EV56,IF(CalcNo=\"41\",$EV56,IF(CalcNo=\"34\",$EW56,IF(CalcNo=\"44\",$EW56,)))))))))))))))),\"\")","v":39.5},{"$f":"IF(Geg_dP<$AB56,($CF56*(($N56/Cubics)^4))+($CG56*(($N56/Cubics)^3))+($CH56*(($N56/Cubics)^2))+($CI56*($N56/Cubics))+$CJ56,\"\")","v":{"v":11.09810395803566,"d":"11.1"}},{"$f":"IF(Geg_dP<$AB56,(BZ56*Geg_dP^5+CA56*Geg_dP^4+CB56*Geg_dP^3+CC56*Geg_dP^2+CD56*Geg_dP+CE56)*CF_Case*Cubics,\"\")","v":{"v":548.888779,"d":"549"}},{"$f":"IF(Geg_dP<$AB56,(($N56/Cubics)/3600)/(($BJ$63/100)*($BP$63/100))*FeetMins,\"\")","v":{"v":0.364758625066454,"d":"0.36"}},{"$f":"IF(Geg_dP<$AB56,((($D56/Watts)/(((p_atm*0.028964)/(8.31447*(20+273.15)))*(($N56/3600)/Cubics)*(1005+1870*((0.622)/(((p_atm)/($E$14*pvs_heat_in))-1)))))+Tl_heat)*Celc1+Celc2,\"\")","v":{"v":57.443110362034005,"d":"57.4"}},{"$f":"IF(Geg_dP<$AB56,(27.8*LN(($GN56+36)/45.5))*Celc1+Celc2,\"\")","v":{"v":25.197433163867775,"d":"25.2"}},{"$f":"IF(Geg_dP<$AB56,(Tl_cool-(($G56/Watts)/(1006*$N56*kgss)))*Celc1+Celc2,\"\")","v":{"v":19.14991956153699,"d":"19.1"}},{"$f":"IF(Geg_dP<$AB56,IF((27.8*LN(($HA56+36)/45.5))*Celc1+Celc2>R56,R56,(27.8*LN(($HA56+36)/45.5))*Celc1+Celc2),\"\")","v":{"v":16.853478410130663,"d":"16.9"}},{"$f":"IF(Geg_dP<$AB56,IF($H56>$G56,1,IF(($GT56/$GR56)<0,0,$GT56/$GR56)),\"\")","v":{"v":0.8031893880966785,"d":"80%"}},{"$f":"IF(Geg_dP<$AB56,$CK56*($N56/Cubics)^2+$CL56*($N56/Cubics)^1+$CM56,\"\")","v":{"v":430.1229121550759,"d":"430"}},{"$f":"M56/((N56/Cubics)/3.6)","v":{"v":0.0727891984268973,"d":"0.07"}},{"$f":"(G56/Watts)/(N56/Cubics)","v":{"v":2.6411682858324754,"d":"2.641"}},0.981618,1.2733,1.09292,0.981618,6.4822500000000005,0.981618,1.2733,1.09292,{"v":5,"d":"5.00"},0.981618,1.2733,1.09292,{"v":8,"d":"8.00"},0.981618,1.2733,1.09292,{"v":6.4822500000000005,"d":"6.48"},0.995474215844912,1.174754876804744,1.1067294843129272,{"v":22.425,"d":"22.43"},0.981618,1.2733,1.09292,{"v":5,"d":"5.00"},0.981618,1.2733,1.09292,{"v":8,"d":"8.00"},1.0049716964208173,1.2385624038262057,1.1162269648888619,{"v":6.4822500000000005,"d":"6.48"},0.9693677323903813,1.070246709143203,1.0806230008584556,{"v":22.425,"d":"22.43"},null,null,{"$f":"IF($BK$17=\"11\",BN56,IF($BK$17=\"21\",BQ56,IF($BK$17=\"12\",BN56,IF($BK$17=\"22\",BQ56,IF($BK$17=\"13\",BN56,IF($BK$17=\"23\",BQ56,IF($BK$17=\"14\",BN56,IF($BK$17=\"24\",BQ56,IF($BK$17=\"31\",BT56,IF($BK$17=\"41\",BW56,IF($BK$17=\"32\",BT56,IF($BK$17=\"42\",BW56,IF($BK$17=\"33\",BT56,IF($BK$17=\"43\",BW56,IF($BK$17=\"34\",BT56,IF($BK$17=\"44\",BW56,))))))))))))))))","v":{"v":0,"d":"0.00E+00"}},{"v":0,"d":"0.00E+00"},{"v":3.36782e-05,"d":"3.37E-05"},null,null,{"$f":"BP61","v":{"v":3.36782e-05,"d":"3.37E-05"}},null,{"$f":"BO56","v":0},{"v":2.0022897829E-4,"d":"2.00E-04"},null,null,{"$f":"BV61","v":{"v":1.620434e-05,"d":"1.62E-05"}},null,null,{"$f":"BS56","v":{"v":2.0022897829E-4,"d":"2.00E-04"}},{"$f":"IF($BK$17=\"11\",CN56,IF($BK$17=\"21\",CN56,IF($BK$17=\"12\",DP56,IF($BK$17=\"22\",DP56,IF($BK$17=\"13\",ED56,IF($BK$17=\"23\",ED56,IF($BK$17=\"14\",DB56,IF($BK$17=\"24\",DB56,IF($BK$17=\"31\",CN56,IF($BK$17=\"41\",CN56,IF($BK$17=\"32\",DP56,IF($BK$17=\"42\",DP56,IF($BK$17=\"33\",ED56,IF($BK$17=\"43\",ED56,IF($BK$17=\"34\",DB56,IF($BK$17=\"44\",DB56,))))))))))))))))","v":{"v":0,"d":"0.00E+00"}},{"v":0,"d":"0.00E+00"},{"$f":"IF($BK$17=\"11\",CP56,IF($BK$17=\"21\",CP56,IF($BK$17=\"12\",DR56,IF($BK$17=\"22\",DR56,IF($BK$17=\"13\",EF56,IF($BK$17=\"23\",EF56,IF($BK$17=\"14\",DD56,IF($BK$17=\"24\",DD56,IF($BK$17=\"31\",CP56,IF($BK$17=\"41\",CP56,IF($BK$17=\"32\",DR56,IF($BK$17=\"42\",DR56,IF($BK$17=\"33\",EF56,IF($BK$17=\"43\",EF56,IF($BK$17=\"34\",DD56,IF($BK$17=\"44\",DD56,))))))))))))))))","v":{"v":-0.826505757,"d":"-8.27E-01"}},{"$f":"IF($BK$17=\"11\",CQ56,IF($BK$17=\"21\",CQ56,IF($BK$17=\"12\",DS56,IF($BK$17=\"22\",DS56,IF($BK$17=\"13\",EG56,IF($BK$17=\"23\",EG56,IF($BK$17=\"14\",DE56,IF($BK$17=\"24\",DE56,IF($BK$17=\"31\",CQ56,IF($BK$17=\"41\",CQ56,IF($BK$17=\"32\",DS56,IF($BK$17=\"42\",DS56,IF($BK$17=\"33\",EG56,IF($BK$17=\"43\",EG56,IF($BK$17=\"34\",DE56,IF($BK$17=\"44\",DE56,))))))))))))))))","v":{"v":7.39554991,"d":"7.40E+00"}},{"$f":"IF($BK$17=\"11\",CR56,IF($BK$17=\"21\",CR56,IF($BK$17=\"12\",DT56,IF($BK$17=\"22\",DT56,IF($BK$17=\"13\",EH56,IF($BK$17=\"23\",EH56,IF($BK$17=\"14\",DF56,IF($BK$17=\"24\",DF56,IF($BK$17=\"31\",CR56,IF($BK$17=\"41\",CR56,IF($BK$17=\"32\",DT56,IF($BK$17=\"42\",DT56,IF($BK$17=\"33\",EH56,IF($BK$17=\"43\",EH56,IF($BK$17=\"34\",DF56,IF($BK$17=\"44\",DF56,))))))))))))))))","v":{"v":-53.6987255,"d":"-5.37E+01"}},{"$f":"IF($BK$17=\"11\",CS56,IF($BK$17=\"21\",CS56,IF($BK$17=\"12\",DU56,IF($BK$17=\"22\",DU56,IF($BK$17=\"13\",EI56,IF($BK$17=\"23\",EI56,IF($BK$17=\"14\",DG56,IF($BK$17=\"24\",DG56,IF($BK$17=\"31\",CS56,IF($BK$17=\"41\",CS56,IF($BK$17=\"32\",DU56,IF($BK$17=\"42\",DU56,IF($BK$17=\"33\",EI56,IF($BK$17=\"43\",EI56,IF($BK$17=\"34\",DG56,IF($BK$17=\"44\",DG56,))))))))))))))))","v":{"v":548.888779,"d":"5.49E+02"}},{"$f":"IF($BK$17=\"11\",CT56,IF($BK$17=\"21\",CT56,IF($BK$17=\"12\",DV56,IF($BK$17=\"22\",DV56,IF($BK$17=\"13\",EJ56,IF($BK$17=\"23\",EJ56,IF($BK$17=\"14\",DH56,IF($BK$17=\"24\",DH56,IF($BK$17=\"31\",CT56,IF($BK$17=\"41\",CT56,IF($BK$17=\"32\",DV56,IF($BK$17=\"42\",DV56,IF($BK$17=\"33\",EJ56,IF($BK$17=\"43\",EJ56,IF($BK$17=\"34\",DH56,IF($BK$17=\"44\",DH56,))))))))))))))))","v":{"v":0,"d":"0.00E+00"}},{"$f":"IF($BK$17=\"11\",CU56,IF($BK$17=\"21\",CU56,IF($BK$17=\"12\",DW56,IF($BK$17=\"22\",DW56,IF($BK$17=\"13\",EK56,IF($BK$17=\"23\",EK56,IF($BK$17=\"14\",DI56,IF($BK$17=\"24\",DI56,IF($BK$17=\"31\",CU56,IF($BK$17=\"41\",CU56,IF($BK$17=\"32\",DW56,IF($BK$17=\"42\",DW56,IF($BK$17=\"33\",EK56,IF($BK$17=\"43\",EK56,IF($BK$17=\"34\",DI56,IF($BK$17=\"44\",DI56,))))))))))))))))","v":{"v":1.70416543e-07,"d":"1.70E-07"}},{"$f":"IF($BK$17=\"11\",CV56,IF($BK$17=\"21\",CV56,IF($BK$17=\"12\",DX56,IF($BK$17=\"22\",DX56,IF($BK$17=\"13\",EL56,IF($BK$17=\"23\",EL56,IF($BK$17=\"14\",DJ56,IF($BK$17=\"24\",DJ56,IF($BK$17=\"31\",CV56,IF($BK$17=\"41\",CV56,IF($BK$17=\"32\",DX56,IF($BK$17=\"42\",DX56,IF($BK$17=\"33\",EL56,IF($BK$17=\"43\",EL56,IF($BK$17=\"34\",DJ56,IF($BK$17=\"44\",DJ56,))))))))))))))))","v":{"v":-0.000230092166,"d":"-2.30E-04"}},{"$f":"IF($BK$17=\"11\",CW56,IF($BK$17=\"21\",CW56,IF($BK$17=\"12\",DY56,IF($BK$17=\"22\",DY56,IF($BK$17=\"13\",EM56,IF($BK$17=\"23\",EM56,IF($BK$17=\"14\",DK56,IF($BK$17=\"24\",DK56,IF($BK$17=\"31\",CW56,IF($BK$17=\"41\",CW56,IF($BK$17=\"32\",DY56,IF($BK$17=\"42\",DY56,IF($BK$17=\"33\",EM56,IF($BK$17=\"43\",EM56,IF($BK$17=\"34\",DK56,IF($BK$17=\"44\",DK56,))))))))))))))))","v":{"v":0.106463551,"d":"1.06E-01"}},{"$f":"IF($BK$17=\"11\",CX56,IF($BK$17=\"21\",CX56,IF($BK$17=\"12\",DZ56,IF($BK$17=\"22\",DZ56,IF($BK$17=\"13\",EN56,IF($BK$17=\"23\",EN56,IF($BK$17=\"14\",DL56,IF($BK$17=\"24\",DL56,IF($BK$17=\"31\",CX56,IF($BK$17=\"41\",CX56,IF($BK$17=\"32\",DZ56,IF($BK$17=\"42\",DZ56,IF($BK$17=\"33\",EN56,IF($BK$17=\"43\",EN56,IF($BK$17=\"34\",DL56,IF($BK$17=\"44\",DL56,))))))))))))))))","v":{"v":-6.19817744,"d":"-6.20E+00"}},{"$f":"IF($BK$17=\"11\",CY56,IF($BK$17=\"21\",CY56,IF($BK$17=\"12\",EA56,IF($BK$17=\"22\",EA56,IF($BK$17=\"13\",EO56,IF($BK$17=\"23\",EO56,IF($BK$17=\"14\",DM56,IF($BK$17=\"24\",DM56,IF($BK$17=\"31\",CY56,IF($BK$17=\"41\",CY56,IF($BK$17=\"32\",EA56,IF($BK$17=\"42\",EA56,IF($BK$17=\"33\",EO56,IF($BK$17=\"43\",EO56,IF($BK$17=\"34\",DM56,IF($BK$17=\"44\",DM56,))))))))))))))))","v":{"v":0,"d":"0.00E+00"}},{"$f":"IF($BK$17=\"11\",CZ56,IF($BK$17=\"21\",CZ56,IF($BK$17=\"12\",EB56,IF($BK$17=\"22\",EB56,IF($BK$17=\"13\",EP56,IF($BK$17=\"23\",EP56,IF($BK$17=\"14\",DN56,IF($BK$17=\"24\",DN56,IF($BK$17=\"31\",CZ56,IF($BK$17=\"41\",CZ56,IF($BK$17=\"32\",EB56,IF($BK$17=\"42\",EB56,IF($BK$17=\"33\",EP56,IF($BK$17=\"43\",EP56,IF($BK$17=\"34\",DN56,IF($BK$17=\"44\",DN56,))))))))))))))))","v":{"v":-0.109500185,"d":"-1.10E-01"}},{"$f":"IF($BK$17=\"11\",DA56,IF($BK$17=\"21\",DA56,IF($BK$17=\"12\",EC56,IF($BK$17=\"22\",EC56,IF($BK$17=\"13\",EQ56,IF($BK$17=\"23\",EQ56,IF($BK$17=\"14\",DO56,IF($BK$17=\"24\",DO56,IF($BK$17=\"31\",DA56,IF($BK$17=\"41\",DA56,IF($BK$17=\"32\",EC56,IF($BK$17=\"42\",EC56,IF($BK$17=\"33\",EQ56,IF($BK$17=\"43\",EQ56,IF($BK$17=\"34\",DO56,IF($BK$17=\"44\",DO56,))))))))))))))))","v":{"v":490.226335,"d":"4.90E+02"}},null,null,{"v":-8.44008056,"d":"-8.44E+00"},{"v":25.3497292,"d":"2.53E+01"},{"v":-55.6997204,"d":"-5.57E+01"},{"v":350.029752,"d":"3.50E+02"},{"$nulls":3},{"v":2.94996535E-3,"d":"2.95E-03"},{"v":7.01110188,"d":"7.01E+00"},null,{"v":-0.0745012995,"d":"-7.45E-02"},{"v":349.072824,"d":"3.49E+02"},null,{"v":0.0175153892,"d":"1.75E-02"},{"v":-0.309947563,"d":"-3.10E-01"},{"v":1.50750251,"d":"1.51E+00"},{"v":-44.9340674,"d":"-4.49E+01"},{"v":402.511797,"d":"4.03E+02"},null,{"v":-2.13538697E-8,"d":"-2.14E-08"},{"v":1.59440791E-5,"d":"1.59E-05"},{"v":0.000560939863,"d":"5.61E-04"},{"v":8.42415128,"d":"8.42E+00"},{"v":-1.05558322E-4,"d":"-1.06E-04"},{"v":0.00129387526,"d":"1.29E-03"},{"v":499.040096,"d":"4.99E+02"},null,null,{"v":-0.826505757,"d":"-8.27E-01"},{"v":7.39554991,"d":"7.40E+00"},{"v":-53.6987255,"d":"-5.37E+01"},{"v":548.888779,"d":"5.49E+02"},null,{"v":1.70416543e-07,"d":"1.70E-07"},{"v":-0.000230092166,"d":"-2.30E-04"},{"v":0.106463551,"d":"1.06E-01"},{"v":-6.19817744,"d":"-6.20E+00"},null,{"v":-0.109500185,"d":"-1.10E-01"},{"v":490.226335,"d":"4.90E+02"},null,null,{"v":0.0686553531,"d":"6.87E-02"},{"v":-1.22427652,"d":"-1.22E+00"},{"v":-30.3331519,"d":"-3.03E+01"},{"v":901.4701,"d":"9.01E+02"},null,{"v":9.19709831e-08,"d":"9.20E-08"},{"v":-1.90115219E-4,"d":"-1.90E-04"},{"v":0.138063562,"d":"1.38E-01"},{"v":-11.4368091,"d":"-1.14E+01"},null,{"v":-0.0209147267,"d":"-2E-02"},{"v":635.764592,"d":"6E+02"},39.5,null,39.5,null,{"$f":"EX56","v":37},null,37,null,{"$f":"IF($BK$17=\"11\",FA56,IF($BK$17=\"21\",FA56,IF($BK$17=\"12\",FC56,IF($BK$17=\"22\",FC56,IF($BK$17=\"13\",FD56,IF($BK$17=\"23\",FD56,IF($BK$17=\"14\",FB56,IF($BK$17=\"24\",FB56,IF($BK$17=\"31\",FE56,IF($BK$17=\"41\",FE56,IF($BK$17=\"32\",FG56,IF($BK$17=\"42\",FG56,IF($BK$17=\"33\",FH56,IF($BK$17=\"43\",FH56,IF($BK$17=\"34\",FF56,IF($BK$17=\"44\",FF56,))))))))))))))))","v":17.5},{"$f":"Tavg_cold","v":17},{"$f":"IF($GC56<=$FC56,$FC56,IF($FM56<=$FP56,$FC56,$FZ56))","v":17.5},{"$f":"IF($N56>$FN56,Tavg_cold+(0.5*(Tr_cool-Tavg_cold)),Tavg_cold+($FJ56*(Tr_cool-Tavg_cold)))","v":17.5},{"$f":"IF($GC56<=$FC56,$FC56,IF($FM56<=$FP56,$FC56,$FZ56))","v":17.5},{"$f":"FH56*1.04","v":18.2},{"$f":"IF($GC56<=$FU56,$FU56,IF($FM56<=$FP56,Tavg_cold,$GA56))","v":17.5},{"$f":"FH56*1.05","v":18.375},{"$f":"IF($GC56<=$FU56,$FU56,IF($FM56<=$FP56,Tavg_cold,$GA56))","v":17.5},null,{"$f":"0.5*(1-((FN56-N56)/FN56))","v":0.5},{"$f":"(0.025*Tl_cool)+0.3075","v":{"v":0.9825,"d":"0.98"}},{"$f":"(0.13*Tl_cool)-2.04","v":1.4700000000000002},{"$f":"FQ56/FO56","v":{"v":0.6088818464417178,"d":"60.89%"}},{"$f":"DU56","v":{"v":548.888779,"d":"548.9"}},{"$f":"EI56","v":{"v":901.4701,"d":"901.5"}},{"$f":"FN56/FO56","v":{"v":0.6088818464417178,"d":"60.89%"}},{"$f":"N56/Cubics","v":{"v":548.888779,"d":"548.89"}},{"$f":"IF(FQ56-(FP56*FO56)<=0,0,FQ56-(FP56*FO56))","v":{"v":0,"d":"0.00"}},{"$f":"FO56*(1-FP56)","v":{"v":352.581321,"d":"352.58"}},{"$f":"IF((FR56/FS56)>1,1,FR56/FS56)","v":{"v":0,"d":"0.00%"}},{"$f":"FC56","v":{"v":17.5,"d":"17.50"}},{"$f":"Tr_cool*FK56","v":{"v":17.685000000000002,"d":"17.69"}},{"$f":"ABS(FV56-FU56)","v":{"v":0.18500000000000227,"d":"0.19"}},{"$f":"Tv_cool*FL56","v":{"v":23.520000000000003,"d":"23.52"}},{"$f":"ABS(FX56-FU56)","v":{"v":6.020000000000003,"d":"6.02"}},{"$f":"IF(FM56<=FP56,FU56,FU56+(FT56*FW56))","v":{"v":17.5,"d":"17.50"}},{"$f":"FU56+(FT56*FY56)","v":{"v":17.5,"d":"17.50"}},null,{"$f":"(237.3*LN((RH*EXP(17.27*(Tl_cool/(Tl_cool+237.3))))))/(17.27-LN((RH*EXP(17.27*(Tl_cool/(Tl_cool+237.3))))))","v":15.69066559142683},null,{"$f":"(H56-G56)/H56","v":{"v":0,"d":"0.0%"}},null,{"$f":"(611*EXP(17.27*(Tl_heat/(Tl_heat+237.7))))","v":{"v":2334.1781978570243,"d":"2334.18"}},{"$f":"(611*EXP(17.27*((($P56-Celc2)/Celc1)/((($P56-Celc2)/Celc1)+237.7))))","v":{"v":17611.76367226674,"d":"17611.76"}},{"$f":"RH*$GG56","v":{"v":1167.0890989285122,"d":"1167.09"}},{"$f":"(GL56*p_atm)/(GL56+0.622)","v":{"v":1167.089098928512,"d":"1167.09"}},{"$f":"0.622*($GI56/(p_atm-$GI56))","v":{"v":7.2478490515896785E-3,"d":"0.01"}},{"v":7.2478490515896785E-3,"d":"0.01"},{"$f":"(1.005*Tl_heat)+($GK56*(2500+(1.87*Tl_heat)))","v":{"v":38.49069218350365,"d":"38.49"}},{"$f":"(1.005*(($P56-Celc2)/Celc1))+($GL56*(2500+(1.87*(($P56-Celc2)/Celc1))))","v":{"v":76.62850245964951,"d":"76.63"}},{"v":0.06626758799667112,"d":"7%"},null,{"$f":"(611*EXP(17.27*(Tl_cool/(Tl_cool+237.7))))","v":{"v":3557.0118570174286,"d":"3557.01"}},{"$f":"(611*EXP(17.27*((($R56-Celc2)/Celc1)/((($R56-Celc2)/Celc1)+237.7))))","v":{"v":2214.3045648589155,"d":"2214.30"}},{"$f":"RH*$GQ56","v":{"v":1778.5059285087143,"d":"1778.51"}},{"$f":"(GW56*p_atm)/(GW56+0.622)","v":{"v":1778.5059285087143,"d":"1778.51"}},{"$f":"T56*GR56","v":{"v":1778.5059285087143,"d":"1778.51"}},{"$f":"0.622*($GS56/(p_atm-$GS56))","v":{"v":0.011112703645172665,"d":"0.0111"}},{"$f":"IF(H56=G56,GV56,(0.53475935828878*($GZ56-(1.005*(($R56-Celc2)/Celc1))))/(1336.8983957219))","v":{"v":0.011112703645172665,"d":"0.0111"}},{"$f":"0.622*($GU56/(p_atm-$GU56))","v":{"v":0.011112703645172665,"d":"0.01"}},{"$f":"(1.005*Tl_cool)+($GV56*(2500+(1.87*Tl_cool)))","v":{"v":55.47783951997643,"d":"55.48"}},{"$f":"GY56-((((H56-G56)/Watts)/1000)/(N56/$L$15))","v":{"v":55.47783951997643,"d":"55.48"}},{"$f":"(1.005*(($R56-Celc2)/Celc1))+($GX56*(2500+(1.87*(($R56-Celc2)/Celc1))))","v":{"v":47.42537807458973,"d":"47.43"}},{"v":19.415087041495514,"d":"19.42"},{"v":19.415087041495514,"d":"19.42"},{"$f":"H56","v":{"v":1449.7076355441104,"d":"1450"}},548.888779,{"$f":"IF(Geg_dP<$AB56,((($BL$56*($HE56/Cubics)^4+$BL$57*($HE56/Cubics)^3+$BL$59*($HE56/Cubics)^2+$BL$61*($HE56/Cubics)^1+$BL$62)*((CF_Regime_Cool_noExp)^$Y56)))*CF_Addit*Watts*CF_Altit,Lim_dP)","v":1449.7076355441104},17.5,17.5,{"v":1449.7076355441104,"d":"1450"},1,{"v":1449.7076355441104,"d":"1450"},{"$f":"0.5*(1-((HP56-HE56)/HP56))","v":0.5},{"$f":"(0.025*Tl_cool)+0.3075","v":{"v":0.9825,"d":"0.98"}},{"$f":"(0.13*Tl_cool)-2.04","v":1.4700000000000002},{"$f":"HS56/HQ56","v":{"v":0.6088818464417178,"d":"60.89%"}},{"$f":"DU56","v":{"v":548.888779,"d":"548.9"}},{"v":901.4701,"d":"901.5"},{"$f":"HP56/HQ56","v":{"v":0.6088818464417178,"d":"60.89%"}},{"v":548.888779,"d":"548.89"},{"$f":"IF(HS56-(HR56*HQ56)<=0,0,HS56-(HR56*HQ56))","v":{"v":0,"d":"0.00"}},{"$f":"HQ56*(1-HR56)","v":{"v":352.581321,"d":"352.58"}},{"$f":"IF((HT56/HU56)>1,1,HT56/HU56)","v":{"v":0,"d":"0.00%"}},{"v":17.5,"d":"17.50"},{"$f":"Tr_cool*HM56","v":{"v":17.685000000000002,"d":"17.69"}},{"$f":"ABS(HX56-HW56)","v":{"v":0.18500000000000227,"d":"0.19"}},{"$f":"Tv_cool*HN56","v":{"v":23.520000000000003,"d":"23.52"}},{"$f":"ABS(HZ56-HW56)","v":{"v":6.020000000000003,"d":"6.02"}},{"$f":"IF(HO56<=HR56,HW56,HW56+(HV56*HY56))","v":{"v":17.5,"d":"17.50"}},{"$f":"HW56+(HV56*IA56)","v":{"v":17.5,"d":"17.50"}},null,{"$f":"(237.3*LN((RH*EXP(17.27*(Tl_cool/(Tl_cool+237.3))))))/(17.27-LN((RH*EXP(17.27*(Tl_cool/(Tl_cool+237.3))))))","v":15.69066559142683},null,{"$f":"(BG56-BF56)/BG56","v":{"v":0.00960213849511768,"d":"1.0%"}},null,{"$f":"(611*EXP(17.27*(Tl_heat/(Tl_heat+237.7))))","v":{"v":2334.1781978570243,"d":"2334.18"}},{"$f":"(611*EXP(17.27*((($P56-Celc2)/Celc1)/((($P56-Celc2)/Celc1)+237.7))))","v":{"v":17611.76367226674,"d":"17611.76"}}]
[null,{"$f":"IF($AL$5=1,$C57/10,IF($AL$5=2,$C57/10,IF($AL$5=3,0,IF($AL$5=4,$C57/10,))))","v":{"v":0.4,"d":"40%"}},4,{"v":12038.565742887798,"d":"12039"},1035,{"v":10.423354050605386,"d":"10.4"},{"v":2486.1664735304334,"d":"2486"},{"v":2486.1664735304334,"d":"2486"},{"$f":"IF(Geg_dP<AB57,ROUND(((IF('Briza 22 & 26'!$M$4=\"High Perform. 208/230V (US/EU)\",cal!HK57,H57)/Watts)/((Tr_cool-Tv_cool)*1.163))*FlowH2O,IF(UnitsNo=1,0,IF(UnitsNo=2,2))),\"\")","v":1069},{"v":11.05532767842789,"d":"11.1"},{"v":39,"d":"39.0"},{"$f":"IF(Geg_dP<$AB57,IF(CalcNo=\"12\",$ET57,IF(CalcNo=\"22\",$ET57,IF(CalcNo=\"13\",$EU57,IF(CalcNo=\"23\",$EU57,IF(CalcNo=\"11\",$ER57,IF(CalcNo=\"21\",$ER57,IF(CalcNo=\"14\",$ES57,IF(CalcNo=\"24\",$ES57,IF(CalcNo=\"32\",$EX57,IF(CalcNo=\"42\",$EX57,IF(CalcNo=\"33\",$EY57,IF(CalcNo=\"43\",$EY57,IF(CalcNo=\"31\",$EV57,IF(CalcNo=\"41\",$EV57,IF(CalcNo=\"34\",$EW57,IF(CalcNo=\"44\",$EW57,)))))))))))))))),\"\")","v":{"v":47,"d":"47.0"}},{"v":25.91716504040877,"d":"25.9"},{"v":972.290465,"d":"972"},{"v":0.6461260400053164,"d":"0.65"},{"v":56.34414949334048,"d":"56.3"},{"v":24.91976272693443,"d":"24.9"},{"v":19.400024154861924,"d":"19.4"},{"v":16.938838704327367,"d":"16.9"},{"v":0.7907983450233794,"d":"79%"},{"$f":"IF(Geg_dP<$AB57,$CK57*($N57/Cubics)^2+$CL57*($N57/Cubics)^1+$CM57,\"\")","v":{"v":694.892389557053,"d":"695"}},{"v":0.09596082395549521,"d":"0.10"},{"v":2.5570203175143074,"d":"2.557"},0.981618,1.2733,1.09292,0.981618,25.5595,0.981618,1.2733,1.09292,{"v":17,"d":"17.00"},0.981618,1.2733,1.09292,{"v":32,"d":"32.00"},0.981618,1.2733,1.09292,{"v":25.5595,"d":"25.56"},0.995474215844912,1.174754876804744,1.1067294843129272,{"v":68.1469,"d":"68.15"},0.981618,1.2733,1.09292,{"v":17,"d":"17.00"},0.981618,1.2733,1.09292,{"v":32,"d":"32.00"},1.0049716964208173,1.2385624038262057,1.1162269648888619,{"v":25.5595,"d":"25.56"},0.9693677323903813,1.070246709143203,1.0806230008584556,{"v":68.1469,"d":"68.15"},null,null,{"v":0,"d":"0.00E+00"},{"v":0,"d":"0.00E+00"},{"v":1.82115,"d":"1.82E+00"},null,null,{"$f":"BP62","v":{"v":1.82115,"d":"1.82E+00"}},null,{"$f":"BO57","v":0},{"v":1.8297986249,"d":"1.83E+00"},null,null,{"$f":"BV62","v":{"v":1.92807237,"d":"1.93E+00"}},null,null,{"$f":"BS57","v":{"v":1.8297986249,"d":"1.83E+00"}},{"v":0,"d":"0.00E+00"},{"v":0,"d":"0.00E+00"},{"v":-0.0207262231,"d":"-2.07E-02"},{"v":0.448237675,"d":"4.48E-01"},{"v":-29.9405694,"d":"-2.99E+01"},{"v":972.290465,"d":"9.72E+02"},{"v":0,"d":"0.00E+00"},{"v":-1.73219898e-08,"d":"-1.73E-08"},{"v":3.1025206e-05,"d":"3.10E-05"},{"v":-0.00607933431,"d":"-6.08E-03"},{"v":18.419973,"d":"1.84E+01"},{"v":0,"d":"0.00E+00"},{"v":-0.0566948257,"d":"-5.67E-02"},{"v":750.016228,"d":"7.50E+02"},null,null,{"v":0.154805894,"d":"1.55E-01"},{"v":-2.45944121,"d":"-2.46E+00"},{"v":-24.8452515,"d":"-2.48E+01"},{"v":774.578055,"d":"7.75E+02"},{"$nulls":3},{"v":0.00818053398,"d":"8.18E-03"},{"v":12.8128545,"d":"1.28E+01"},null,{"v":-0.0465529568,"d":"-4.66E-02"},{"v":584.097873,"d":"5.84E+02"},null,{"v":4.17142641E-4,"d":"4.17E-04"},{"v":-0.0213844811,"d":"-2.14E-02"},{"v":0.145820091,"d":"1.46E-01"},{"v":-23.7675518,"d":"-2.38E+01"},{"v":918.002845,"d":"9.18E+02"},null,{"v":-8.76331693e-09,"d":"-8.76E-09"},{"v":1.73052932e-05,"d":"1.73E-05"},{"v":0.00343837222,"d":"3.44E-03"},{"v":19.9280882,"d":"1.99E+01"},{"v":3.25255269e-05,"d":"3.25E-05"},{"v":-0.109999266,"d":"-1.10E-01"},{"v":916.219654,"d":"9.16E+02"},null,null,{"v":-0.0207262231,"d":"-2.07E-02"},{"v":0.448237675,"d":"4.48E-01"},{"v":-29.9405694,"d":"-2.99E+01"},{"v":972.290465,"d":"9.72E+02"},null,{"v":-1.73219898e-08,"d":"-1.73E-08"},{"v":3.1025206e-05,"d":"3.10E-05"},{"v":-0.00607933431,"d":"-6.08E-03"},{"v":18.419973,"d":"1.84E+01"},null,{"v":-0.0566948257,"d":"-5.67E-02"},{"v":750.016228,"d":"7.50E+02"},null,null,{"v":-1.46431454E-3,"d":"-1.46E-03"},{"v":0.00920274312,"d":"9.20E-03"},{"v":-18.2644828,"d":"-1.83E+01"},{"v":1797.3879,"d":"1.80E+03"},null,{"v":1.23981274E-8,"d":"1.24E-08"},{"v":-5.14440925E-5,"d":"-5.14E-05"},{"v":0.0985075169,"d":"9.85E-02"},{"v":9.80354312,"d":"9.80E+00"},null,{"v":-0.0493426921,"d":"-5E-02"},{"v":1157.98374,"d":"1E+03"},47,null,47,null,{"$f":"EX57","v":46.5},null,46.5,null,17.5,{"$f":"Tavg_cold","v":17},17.5,17.5,17.5,{"$f":"FH57*1.04","v":18.2},17.5,{"$f":"FH57*1.05","v":18.375},17.5,null,0.5,{"v":0.9825,"d":"0.98"},1.4700000000000002,{"$f":"FQ57/FO57","v":{"v":0.5409463727890903,"d":"54.09%"}},{"$f":"DU57","v":{"v":972.290465,"d":"972.3"}},{"$f":"EI57","v":{"v":1797.3879,"d":"1797.4"}},{"$f":"FN57/FO57","v":{"v":0.5409463727890903,"d":"54.09%"}},{"v":972.290465,"d":"972.29"},{"v":0,"d":"0.00"},{"$f":"FO57*(1-FP57)","v":{"v":825.0974349999998,"d":"825.10"}},{"$f":"IF((FR57/FS57)>1,1,FR57/FS57)","v":{"v":0,"d":"0.00%"}},{"v":17.5,"d":"17.50"},{"v":17.685000000000002,"d":"17.69"},{"v":0.18500000000000227,"d":"0.19"},{"v":23.520000000000003,"d":"23.52"},{"v":6.020000000000003,"d":"6.02"},{"v":17.5,"d":"17.50"},{"v":17.5,"d":"17.50"},null,15.69066559142683,null,{"v":0,"d":"0.0%"},null,{"v":2334.1781978570243,"d":"2334.18"},{"v":16719.645453607485,"d":"16719.65"},{"v":1167.0890989285122,"d":"1167.09"},{"v":1167.089098928512,"d":"1167.09"},{"v":7.2478490515896785E-3,"d":"0.01"},{"v":7.2478490515896785E-3,"d":"0.01"},{"v":38.49069218350365,"d":"38.49"},{"v":75.50915204495641,"d":"75.51"},{"v":0.06980345977831108,"d":"7%"},null,{"v":3557.0118570174286,"d":"3557.01"},{"v":2249.0005697421307,"d":"2249.00"},{"v":1778.5059285087143,"d":"1778.51"},{"v":1778.5059285087143,"d":"1778.51"},{"v":1778.5059285087143,"d":"1778.51"},{"v":0.011112703645172665,"d":"0.0111"},{"v":0.011112703645172665,"d":"0.0111"},{"v":0.011112703645172665,"d":"0.01"},{"v":55.47783951997643,"d":"55.48"},{"v":55.47783951997643,"d":"55.48"},{"v":47.681930553363756,"d":"47.68"},{"v":19.415087041495514,"d":"19.42"},{"v":19.415087041495514,"d":"19.42"},{"v":2486.1664735304334,"d":"2486"},972.290465,2486.1664735304334,17.5,17.5,{"v":2486.1664735304334,"d":"2486"},1,{"v":2486.1664735304334,"d":"2486"},0.5,{"v":0.9825,"d":"0.98"},1.4700000000000002,{"$f":"HS57/HQ57","v":{"v":0.5409463727890903,"d":"54.09%"}},{"v":972.290465,"d":"972.3"},{"v":1797.3879,"d":"1797.4"},{"$f":"HP57/HQ57","v":{"v":0.5409463727890903,"d":"54.09%"}},{"v":972.290465,"d":"972.29"},{"v":0,"d":"0.00"},{"$f":"HQ57*(1-HR57)","v":{"v":825.0974349999998,"d":"825.10"}},{"$f":"IF((HT57/HU57)>1,1,HT57/HU57)","v":{"v":0,"d":"0.00%"}},{"v":17.5,"d":"17.50"},{"v":17.685000000000002,"d":"17.69"},{"v":0.18500000000000227,"d":"0.19"},{"v":23.520000000000003,"d":"23.52"},{"v":6.020000000000003,"d":"6.02"},{"v":17.5,"d":"17.50"},{"v":17.5,"d":"17.50"},null,15.69066559142683,null,{"v":0.00960213849511768,"d":"1.0%"},null,{"v":2334.1781978570243,"d":"2334.18"},{"v":16719.645453607485,"d":"16719.65"}]
[null,{"$f":"IF($AL$5=1,$C58/10,IF($AL$5=2,$C58/10,IF($AL$5=3,0.25,IF($AL$5=4,$C58/10,))))","v":{"v":0.5,"d":"50%"}},5,{"v":5.30344505500896,"d":"5"},0,{"v":0,"d":"0.0"},{"v":-4.90942723687469,"d":"-5"},{"v":-4.90942723687469,"d":"-5"},{"$f":"IF(Geg_dP<AB58,ROUND(((IF('Briza 22 & 26'!$M$4=\"High Perform. 208/230V (US/EU)\",cal!HK58,H58)/Watts)/((Tr_cool-Tv_cool)*1.163))*FlowH2O,IF(UnitsNo=1,0,IF(UnitsNo=2,2))),\"\")","v":-2},{"$error":"#NUM!"},{"v":0,"d":"0.0"},{"$f":"IF(Geg_dP<$AB58,0,\"\")","v":{"v":0,"d":"0.0"}},{"v":0,"d":"0.0"},0,{"v":0,"d":"0.00"},{"$error":"#DIV/0!"},{"$error":"#DIV/0!"},{"$error":"#DIV/0!"},{"$error":"#DIV/0!"},{"$error":"#DIV/0!"},{"$f":"IF(Geg_dP<$AB58,$CK58*($N58/Cubics)^2+$CL58*($N58/Cubics)^1+$CM58,\"\")","v":0},{"$error":"#DIV/0!"},{"$error":"#DIV/0!"},0.981618,1.2733,1.09292,0.981618,42.8137,0.981618,1.2733,1.09292,{"$f":"AF57+((AF59-AF57)/2)","v":{"v":27.7,"d":"27.70"}},0.981618,1.2733,1.09292,{"$f":"AJ57+((AJ59-AJ57)/2)","v":{"v":51,"d":"51.00"}},0.981618,1.2733,1.09292,{"$f":"AN57+((AN59-AN57)/2)","v":{"v":42.8137,"d":"42.81"}},0.995474215844912,1.174754876804744,1.1067294843129272,{"$f":"AR57+((AR59-AR57)/2)","v":{"v":99.86045000000001,"d":"99.86"}},0.981618,1.2733,1.09292,{"v":27.7,"d":"27.70"},0.981618,1.2733,1.09292,{"v":51,"d":"51.00"},1.0049716964208173,1.2385624038262057,1.1162269648888619,{"v":42.8137,"d":"42.81"},0.9693677323903813,1.070246709143203,1.0806230008584556,{"v":99.86045000000001,"d":"99.86"},{"$nulls":17},{"v":0,"d":"0.00E+00"},{"v":0,"d":"0.00E+00"},{"v":0,"d":"0.00E+00"},{"v":0,"d":"0.00E+00"},{"v":0,"d":"0.00E+00"},{"v":0,"d":"0.00E+00"},{"v":0,"d":"0.00E+00"},{"v":0,"d":"0.00E+00"},{"v":0,"d":"0.00E+00"},{"v":0,"d":"0.00E+00"},{"v":0,"d":"0.00E+00"},{"v":0,"d":"0.00E+00"},{"v":0,"d":"0.00E+00"},{"v":0,"d":"0.00E+00"},{"$nulls":44},{"v":-0.000582097597,"d":"-5.82E-04"},{"v":-0.0364419489,"d":"-3.64E-02"},{"v":-13.7951916,"d":"-1.38E+01"},{"v":2184.81101,"d":"2.18E+03"},null,{"v":7.55819126e-09,"d":"7.56E-09"},{"v":-3.45506006e-05,"d":"-3.46E-05"},{"v":0.0957767993,"d":"9.58E-02"},{"v":32.9073224,"d":"3.29E+01"},null,{"v":-0.0777859265,"d":"-8E-02"},{"v":1425.08592,"d":"1E+03"},{"$nulls":8},{"v":17,"d":"17.00"},{"$f":"((FA59-FA57)/2)+FA57","v":17},17,17,17,{"$f":"((FE59-FE57)/2)+FE57","v":18.2},17,{"$f":"((FG59-FG57)/2)+FG57","v":18.375},17,null,{"v":0,"d":"0.0"},{"v":0.9825,"d":"0.98"},1.4700000000000002,{"v":0,"d":"0.00%"},{"$f":"((FN59-FN57)/2)+FN57","v":{"v":1159.5624125,"d":"1159.6"}},{"$f":"((FO59-FO57)/2)+FO57","v":{"v":2184.8110149999998,"d":"2184.8"}},{"$f":"FN58/FO58","v":{"v":0.5307380842273903,"d":"53.07%"}},{"v":0,"d":"0.00"},{"v":0,"d":"0.00"},{"v":1025.2486024999998,"d":"1025.25"},{"v":0,"d":"0.00%"},{"v":17,"d":"17.00"},{"v":17.685000000000002,"d":"17.69"},{"v":0.6850000000000023,"d":"0.69"},{"v":23.520000000000003,"d":"23.52"},{"v":6.520000000000003,"d":"6.52"},{"v":17,"d":"17.00"},{"v":17,"d":"17.00"},null,15.69066559142683,null,{"v":0,"d":"0.0%"},null,{"v":2334.1781978570243,"d":"2334.18"},{"$error":"#DIV/0!"},{"v":1167.0890989285122,"d":"1167.09"},{"v":1167.089098928512,"d":"1167.09"},{"v":7.2478490515896785E-3,"d":"0.01"},{"v":7.2478490515896785E-3,"d":"0.01"},{"v":38.49069218350365,"d":"38.49"},{"$error":"#DIV/0!"},{"$error":"#DIV/0!"},null,{"v":3557.0118570174286,"d":"3557.01"},{"$error":"#DIV/0!"},{"v":1778.5059285087143,"d":"1778.51"},{"v":1778.5059285087143,"d":"1778.51"},{"$error":"#DIV/0!"},{"v":0.011112703645172665,"d":"0.0111"},{"v":0.011112703645172665,"d":"0.0111"},{"$error":"#DIV/0!"},{"v":55.47783951997643,"d":"55.48"},{"$error":"#DIV/0!"},{"$error":"#DIV/0!"},{"v":19.415087041495514,"d":"19.42"},{"$error":"#DIV/0!"},{"v":-4.90942723687469,"d":"-5"},0,-4.90942723687469,{"v":17,"d":"17.0"},{"v":17,"d":"17.0"},{"v":-4.90942723687469,"d":"-5"},1,{"v":-4.90942723687469,"d":"-5"},{"v":0,"d":"0.0"},{"v":0.9825,"d":"0.98"},1.4700000000000002,{"v":0,"d":"0.00%"},{"$f":"((HP59-HP57)/2)+HP57","v":{"v":1159.5624125,"d":"1159.6"}},{"$f":"((HQ59-HQ57)/2)+HQ57","v":{"v":2184.8110149999998,"d":"2184.8"}},{"$f":"HP58/HQ58","v":{"v":0.5307380842273903,"d":"53.07%"}},{"v":0,"d":"0.00"},{"v":0,"d":"0.00"},{"v":1025.2486024999998,"d":"1025.25"},{"v":0,"d":"0.00%"},{"v":17,"d":"17.00"},{"v":17.685000000000002,"d":"17.69"},{"v":0.6850000000000023,"d":"0.69"},{"v":23.520000000000003,"d":"23.52"},{"v":6.520000000000003,"d":"6.52"},{"v":17,"d":"17.00"},{"v":17,"d":"17.00"},null,15.69066559142683,null,{"v":0.00960213849511768,"d":"1.0%"},null,{"v":2334.1781978570243,"d":"2334.18"},{"$error":"#DIV/0!"}]
[null,{"$f":"IF($AL$5=1,$C59/10,IF($AL$5=2,$C59/10,IF($AL$5=3,0.5,IF($AL$5=4,$C59/10,))))","v":{"v":0.6,"d":"60%"}},6,{"v":16232.95184372751,"d":"16233"},1396,{"v":17.974505497771883,"d":"18.0"},{"v":3340.878052237484,"d":"3341"},{"v":3340.878052237484,"d":"3341"},{"$f":"IF(Geg_dP<AB59,ROUND(((IF('Briza 22 & 26'!$M$4=\"High Perform. 208/230V (US/EU)\",cal!HK59,H59)/Watts)/((Tr_cool-Tv_cool)*1.163))*FlowH2O,IF(UnitsNo=1,0,IF(UnitsNo=2,2))),\"\")","v":1436},{"v":18.92346581294144,"d":"18.9"},46.5,{"$f":"IF(Geg_dP<$AB59,IF(CalcNo=\"12\",$ET59,IF(CalcNo=\"22\",$ET59,IF(CalcNo=\"13\",$EU59,IF(CalcNo=\"23\",$EU59,IF(CalcNo=\"11\",$ER59,IF(CalcNo=\"21\",$ER59,IF(CalcNo=\"14\",$ES59,IF(CalcNo=\"24\",$ES59,IF(CalcNo=\"32\",$EX59,IF(CalcNo=\"42\",$EX59,IF(CalcNo=\"33\",$EY59,IF(CalcNo=\"43\",$EY59,IF(CalcNo=\"31\",$EV59,IF(CalcNo=\"41\",$EV59,IF(CalcNo=\"34\",$EW59,IF(CalcNo=\"44\",$EW59,)))))))))))))))),\"\")","v":54.5},{"v":52.7864636521146,"d":"52.8"},{"v":1346.83436,"d":"1347"},{"v":0.8950254917597024,"d":"0.90"},{"v":55.378474382176755,"d":"55.4"},{"v":24.673458633046103,"d":"24.7"},{"v":19.6273355382134,"d":"19.6"},{"v":17.016193007572845,"d":"17.0"},{"v":0.7797228975092394,"d":"78%"},{"$f":"IF(Geg_dP<$AB59,$CK59*($N59/Cubics)^2+$CL59*($N59/Cubics)^1+$CM59,\"\")","v":{"v":836.3169687415364,"d":"836"}},{"v":0.14109475878504654,"d":"0.14"},{"v":2.4805411500175003,"d":"2.481"},0.981618,1.2733,1.09292,0.981618,60.0679,0.981618,1.2733,1.09292,{"v":38.4,"d":"38.40"},0.981618,1.2733,1.09292,{"v":70,"d":"70.00"},0.981618,1.2733,1.09292,{"v":60.0679,"d":"60.07"},0.995474215844912,1.174754876804744,1.1067294843129272,{"v":131.574,"d":"131.57"},0.981618,1.2733,1.09292,{"v":38.4,"d":"38.40"},0.981618,1.2733,1.09292,{"v":70,"d":"70.00"},1.0049716964208173,1.2385624038262057,1.1162269648888619,{"v":60.0679,"d":"60.07"},0.9693677323903813,1.070246709143203,1.0806230008584556,{"v":131.574,"d":"131.57"},null,null,{"$f":"IF($BK$17=\"11\",BN59,IF($BK$17=\"21\",BQ59,IF($BK$17=\"12\",BN59,IF($BK$17=\"22\",BQ59,IF($BK$17=\"13\",BN59,IF($BK$17=\"23\",BQ59,IF($BK$17=\"14\",BN59,IF($BK$17=\"24\",BQ59,IF($BK$17=\"31\",BT59,IF($BK$17=\"41\",BW59,IF($BK$17=\"32\",BT59,IF($BK$17=\"42\",BW59,IF($BK$17=\"33\",BT59,IF($BK$17=\"43\",BW59,IF($BK$17=\"34\",BT59,IF($BK$17=\"44\",BW59,))))))))))))))))","v":{"v":-0.00049756859,"d":"-4.98E-04"}},{"$f":"IF($BK$17=\"11\",BO59,IF($BK$17=\"21\",BR59,IF($BK$17=\"12\",BO59,IF($BK$17=\"22\",BR59,IF($BK$17=\"13\",BO59,IF($BK$17=\"23\",BR59,IF($BK$17=\"14\",BO59,IF($BK$17=\"24\",BR59,IF($BK$17=\"31\",BU59,IF($BK$17=\"41\",BX59,IF($BK$17=\"32\",BU59,IF($BK$17=\"42\",BX59,IF($BK$17=\"33\",BU59,IF($BK$17=\"43\",BX59,IF($BK$17=\"34\",BU59,IF($BK$17=\"44\",BX59,))))))))))))))))","v":{"v":-0.000422141515,"d":"-4.22E-04"}},null,{"v":-0.00049756859,"d":"-4.98E-04"},{"v":-0.000422141515,"d":"-4.22E-04"},null,{"v":-0.000606113055,"d":"-6.06E-04"},{"$f":"BO59","v":{"v":-0.000422141515,"d":"-4.22E-04"}},null,{"v":-1.47549832E-4,"d":"-1.48E-04"},{"v":-1.25688433E-4,"d":"-1.26E-04"},null,{"$f":"BQ59","v":{"v":-0.000606113055,"d":"-6.06E-04"}},{"$f":"BU59","v":{"v":-1.25688433E-4,"d":"-1.26E-04"}},null,{"v":0,"d":"0.00E+00"},{"v":0,"d":"0.00E+00"},{"v":1.78950031E-4,"d":"1.79E-04"},{"v":-0.0316222529,"d":"-3.16E-02"},{"v":-20.0727588,"d":"-2.01E+01"},{"v":1346.83436,"d":"1.35E+03"},{"v":0,"d":"0.00E+00"},{"v":1.27740506E-8,"d":"1.28E-08"},{"v":-4.86262543e-05,"d":"-4.86E-05"},{"v":0.0767236773,"d":"7.67E-02"},{"v":6.45021714,"d":"6.45E+00"},{"v":0,"d":"0.00E+00"},{"v":-0.121493471,"d":"-1.21E-01"},{"v":999.94855,"d":"1.00E+03"},null,null,{"v":0.0127378225,"d":"1.27E-02"},{"v":-0.533422708,"d":"-5.33E-01"},{"v":-18.4235887,"d":"-1.84E+01"},{"v":1180.47893,"d":"1.18E+03"},{"$nulls":3},{"v":0.016128909,"d":"1.61E-02"},{"v":22.3627306,"d":"2.24E+01"},null,{"$f":" -0.118203123","v":{"v":-0.118203123,"d":"-1.18E-01"}},{"v":890.877789,"d":"8.91E+02"},null,{"v":4.72919602e-05,"d":"4.73E-05"},{"v":-5.83093907E-3,"d":"-5.83E-03"},{"v":0.160385446,"d":"1.60E-01"},{"v":-18.7017254,"d":"-1.87E+01"},{"v":1432.63566,"d":"1.43E+03"},null,{"v":-9.45587428e-09,"d":"-9.46E-09"},{"v":2.50525043E-5,"d":"2.51E-05"},{"v":6.83842944E-3,"d":"6.84E-03"},{"v":41.7917763,"d":"4.18E+01"},{"v":4.64010426e-05,"d":"4.64E-05"},{"v":-0.176050758,"d":"-1.76E-01"},{"v":1323.39803,"d":"1.32E+03"},null,null,{"v":1.78950031E-4,"d":"1.79E-04"},{"v":-0.0316222529,"d":"-3.16E-02"},{"v":-20.0727588,"d":"-2.01E+01"},{"v":1346.83436,"d":"1.35E+03"},null,{"v":1.27740506E-8,"d":"1.28E-08"},{"v":-4.86262543e-05,"d":"-4.86E-05"},{"v":0.0767236773,"d":"7.67E-02"},{"v":6.45021714,"d":"6.45E+00"},null,{"v":-0.121493471,"d":"-1.21E-01"},{"v":999.94855,"d":"1.00E+03"},null,null,{"v":0.000300119345,"d":"3.00E-04"},{"v":-0.082086641,"d":"-8.21E-02"},{"v":-9.32590046,"d":"-9.33E+00"},{"v":2572.23413,"d":"2.57E+03"},null,{"v":2.71825512e-09,"d":"2.72E-09"},{"v":-1.76571087e-05,"d":"-1.77E-05"},{"v":0.0930460817,"d":"9.30E-02"},{"v":56.0111016,"d":"5.60E+01"},null,{"v":-0.106229161,"d":"-1E-01"},{"v":1692.1881,"d":"2E+03"},54.5,null,54.5,null,{"$f":"EX59","v":54},null,54,null,17.5,{"$f":"Tavg_cold","v":17},17.5,17.5,17.5,18.2,17.5,{"$f":"FH59*1.05","v":18.375},17.5,null,0.5,{"v":0.9825,"d":"0.98"},1.4700000000000002,{"v":0.5236048866204882,"d":"52.36%"},{"$f":"DU59","v":{"v":1346.83436,"d":"1346.8"}},{"$f":"EI59","v":{"v":2572.23413,"d":"2572.2"}},{"$f":"FN59/FO59","v":{"v":0.5236048866204882,"d":"52.36%"}},{"v":1346.83436,"d":"1346.83"},{"v":0,"d":"0.00"},{"v":1225.3997699999998,"d":"1225.40"},{"v":0,"d":"0.00%"},{"v":17.5,"d":"17.50"},{"v":17.685000000000002,"d":"17.69"},{"v":0.18500000000000227,"d":"0.19"},{"v":23.520000000000003,"d":"23.52"},{"v":6.020000000000003,"d":"6.02"},{"v":17.5,"d":"17.50"},{"v":17.5,"d":"17.50"},null,15.69066559142683,null,{"v":0,"d":"0.0%"},null,{"v":2334.1781978570243,"d":"2334.18"},{"v":15967.965942470813,"d":"15967.97"},{"v":1167.0890989285122,"d":"1167.09"},{"v":1167.089098928512,"d":"1167.09"},{"v":7.2478490515896785E-3,"d":"0.01"},{"v":7.2478490515896785E-3,"d":"0.01"},{"v":38.49069218350365,"d":"38.49"},{"v":74.5255603021267,"d":"74.53"},{"v":0.07308940306694578,"d":"7%"},null,{"v":3557.0118570174286,"d":"3557.01"},{"v":2280.946133799591,"d":"2280.95"},{"v":1778.5059285087143,"d":"1778.51"},{"v":1778.5059285087143,"d":"1778.51"},{"v":1778.5059285087143,"d":"1778.51"},{"v":0.011112703645172665,"d":"0.0111"},{"v":0.011112703645172665,"d":"0.0111"},{"v":0.011112703645172665,"d":"0.01"},{"v":55.47783951997643,"d":"55.48"},{"v":55.47783951997643,"d":"55.48"},{"v":47.91510219598372,"d":"47.92"},{"v":19.415087041495514,"d":"19.42"},{"v":19.415087041495514,"d":"19.42"},{"v":3340.878052237484,"d":"3341"},1346.83436,3340.878052237484,17.5,17.5,{"v":3340.878052237484,"d":"3341"},1,{"v":3340.878052237484,"d":"3341"},0.5,{"v":0.9825,"d":"0.98"},1.4700000000000002,{"v":0.5236048866204882,"d":"52.36%"},{"v":1346.83436,"d":"1346.8"},{"v":2572.23413,"d":"2572.2"},{"$f":"HP59/HQ59","v":{"v":0.5236048866204882,"d":"52.36%"}},{"v":1346.83436,"d":"1346.83"},{"v":0,"d":"0.00"},{"v":1225.3997699999998,"d":"1225.40"},{"v":0,"d":"0.00%"},{"v":17.5,"d":"17.50"},{"v":17.685000000000002,"d":"17.69"},{"v":0.18500000000000227,"d":"0.19"},{"v":23.520000000000003,"d":"23.52"},{"v":6.020000000000003,"d":"6.02"},{"v":17.5,"d":"17.50"},{"v":17.5,"d":"17.50"},null,15.69066559142683,null,{"v":0.00960213849511768,"d":"1.0%"},null,{"v":2334.1781978570243,"d":"2334.18"},{"v":15967.965942470813,"d":"15967.97"}]
[null,{"$f":"IF($AL$5=1,$C60/10,IF($AL$5=2,$C60/10,IF($AL$5=3,0.75,IF($AL$5=4,$C60/10,))))","v":{"v":0.7,"d":"70%"}},7,{"v":5.30344505500896,"d":"5"},0,{"v":0,"d":"0.0"},{"v":-4.90942723687469,"d":"-5"},{"v":-4.90942723687469,"d":"-5"},{"$f":"IF(Geg_dP<AB60,ROUND(((IF('Briza 22 & 26'!$M$4=\"High Perform. 208/230V (US/EU)\",cal!HK60,H60)/Watts)/((Tr_cool-Tv_cool)*1.163))*FlowH2O,IF(UnitsNo=1,0,IF(UnitsNo=2,2))),\"\")","v":-2},{"$error":"#NUM!"},{"v":0,"d":"0.0"},{"$f":"IF(Geg_dP<$AB60,0,\"\")","v":{"v":0,"d":"0.0"}},{"v":0,"d":"0.0"},0,{"v":0,"d":"0.00"},{"$error":"#DIV/0!"},{"$error":"#DIV/0!"},{"$error":"#DIV/0!"},{"$error":"#DIV/0!"},{"$error":"#DIV/0!"},{"$f":"IF(Geg_dP<$AB60,$CK60*($N60/Cubics)^2+$CL60*($N60/Cubics)^1+$CM60,\"\")","v":0},{"$error":"#DIV/0!"},{"$error":"#DIV/0!"},0.981618,1.2733,1.09292,0.981618,68.7432,0.981618,1.2733,1.09292,{"$f":"AF59+((AF61-AF59)/2)","v":{"v":51.7,"d":"51.70"}},0.981618,1.2733,1.09292,{"$f":"AJ59+((AJ61-AJ59)/2)","v":{"v":92.5,"d":"92.50"}},0.981618,1.2733,1.09292,{"$f":"AN59+((AN61-AN59)/2)","v":{"v":68.7432,"d":"68.74"}},0.995474215844912,1.174754876804744,1.1067294843129272,{"v":210,"d":"210.00"},0.981618,1.2733,1.09292,{"v":51.7,"d":"51.70"},0.981618,1.2733,1.09292,{"v":92.5,"d":"92.50"},1.0049716964208173,1.2385624038262057,1.1162269648888619,{"v":68.7432,"d":"68.74"},0.9693677323903813,1.070246709143203,1.0806230008584556,{"v":210,"d":"210.00"},{"$nulls":17},{"v":0,"d":"0.00E+00"},{"v":0,"d":"0.00E+00"},{"v":0,"d":"0.00E+00"},{"v":0,"d":"0.00E+00"},{"v":0,"d":"0.00E+00"},{"v":0,"d":"0.00E+00"},{"v":0,"d":"0.00E+00"},{"v":0,"d":"0.00E+00"},{"v":0,"d":"0.00E+00"},{"v":0,"d":"0.00E+00"},{"v":0,"d":"0.00E+00"},{"v":0,"d":"0.00E+00"},{"v":0,"d":"0.00E+00"},{"v":0,"d":"0.00E+00"},{"$nulls":44},{"v":-9.867323e-06,"d":"-9.87E-06"},{"v":-0.0143912844,"d":"-1.44E-02"},{"v":-10.1493615,"d":"-1.01E+01"},{"v":2797.28421,"d":"2.80E+03"},null,{"v":1.35912756e-09,"d":"1.36E-09"},{"v":-2.15547053e-05,"d":"-2.16E-05"},{"v":0.130686737,"d":"1.31E-01"},{"v":63.6997543,"d":"6.37E+01"},null,{"v":-0.148240476,"d":"-1E-01"},{"v":1959.39204,"d":"2E+03"},{"$nulls":8},17,{"$f":"((FA61-FA59)/2)+FA59","v":17},17,17,17,{"$f":"((FE61-FE59)/2)+FE59","v":18.2},17,{"$f":"((FG61-FG59)/2)+FG59","v":18.375},17,null,{"v":0,"d":"0.0"},{"v":0.9825,"d":"0.98"},1.4700000000000002,{"v":0,"d":"0.00%"},{"$f":"((FN61-FN59)/2)+FN59","v":{"v":1523.645145,"d":"1523.6"}},{"$f":"((FO61-FO59)/2)+FO59","v":{"v":2797.28421,"d":"2797.3"}},{"$f":"FN60/FO60","v":{"v":0.5446872861731844,"d":"54.47%"}},{"v":0,"d":"0.00"},{"v":0,"d":"0.00"},{"v":1273.6390649999998,"d":"1273.64"},{"v":0,"d":"0.00%"},{"v":17,"d":"17.00"},{"v":17.685000000000002,"d":"17.69"},{"v":0.6850000000000023,"d":"0.69"},{"v":23.520000000000003,"d":"23.52"},{"v":6.520000000000003,"d":"6.52"},{"v":17,"d":"17.00"},{"v":17,"d":"17.00"},null,15.69066559142683,null,{"v":0,"d":"0.0%"},null,{"v":2334.1781978570243,"d":"2334.18"},{"$error":"#DIV/0!"},{"v":1167.0890989285122,"d":"1167.09"},{"v":1167.089098928512,"d":"1167.09"},{"v":7.2478490515896785E-3,"d":"0.01"},{"v":7.2478490515896785E-3,"d":"0.01"},{"v":38.49069218350365,"d":"38.49"},{"$error":"#DIV/0!"},{"$error":"#DIV/0!"},null,{"v":3557.0118570174286,"d":"3557.01"},{"$error":"#DIV/0!"},{"v":1778.5059285087143,"d":"1778.51"},{"v":1778.5059285087143,"d":"1778.51"},{"$error":"#DIV/0!"},{"v":0.011112703645172665,"d":"0.0111"},{"v":0.011112703645172665,"d":"0.0111"},{"$error":"#DIV/0!"},{"v":55.47783951997643,"d":"55.48"},{"$error":"#DIV/0!"},{"$error":"#DIV/0!"},{"v":19.415087041495514,"d":"19.42"},{"$error":"#DIV/0!"},{"v":-4.90942723687469,"d":"-5"},0,-4.90942723687469,{"v":17,"d":"17.0"},{"v":17,"d":"17.0"},{"v":-4.90942723687469,"d":"-5"},1,{"v":-4.90942723687469,"d":"-5"},{"v":0,"d":"0.0"},{"v":0.9825,"d":"0.98"},1.4700000000000002,{"v":0,"d":"0.00%"},{"$f":"((HP61-HP59)/2)+HP59","v":{"v":1523.645145,"d":"1523.6"}},{"v":2797.28421,"d":"2797.3"},{"$f":"HP60/HQ60","v":{"v":0.5446872861731844,"d":"54.47%"}},{"v":0,"d":"0.00"},{"v":0,"d":"0.00"},{"v":1273.6390649999998,"d":"1273.64"},{"v":0,"d":"0.00%"},{"v":17,"d":"17.00"},{"v":17.685000000000002,"d":"17.69"},{"v":0.6850000000000023,"d":"0.69"},{"v":23.520000000000003,"d":"23.52"},{"v":6.520000000000003,"d":"6.52"},{"v":17,"d":"17.00"},{"v":17,"d":"17.00"},null,15.69066559142683,null,{"v":0.00960213849511768,"d":"1.0%"},null,{"v":2334.1781978570243,"d":"2334.18"},{"$error":"#DIV/0!"}]
[null,{"$f":"IF($AL$5=1,$C61/10,IF($AL$5=2,$C61/10,IF($AL$5=3,1,IF($AL$5=4,$C61/10,))))","v":{"v":0.8,"d":"80%"}},8,{"v":19967.90567147687,"d":"19968"},1717,{"v":26.202986598368852,"d":"26.2"},{"v":4094.3007616661316,"d":"4094"},{"v":4094.3007616661316,"d":"4094"},{"$f":"IF(Geg_dP<AB61,ROUND(((IF('Briza 22 & 26'!$M$4=\"High Perform. 208/230V (US/EU)\",cal!HK61,H61)/Watts)/((Tr_cool-Tv_cool)*1.163))*FlowH2O,IF(UnitsNo=1,0,IF(UnitsNo=2,2))),\"\")","v":1760},{"v":27.410330159722072,"d":"27.4"},{"v":52,"d":"52.0"},{"$f":"IF(Geg_dP<$AB61,IF(CalcNo=\"12\",$ET61,IF(CalcNo=\"22\",$ET61,IF(CalcNo=\"13\",$EU61,IF(CalcNo=\"23\",$EU61,IF(CalcNo=\"11\",$ER61,IF(CalcNo=\"21\",$ER61,IF(CalcNo=\"14\",$ES61,IF(CalcNo=\"24\",$ES61,IF(CalcNo=\"32\",$EX61,IF(CalcNo=\"42\",$EX61,IF(CalcNo=\"33\",$EY61,IF(CalcNo=\"43\",$EY61,IF(CalcNo=\"31\",$EV61,IF(CalcNo=\"41\",$EV61,IF(CalcNo=\"34\",$EW61,IF(CalcNo=\"44\",$EW61,)))))))))))))))),\"\")","v":{"v":60,"d":"60.0"}},{"v":92.99122092657511,"d":"93.0"},{"v":1700.45593,"d":"1700"},{"v":1.1300212187666137,"d":"1.13"},{"v":54.46854280736155,"d":"54.5"},{"v":24.439358355662304,"d":"24.4"},{"v":19.843636461799832,"d":"19.8"},{"v":17.08960112192305,"d":"17.1"},{"v":0.7693457659485332,"d":"77%"},{"$f":"IF(Geg_dP<$AB61,($CK61*($N61/Cubics)^2)+($CL61*($N61/Cubics)^1)+$CM61,\"\")","v":{"v":963.9587740249005,"d":"964"}},{"v":0.1968697861729768,"d":"0.20"},{"v":2.407766463942486,"d":"2.408"},0.981618,1.2733,1.09292,0.981618,77.4185,0.981618,1.2733,1.09292,{"v":65,"d":"65.00"},0.981618,1.2733,1.09292,{"v":115,"d":"115.00"},0.981618,1.2733,1.09292,{"v":77.4185,"d":"77.42"},0.995474215844912,1.174754876804744,1.1067294843129272,{"v":220.364,"d":"220.36"},0.981618,1.2733,1.09292,{"v":65,"d":"65.00"},0.981618,1.2733,1.09292,{"v":115,"d":"115.00"},1.0049716964208173,1.2385624038262057,1.1162269648888619,{"v":77.4185,"d":"77.42"},0.9693677323903813,1.070246709143203,1.0806230008584556,{"v":220.364,"d":"220.36"},null,null,{"$f":"IF($BK$17=\"11\",BN61,IF($BK$17=\"21\",BQ61,IF($BK$17=\"12\",BN61,IF($BK$17=\"22\",BQ61,IF($BK$17=\"13\",BN61,IF($BK$17=\"23\",BQ61,IF($BK$17=\"14\",BN61,IF($BK$17=\"24\",BQ61,IF($BK$17=\"31\",BT61,IF($BK$17=\"41\",BW61,IF($BK$17=\"32\",BT61,IF($BK$17=\"42\",BW61,IF($BK$17=\"33\",BT61,IF($BK$17=\"43\",BW61,IF($BK$17=\"34\",BT61,IF($BK$17=\"44\",BW61,))))))))))))))))","v":{"v":7.52705963,"d":"7.53E+00"}},{"v":5.61168665,"d":"5.61E+00"},{"v":3.36782e-05,"d":"3.37E-05"},{"v":7.52705963,"d":"7.53E+00"},{"v":5.61168665,"d":"5.61E+00"},{"v":3.36782e-05,"d":"3.37E-05"},{"v":3.86679211,"d":"3.87E+00"},{"$f":"BO61","v":{"v":5.61168665,"d":"5.61E+00"}},{"$f":"+BP61","v":{"v":3.36782e-05,"d":"3.37E-05"}},{"v":7.14652153,"d":"7.15E+00"},{"v":5.4161495,"d":"5.42E+00"},{"v":1.620434e-05,"d":"1.62E-05"},{"$f":"BQ61","v":{"v":3.86679211,"d":"3.87E+00"}},{"$f":"BU61","v":{"v":5.4161495,"d":"5.42E+00"}},{"$f":"+BV61","v":{"v":1.620434e-05,"d":"1.62E-05"}},{"v":0,"d":"0.00E+00"},{"v":0,"d":"0.00E+00"},{"v":-0.000673100317,"d":"-6.73E-04"},{"v":0.0287871459,"d":"2.88E-02"},{"v":-17.0235516,"d":"-1.70E+01"},{"v":1700.45593,"d":"1.70E+03"},{"v":0,"d":"0.00E+00"},{"v":3.81472518e-09,"d":"3.81E-09"},{"v":-2.19102323e-05,"d":"-2.19E-05"},{"v":0.063273982,"d":"6.33E-02"},{"v":29.9943152,"d":"3.00E+01"},{"v":0,"d":"0.00E+00"},{"v":-0.205007951,"d":"-2.05E-01"},{"v":1312.56576,"d":"1.31E+03"},null,null,{"v":9.43885758E-4,"d":"9.44E-04"},{"v":-0.116598953,"d":"-1.17E-01"},{"v":-16.9930545,"d":"-1.70E+01"},{"v":1564.96991,"d":"1.56E+03"},{"$nulls":3},{"v":0.0251615045,"d":"2.52E-02"},{"v":36.7349346,"d":"3.67E+01"},null,{"$f":" -0.100252812","v":{"v":-0.100252812,"d":"-1.00E-01"}},{"v":1122.41269,"d":"1.12E+03"},null,{"v":7.30447701e-06,"d":"7.30E-06"},{"v":-0.00149269933,"d":"-1.49E-03"},{"v":0.0625694294,"d":"6.26E-02"},{"v":-14.5694735,"d":"-1.46E+01"},{"v":1880.78855,"d":"1.88E+03"},null,{"v":-9.22855325e-09,"d":"-9.23E-09"},{"v":3.11156473e-05,"d":"3.11E-05"},{"v":0.00942250186,"d":"9.42E-03"},{"v":74.0270709,"d":"7.40E+01"},{"v":4.00472963e-05,"d":"4.00E-05"},{"v":-0.202406845,"d":"-2.02E-01"},{"v":1666.42698,"d":"1.67E+03"},null,null,{"v":-0.000673100317,"d":"-6.73E-04"},{"v":0.0287871459,"d":"2.88E-02"},{"v":-17.0235516,"d":"-1.70E+01"},{"v":1700.45593,"d":"1.70E+03"},null,{"v":3.81472518e-09,"d":"3.81E-09"},{"v":-2.19102323e-05,"d":"-2.19E-05"},{"v":0.063273982,"d":"6.33E-02"},{"v":29.9943152,"d":"3.00E+01"},null,{"v":-0.205007951,"d":"-2.05E-01"},{"v":1312.56576,"d":"1.31E+03"},null,null,{"v":-0.000319853991,"d":"-3.20E-04"},{"v":0.0533040722,"d":"5.33E-02"},{"v":-10.9728226,"d":"-1.10E+01"},{"v":3022.33429,"d":"3.02E+03"},null,null,{"v":-2.54523018e-05,"d":"-2.55E-05"},{"v":0.168327392,"d":"1.68E-01"},{"v":71.3884069,"d":"7.14E+01"},null,{"v":-0.190251791,"d":"-2E-01"},{"v":2226.59597,"d":"2E+03"},60,null,60,null,{"$f":"EX61","v":59.5},null,59.5,null,17.5,{"$f":"Tavg_cold","v":17},17.5,17.5,17.5,18.2,17.5,{"$f":"FH61*1.05","v":18.375},17.5,null,0.5,{"v":0.9825,"d":"0.98"},1.4700000000000002,{"v":0.5626299961676311,"d":"56.26%"},{"$f":"DU61","v":{"v":1700.45593,"d":"1700.5"}},{"$f":"EI61","v":{"v":3022.33429,"d":"3022.3"}},{"$f":"FP62","v":{"v":0.6360425768785491,"d":"63.60%"}},{"v":1700.45593,"d":"1700.46"},{"v":0,"d":"0.00"},{"v":1100.0009999999997,"d":"1100.00"},{"v":0,"d":"0.00%"},{"v":17.5,"d":"17.50"},{"v":17.685000000000002,"d":"17.69"},{"v":0.18500000000000227,"d":"0.19"},{"v":23.520000000000003,"d":"23.52"},{"v":6.020000000000003,"d":"6.02"},{"v":17.5,"d":"17.50"},{"v":17.5,"d":"17.50"},null,15.69066559142683,null,{"v":0,"d":"0.0%"},null,{"v":2334.1781978570243,"d":"2334.18"},{"v":15286.37414745011,"d":"15286.37"},{"v":1167.0890989285122,"d":"1167.09"},{"v":1167.089098928512,"d":"1167.09"},{"v":7.2478490515896785E-3,"d":"0.01"},{"v":7.2478490515896785E-3,"d":"0.01"},{"v":38.49069218350365,"d":"38.49"},{"v":73.59874633210555,"d":"73.60"},{"v":0.0763483274497237,"d":"8%"},null,{"v":3557.0118570174286,"d":"3557.01"},{"v":2311.7121159638523,"d":"2311.71"},{"v":1778.5059285087143,"d":"1778.51"},{"v":1778.5059285087143,"d":"1778.51"},{"v":1778.5059285087143,"d":"1778.51"},{"v":0.011112703645172665,"d":"0.0111"},{"v":0.011112703645172665,"d":"0.0111"},{"v":0.011112703645172665,"d":"0.01"},{"v":55.47783951997643,"d":"55.48"},{"v":55.47783951997643,"d":"55.48"},{"v":48.13697952086402,"d":"48.14"},{"v":19.415087041495514,"d":"19.42"},{"v":19.415087041495514,"d":"19.42"},{"v":4094.3007616661316,"d":"4094"},1700.45593,4094.3007616661316,17.5,17.5,{"v":4094.3007616661316,"d":"4094"},1,{"v":4094.3007616661316,"d":"4094"},0.5,{"v":0.9825,"d":"0.98"},1.4700000000000002,{"v":0.5626299961676311,"d":"56.26%"},{"v":1700.45593,"d":"1700.5"},{"v":3022.33429,"d":"3022.3"},{"$f":"HR62","v":{"v":0.6360425768785491,"d":"63.60%"}},{"v":1700.45593,"d":"1700.46"},{"v":0,"d":"0.00"},{"v":1100.0009999999997,"d":"1100.00"},{"v":0,"d":"0.00%"},{"v":17.5,"d":"17.50"},{"v":17.685000000000002,"d":"17.69"},{"v":0.18500000000000227,"d":"0.19"},{"v":23.520000000000003,"d":"23.52"},{"v":6.020000000000003,"d":"6.02"},{"v":17.5,"d":"17.50"},{"v":17.5,"d":"17.50"},null,15.69066559142683,null,{"v":0.00960213849511768,"d":"1.0%"},null,{"v":2334.1781978570243,"d":"2334.18"},{"v":15286.37414745011,"d":"15286.37"}]
[null,{"v":1,"d":"100%"},10,{"v":22199.735301168173,"d":"22200"},1909,{"v":31.78253897131682,"d":"31.8"},{"v":4540.478394254161,"d":"4540"},{"v":4540.478394254161,"d":"4540"},{"$f":"IF(Geg_dP<AB62,ROUND(((IF('Briza 22 & 26'!$M$4=\"High Perform. 208/230V (US/EU)\",cal!HK62,H62)/Watts)/((Tr_cool-Tv_cool)*1.163))*FlowH2O,IF(UnitsNo=1,0,IF(UnitsNo=2,2))),\"\")","v":1952},{"v":33.09833777764766,"d":"33.1"},{"v":55,"d":"55.0"},{"$f":"IF(Geg_dP<$AB62,IF(CalcNo=\"12\",$ET62,IF(CalcNo=\"22\",$ET62,IF(CalcNo=\"13\",$EU62,IF(CalcNo=\"23\",$EU62,IF(CalcNo=\"11\",$ER62,IF(CalcNo=\"21\",$ER62,IF(CalcNo=\"14\",$ES62,IF(CalcNo=\"24\",$ES62,IF(CalcNo=\"32\",$EX62,IF(CalcNo=\"42\",$EX62,IF(CalcNo=\"33\",$EY62,IF(CalcNo=\"43\",$EY62,IF(CalcNo=\"31\",$EV62,IF(CalcNo=\"41\",$EV62,IF(CalcNo=\"34\",$EW62,IF(CalcNo=\"44\",$EW62,)))))))))))))))),\"\")","v":{"v":63,"d":"63.0"}},{"$f":"IF(Geg_dP<$AB62,($CF62*(($N62*CFMs)^4))+($CG62*(($N62*CFMs)^3))+($CH62*(($N62*CFMs)^2))+($CI62*($N62*CFMs))+$CJ62,\"\")","v":{"v":131.5320102475324,"d":"131.5"}},{"v":1922.33329,"d":"1922"},{"v":1.277467630249867,"d":"1.28"},{"v":53.89806416407508,"d":"53.9"},{"v":24.291578157865235,"d":"24.3"},{"v":19.97977616287026,"d":"20.0"},{"v":17.135704956637436,"d":"17.1"},{"v":0.7628941373276372,"d":"76%"},{"$f":"IF(Geg_dP<$AB62,($CK62*($N62/Cubics)^2)+($CL62*($N62/Cubics)^1)+$CM62,\"\")","v":{"v":1100.4639023864406,"d":"1100"}},{"v":0.24632317369435802,"d":"0.25"},{"v":2.3619621102510067,"d":"2.362"},0.981618,1.2733,1.09292,0.981618,112.751,0.981618,1.2733,1.09292,{"v":82,"d":"82.00"},0.981618,1.2733,1.09292,{"v":145,"d":"145.00"},0.981618,1.2733,1.09292,{"v":112.751,"d":"112.75"},0.995474215844912,1.174754876804744,1.1067294843129272,{"$f":"AR61","v":{"v":220.364,"d":"220.36"}},0.981618,1.2733,1.09292,{"$f":"AF62","v":{"v":82,"d":"82.00"}},0.981618,1.2733,1.09292,{"$f":"AJ62","v":{"v":145,"d":"145.00"}},1.0049716964208173,1.2385624038262057,1.1162269648888619,{"$f":"AN62","v":{"v":112.751,"d":"112.75"}},0.9693677323903813,1.070246709143203,1.0806230008584556,{"$f":"AR62","v":{"v":220.364,"d":"220.36"}},null,null,{"v":3.01818304,"d":"3.02E+00"},{"v":-9.96659923,"d":"-9.97E+00"},{"v":1.82115,"d":"1.82E+00"},{"v":3.01818304,"d":"3.02E+00"},{"v":-9.96659923,"d":"-9.97E+00"},{"v":1.82115,"d":"1.82E+00"},{"v":620.328794,"d":"6.20E+02"},{"$f":"BO62","v":{"v":-9.96659923,"d":"-9.97E+00"}},{"$f":"+BP62","v":{"v":1.82115,"d":"1.82E+00"}},{"v":-31.9053244,"d":"-3.19E+01"},{"v":15.2900115,"d":"1.53E+01"},{"v":1.92807237,"d":"1.93E+00"},{"$f":"BQ62","v":{"v":620.328794,"d":"6.20E+02"}},{"$f":"BU62","v":{"v":15.2900115,"d":"1.53E+01"}},{"$f":"+BV62","v":{"v":1.92807237,"d":"1.93E+00"}},{"v":0,"d":"0.00E+00"},{"v":-8.09907863e-06,"d":"-8.10E-06"},{"v":0.00131506737,"d":"1.32E-03"},{"v":-0.0686778412,"d":"-6.87E-02"},{"v":-13.7170569,"d":"-1.37E+01"},{"v":1922.33329,"d":"1.92E+03"},{"v":0,"d":"0.00E+00"},{"v":-3.32940134e-08,"d":"-3.33E-08"},{"v":5.00524432e-05,"d":"5.01E-05"},{"v":0.0476571392,"d":"4.77E-02"},{"v":61.7596691,"d":"6.18E+01"},{"v":0,"d":"0.00E+00"},{"v":-0.227233243,"d":"-2.27E-01"},{"v":1537.28193,"d":"1.54E+03"},null,null,{"v":-0.000892190231,"d":"-8.92E-04"},{"v":0.0608546184,"d":"6.09E-02"},{"v":-18.1400515,"d":"-1.81E+01"},{"v":1848.58896,"d":"1.85E+03"},null,{"v":-4.4829889e-08,"d":"-4.48E-08"},{"v":7.38742636E-5,"d":"7.39E-05"},{"v":0.0253668607,"d":"2.54E-02"},{"v":51.250795,"d":"5.13E+01"},null,{"v":-0.129706989,"d":"-1.30E-01"},{"v":1333.16728,"d":"1.33E+03"},null,{"v":-2.02427517e-06,"d":"-2.02E-06"},{"v":0.000392066983,"d":"3.92E-04"},{"v":-0.0376681098,"d":"-3.77E-02"},{"v":-11.1849917,"d":"-1.12E+01"},{"v":2175.95255,"d":"2.18E+03"},null,{"v":-1.76564709e-09,"d":"-1.77E-09"},{"v":-6.78620004e-06,"d":"-6.79E-06"},{"v":0.103372571,"d":"1.03E-01"},{"v":86.4495318,"d":"8.64E+01"},{"v":1.01981148E-7,"d":"1.02E-07"},{"v":-0.118299299,"d":"-1.18E-01"},{"v":1839.51008,"d":"1.84E+03"},null,{"v":-8.09907863e-06,"d":"-8.10E-06"},{"v":0.00131506737,"d":"1.32E-03"},{"v":-0.0686778412,"d":"-6.87E-02"},{"v":-13.7170569,"d":"-1.37E+01"},{"v":1922.33329,"d":"1.92E+03"},null,{"v":-3.32940134e-08,"d":"-3.33E-08"},{"v":5.00524432e-05,"d":"5.01E-05"},{"v":0.0476571392,"d":"4.77E-02"},{"v":61.7596691,"d":"6.18E+01"},null,{"v":-0.227233243,"d":"-2.27E-01"},{"v":1537.28193,"d":"1.54E+03"},{"$f":"ED61","v":0},0,{"v":-0.000319853991,"d":"-3.20E-04"},{"v":0.0533040722,"d":"5.33E-02"},{"v":-10.9728226,"d":"-1.10E+01"},{"v":3022.33429,"d":"3.02E+03"},{"$f":"EJ61","v":0},0,{"v":-2.54523018e-05,"d":"-2.55E-05"},{"v":0.168327392,"d":"1.68E-01"},{"v":71.3884069,"d":"7.14E+01"},0,{"v":-0.190251791,"d":"-2E-01"},{"v":2226.59597,"d":"2E+03"},63,null,63,null,{"$f":"EX62","v":62.5},null,62.5,null,17.5,{"$f":"Tavg_cold","v":17},17.5,17.5,17.5,18.2,{"$f":"IF($GC62<=$FU62,$FU62,IF($FM62<=$FP62,Tavg_cold,$GA62))","v":17.5},{"$f":"FH62*1.05","v":18.375},17.5,null,0.5,{"v":0.9825,"d":"0.98"},1.4700000000000002,{"v":0.6360425768785491,"d":"63.60%"},{"$f":"DU62","v":{"v":1922.33329,"d":"1922.3"}},{"$f":"EI62","v":{"v":3022.33429,"d":"3022.3"}},{"$f":"FN62/FO62","v":{"v":0.6360425768785491,"d":"63.60%"}},{"v":1922.33329,"d":"1922.33"},{"v":0,"d":"0.00"},{"v":1100.0009999999997,"d":"1100.00"},{"v":0,"d":"0.00%"},{"v":17.5,"d":"17.50"},{"v":17.685000000000002,"d":"17.69"},{"v":0.18500000000000227,"d":"0.19"},{"v":23.520000000000003,"d":"23.52"},{"v":6.020000000000003,"d":"6.02"},{"v":17.5,"d":"17.50"},{"v":17.5,"d":"17.50"},null,15.69066559142683,null,{"v":0,"d":"0.0%"},null,{"v":2334.1781978570243,"d":"2334.18"},{"v":14871.905162169252,"d":"14871.91"},{"v":1167.0890989285122,"d":"1167.09"},{"v":1167.089098928512,"d":"1167.09"},{"v":7.2478490515896785E-3,"d":"0.01"},{"v":7.2478490515896785E-3,"d":"0.01"},{"v":38.49069218350365,"d":"38.49"},{"v":73.01768332601743,"d":"73.02"},{"v":0.07847609880523723,"d":"8%"},null,{"v":3557.0118570174286,"d":"3557.01"},{"v":2331.2617589888573,"d":"2331.26"},{"v":1778.5059285087143,"d":"1778.51"},{"v":1778.5059285087143,"d":"1778.51"},{"v":1778.5059285087143,"d":"1778.51"},{"v":0.011112703645172665,"d":"0.0111"},{"v":0.011112703645172665,"d":"0.0111"},{"v":0.011112703645172665,"d":"0.01"},{"v":55.47783951997643,"d":"55.48"},{"v":55.47783951997643,"d":"55.48"},{"v":48.27662900632467,"d":"48.28"},{"v":19.415087041495514,"d":"19.42"},{"v":19.415087041495514,"d":"19.42"},{"v":4540.478394254161,"d":"4540"},1922.33329,4540.478394254161,17.5,17.5,{"v":4540.478394254161,"d":"4540"},1,{"v":4540.478394254161,"d":"4540"},0.5,{"v":0.9825,"d":"0.98"},1.4700000000000002,{"v":0.6360425768785491,"d":"63.60%"},{"v":1922.33329,"d":"1922.3"},{"v":3022.33429,"d":"3022.3"},{"$f":"HP62/HQ62","v":{"v":0.6360425768785491,"d":"63.60%"}},{"v":1922.33329,"d":"1922.33"},{"v":0,"d":"0.00"},{"v":1100.0009999999997,"d":"1100.00"},{"v":0,"d":"0.00%"},{"v":17.5,"d":"17.50"},{"v":17.685000000000002,"d":"17.69"},{"v":0.18500000000000227,"d":"0.19"},{"v":23.520000000000003,"d":"23.52"},{"v":6.020000000000003,"d":"6.02"},{"v":17.5,"d":"17.50"},{"v":17.5,"d":"17.50"},null,15.69066559142683,null,{"v":0.00960213849511768,"d":"1.0%"},null,{"v":2334.1781978570243,"d":"2334.18"},{"v":14871.905162169252,"d":"14871.91"}]
[null,{"$f":"IF(LangNo=1,NL!A63,IF(LangNo=2,EN!A63,IF(LangNo=3,DE!A63,IF(LangNo=4,FR!A63,IF(LangNo=5,NR!A63,IF(LangNo=6,SP!A63,IF(LangNo=7,SW!A63,IF(LangNo=8,TS!A63,IF(LangNo=9,ExtraTaal1!A63,IF(LangNo=10,ExtraTaal2!A63,IF(LangNo=11,ExtraTaal3!A63,)))))))))))","v":"*Values according to EN 1397 equipped with a G2 filter."},{"$nulls":18},"v2022-09-15",{"$nulls":40},{"$f":"IF($BK$17=\"11\",BO63,IF($BK$17=\"21\",BR63,IF($BK$17=\"12\",BO63,IF($BK$17=\"22\",BR63,IF($BK$17=\"13\",BO63,IF($BK$17=\"23\",BR63,IF($BK$17=\"14\",BO63,IF($BK$17=\"24\",BR63,IF($BK$17=\"31\",BU63,IF($BK$17=\"41\",BX63,IF($BK$17=\"32\",BU63,IF($BK$17=\"42\",BX63,IF($BK$17=\"33\",BU63,IF($BK$17=\"43\",BX63,IF($BK$17=\"34\",BU63,IF($BK$17=\"44\",BX63,))))))))))))))))","v":22},{"$f":"(BN63+IF(CaseNo=1,0,IF(CaseNo=2,$BN$2,)))*MilInch","v":54.5},{"$f":"(BJ63+IF(CaseNo=1,0,IF(CaseNo=2,$BN$3,)))*MilInch","v":22},{"$f":"(BP63+IF(CaseNo=1,0,IF(CaseNo=2,$BN$4,)))*MilInch","v":190},54.5,22,190,54.5,22,190,54.5,26,190,54.5,26,190]
[null,{"$f":"IF(LangNo=1,NL!A64,IF(LangNo=2,EN!A64,IF(LangNo=3,DE!A64,IF(LangNo=4,FR!A64,IF(LangNo=5,NR!A64,IF(LangNo=6,SP!A64,IF(LangNo=7,SW!A64,IF(LangNo=8,TS!A64,IF(LangNo=9,ExtraTaal1!A64,IF(LangNo=10,ExtraTaal2!A64,IF(LangNo=11,ExtraTaal3!A64,)))))))))))","v":"**Sound power according to ISO 3741:2010"}]
[null,{"$f":"IF(LangNo=1,NL!A65,IF(LangNo=2,EN!A65,IF(LangNo=3,DE!A65,IF(LangNo=4,FR!A65,IF(LangNo=5,NR!A65,IF(LangNo=6,SP!A65,IF(LangNo=7,SW!A65,IF(LangNo=8,TS!A65,IF(LangNo=9,ExtraTaal1!A65,IF(LangNo=10,ExtraTaal2!A65,IF(LangNo=11,ExtraTaal3!A65,)))))))))))","v":"***Sound pressure with an assumed room damping of 8dB(A)"}]
[null,{"$f":"IF(LangNo=1,NL!A66,IF(LangNo=2,EN!A66,IF(LangNo=3,DE!A66,IF(LangNo=4,FR!A66,IF(LangNo=5,NR!A66,IF(LangNo=6,SP!A66,IF(LangNo=7,SW!A66,IF(LangNo=8,TS!A66,IF(LangNo=9,ExtraTaal1!A66,IF(LangNo=10,ExtraTaal2!A66,IF(LangNo=11,ExtraTaal3!A66,)))))))))))","v":"****Calculated RH directly after the heat exchanger, assumed with a location-independent surface temperature."}]
[]
[null,{"$f":"IF(LangNo=1,NL!U22,IF(LangNo=2,EN!U22,IF(LangNo=3,DE!U22,IF(LangNo=4,FR!U22,IF(LangNo=5,NR!U22,IF(LangNo=6,SP!U22,IF(LangNo=7,SW!U22,IF(LangNo=8,TS!U22,IF(LangNo=9,ExtraTaal1!U22,IF(LangNo=10,ExtraTaal2!U22,IF(LangNo=11,ExtraTaal3!U22,)))))))))))","v":"Briza has multiple airflow supply and return air connection options. Visit our website for more information."},{"$nulls":13},{"$f":"1/(1+((2258*((0.622/((101325/(1*611*EXP(17.27*(EZ21/(EZ21+237.3))))))-1)*1000-(0.622/((101325/(RH*611*EXP(17.27*(Tl_cool/(Tl_cool+237.3))))))-1)*1000))/(1005*(Tavg_cold-Tl_cool))))","v":1.4282136185823657}]
[{"$nulls":15},{"$f":"((2258*((0.622/((101325/(1*611*EXP(17.27*(EZ21/(EZ21+237.3))))))-1)*1000-(0.622/((101325/(RH*611*EXP(17.27*(Tl_cool/(Tl_cool+237.3))))))-1)*1000))/(1005*(Tavg_cold-Tl_cool)))","v":-0.2998246291807576}]
[{"$nulls":15},{"$f":"(2258*((0.622/((101325/(1*611*EXP(17.27*(EZ21/(EZ21+237.3))))))-1)*1000-(0.622/((101325/(RH*611*EXP(17.27*(Tl_cool/(Tl_cool+237.3))))))-1)*1000))","v":3013.2375232666136}]
[{"$nulls":15},{"$f":"(1005*(Tavg_cold-Tl_cool))","v":-10050}]
[null,null,0,0,{"$f":"D72*1","v":0}]
[null,null,{"v":133.768339,"d":"134"},{"v":552.9996158821616,"d":"553"},{"$f":"D73*1","v":{"v":552.9996158821616,"d":"553"}}]
[null,null,{"v":142.571774,"d":"143"},{"v":571.0543119289309,"d":"571"},{"v":571.0543119289309,"d":"571"}]
[null,null,{"v":254.186551,"d":"254"},{"v":760.700339020962,"d":"761"},{"v":760.700339020962,"d":"761"}]
[null,null,{"v":312.667623,"d":"313"},{"v":851.2209665356868,"d":"851"},{"v":851.2209665356868,"d":"851"}]
[null,null,{"v":354.986764,"d":"355"},{"v":921.6755553100438,"d":"922"},{"v":921.6755553100438,"d":"922"}]
[null,null,{"v":450.174779,"d":"450"},{"v":1031.2758442379063,"d":"1031"},{"v":1031.2758442379063,"d":"1031"}]
[null,null,{"v":464.177143,"d":"464"},{"v":1058.561285943946,"d":"1059"},{"v":1058.561285943946,"d":"1059"}]
[null,null,{"v":500.134295,"d":"500"},{"v":1102.664893330653,"d":"1103"},{"v":1102.664893330653,"d":"1103"}]
[null,null,{"v":587.303999,"d":"587"},{"v":1136.8084357787336,"d":"1137"},{"v":1136.8084357787336,"d":"1137"}]
[null,null,{"v":677.341451,"d":"677"},{"v":997.0845108366809,"d":"997"},{"v":997.0845108366809,"d":"997"}]
[]
[]
[null,null,{"v":133.768339,"d":"134"},{"v":552.9996158821616,"d":"553"}]
[null,null,{"v":254.186551,"d":"254"},{"v":760.700339020962,"d":"761"}]
[null,null,{"v":354.986764,"d":"355"},{"v":921.6755553100438,"d":"922"}]
[null,null,{"v":450.174779,"d":"450"},{"v":1031.2758442379063,"d":"1031"}]
[null,null,{"v":500.134295,"d":"500"},{"v":1102.664893330653,"d":"1103"}]

{"sheet":"NL","index":2,"n_rows":66,"n_cols":23,"rows_kept":66,"hidden":true,"merged":[[2,6,2,9],[3,6,3,9],[5,11,5,12],[6,11,6,12],[6,16,6,17],[6,18,6,19],[7,0,7,2],[7,5,7,8],[7,16,9,17],[8,0,8,2],[8,5,8,8],[8,11,8,12],[9,0,9,2],[9,5,9,8],[9,11,9,12],[14,0,14,11],[14,12,14,16],[22,0,22,11],[22,12,22,16],[30,0,30,11],[30,12,30,16],[38,0,38,11],[38,12,38,16],[46,0,46,11],[46,12,46,16],[54,0,54,11],[54,12,54,16]]}
[]
["Selectiontool"]
[{"$nulls":6},"Hydronisch mengsel:",0,0,0]
["Randvoorwaarden",{"$nulls":5},"Toestel - Ventilator - Uitvoering:",0,0,0]
[]
["Temperaturen",{"$nulls":10},"Statisch drukverlies"]
["Verwarmen:",{"$nulls":4},"Koelen:",{"$nulls":10},"Eenheidsstelsel",null,"Gekende variabelen"]
[{"$f":"\"Water aanvoer\"","v":"Water aanvoer"},null,null,{"$f":"cal!E10","v":65},{"$f":"IF(cal!$Z$5=1,\"°C\",IF(cal!$Z$5=2,\"°F\"))","v":"°C"},{"$f":"A8","v":"Water aanvoer"},{"$nulls":3},{"$f":"cal!K10","v":16},{"$f":"E8","v":"°C"}]
[{"$f":"\"Water retour\"","v":"Water retour"},null,null,{"$f":"cal!E11","v":55},{"$f":"E8","v":"°C"},{"$f":"A9","v":"Water retour"},{"$nulls":3},{"$f":"cal!K11","v":18},{"$f":"E8","v":"°C"},"Geplaatste hoogte"]
[{"$f":"\"Ruimte (droge bol)\"","v":"Ruimte (droge bol)"},null,null,{"$f":"cal!E12","v":20},{"$f":"E8","v":"°C"},{"$f":"A10","v":"Ruimte (droge bol)"},{"$nulls":3},{"$f":"cal!K12","v":27},{"$f":"E8","v":"°C"},{"$nulls":9},"Gewenst debiet"]
["Ruimte (natte bol)",{"$nulls":4},"Relatieve vochtigheid",{"$nulls":3},{"$f":"cal!K14","v":{"v":0.5,"d":"50%"}},{"$nulls":10},"Te berekenen op"]
[]
[]
["Snelheidsniveau","Stuurspanning [V]",{"$f":"CONCATENATE(\"Warmteafgifte * \",ROUND(D8,0),\"/\",ROUND(D9,0),\"/\",ROUND(D10,0),\" [\"&IF(cal!$Z$5=1,\"W\",IF(cal!$Z$5=2,\"Btu/h\"))&\"]\")","v":"Warmteafgifte * 65/55/20 [W]"},{"$f":"\"Waterdebiet, verwarming [\"&IF(cal!$Z$5=1,\"l/h\",IF(cal!$Z$5=2,\"GPM\"))&\"]\"","v":"Waterdebiet, verwarming [l/h]"},{"$f":"\"Waterzijdig drukverlies [\"&IF(cal!$Z$5=1,\"kPa\",IF(cal!$Z$5=2,\"ftH2O\"))&\"]\"","v":"Waterzijdig drukverlies [kPa]"},{"$f":"CONCATENATE(\"Voelb. Koelcapaciteit * \",ROUND(J8,0),\"/\",,ROUND(J9,0),\"/\",,ROUND(J10,0),\" [\"&IF(cal!$Z$5=1,\"W\",IF(cal!$Z$5=2,\"Btu/h\"))&\"]\")","v":"Voelb. Koelcapaciteit * 16/18/27 [W]"},{"$f":"CONCATENATE(\"Tot. koelcapaciteit \",,ROUND(J8,0),\"/\",,ROUND(J9,0),\"/\",,ROUND(J10,0),\" [\"&IF(cal!$Z$5=1,\"W\",IF(cal!$Z$5=2,\"Btu/h\"))&\"]\")","v":"Tot. koelcapaciteit 16/18/27 [W]"},{"$f":"\"Waterdebiet, koeling [\"&IF(cal!$Z$5=1,\"l/h\",IF(cal!$Z$5=2,\"GPM\"))&\"]\"","v":"Waterdebiet, koeling [l/h]"},{"$f":"E14","v":"Waterzijdig drukverlies [kPa]"},"Geluidsdruk *** [dB(A)]","Geluidsvermogen ** [dB(A)]","Opgenomen elektr. vermogen [W]",{"$f":"\"Luchtdebiet [\"&IF(cal!$Z$5=1,\"m³/h\",IF(cal!$Z$5=2,\"CFM\"))&\"]\"","v":"Luchtdebiet [m³/h]"},{"$f":"\"Luchtsnelheid [\"&IF(cal!$Z$5=1,\"m/s\",IF(cal!$Z$5=2,\"ft/min\"))&\"]\"","v":"Luchtsnelheid [m/s]"},{"$f":"\"Uitblaastemp. verwarming [\"&IF(cal!$Z$5=1,\"°C\",IF(cal!$Z$5=2,\"°F\"))&\"]\"","v":"Uitblaastemp. verwarming [°C]"},{"$f":"\"Uitblaastemp. verwarming         (natte bol) [\"&IF(cal!$Z$5=1,\"°C\",IF(cal!$Z$5=2,\"°F\"))&\"]\"","v":"Uitblaastemp. verwarming         (natte bol) [°C]"},{"$f":"\"Uitblaastemp. koeling (droge bol) [\"&IF(cal!$Z$5=1,\"°C\",IF(cal!$Z$5=2,\"°F\"))&\"]\"","v":"Uitblaastemp. koeling (droge bol) [°C]"},{"$f":"\"Uitblaastemp. koeling (natte bol) [\"&IF(cal!$Z$5=1,\"°C\",IF(cal!$Z$5=2,\"°F\"))&\"]\"","v":"Uitblaastemp. koeling (natte bol) [°C]"},"Rel. vocht. gekoelde lucht [%]","Rotatiefrequentie ventilator [toeren/minuut]","Specifiek ventilatorvermogen"]
[{"$f":"cal!$AK$7&\" \"&$V$16&\" \"&ROUND(cal!BK23,1)&IF(cal!$Z$5=1,\" cm, \",IF(cal!$Z$5=2,\" in, \"))&$V$17&\" \"&ROUND(cal!BL23,1)&IF(cal!$Z$5=1,\" cm, \",IF(cal!$Z$5=2,\" in, \"))&$V$18&\" \"&ROUND(cal!BM23,1)&IF(cal!$Z$5=1,\" cm \",IF(cal!$Z$5=2,\" in \"))&$S15","v":"Briza 22 (230V) hoogte 54,5 cm, breedte 22 cm, lengte 55 cm (Type 02)"},{"$nulls":11},{"$f":"$U$27","v":"Bestelcode:"},{"$nulls":5},"(Type 02)"]
[{"$nulls":20},"Δp hoog!","hoogte","Kopieer alle data"]
[{"$nulls":20},"Temp.","breedte","SI-eenheden"]
[{"$nulls":20},"verw.!","lengte","Imperiale-eenheden"]
[{"$nulls":20},"koelen!",null,"T,nb & RV"]
[{"$nulls":22},"T,db & RV"]
[{"$nulls":22},"T,db & T,nb"]
[{"$nulls":20},"Briza heeft meerdere inlaat- en uitlaatvariaties voor de luchtdoorstroming. Bezoek onze website voor meer informatie.",null,"Enkel op aanvraag!"]
[{"$f":"cal!$AK$7&\" \"&$V$16&\" \"&ROUND(cal!BK31,1)&IF(cal!$Z$5=1,\" cm, \",IF(cal!$Z$5=2,\" in, \"))&$V$17&\" \"&ROUND(cal!BL31,1)&IF(cal!$Z$5=1,\" cm, \",IF(cal!$Z$5=2,\" in, \"))&$V$18&\" \"&ROUND(cal!BM31,1)&IF(cal!$Z$5=1,\" cm \",IF(cal!$Z$5=2,\" in \"))&$S23","v":"Briza 22 (230V) hoogte 54,5 cm, breedte 22 cm, lengte 75 cm (Type 03)"},{"$nulls":11},{"$f":"$U$27","v":"Bestelcode:"},{"$nulls":5},"(Type 03)",{"$nulls":3},"Toestel Niet beschikbaar met omkasting!"]
[{"$nulls":20},"Plafondmodel"]
[{"$nulls":20},"Muurmodel"]
[]
[{"$nulls":20},"Bestelcode:"]
[]
[]
[]
[{"$f":"cal!$AK$7&\" \"&$V$16&\" \"&ROUND(cal!BK39,1)&IF(cal!$Z$5=1,\" cm, \",IF(cal!$Z$5=2,\" in, \"))&$V$17&\" \"&ROUND(cal!BL39,1)&IF(cal!$Z$5=1,\" cm, \",IF(cal!$Z$5=2,\" in, \"))&$V$18&\" \"&ROUND(cal!BM39,1)&IF(cal!$Z$5=1,\" cm \",IF(cal!$Z$5=2,\" in \"))&$S31","v":"Briza 22 (230V) hoogte 54,5 cm, breedte 22 cm, lengte 95 cm (Type 04)"},{"$nulls":11},{"$f":"$U$27","v":"Bestelcode:"},{"$nulls":5},"(Type 04)"]
{"$rows_empty":7}
[{"$f":"cal!$AK$7&\" \"&$V$16&\" \"&ROUND(cal!BK47,1)&IF(cal!$Z$5=1,\" cm, \",IF(cal!$Z$5=2,\" in, \"))&$V$17&\" \"&ROUND(cal!BL47,1)&IF(cal!$Z$5=1,\" cm, \",IF(cal!$Z$5=2,\" in, \"))&$V$18&\" \"&ROUND(cal!BM47,1)&IF(cal!$Z$5=1,\" cm \",IF(cal!$Z$5=2,\" in \"))&$S39","v":"Briza 22 (230V) hoogte 54,5 cm, breedte 22 cm, lengte 125 cm (Type 06)"},{"$nulls":11},{"$f":"$U$27","v":"Bestelcode:"},{"$nulls":5},"(Type 06)"]
{"$rows_empty":7}
[{"$f":"cal!$AK$7&\" \"&$V$16&\" \"&ROUND(cal!BK55,1)&IF(cal!$Z$5=1,\" cm, \",IF(cal!$Z$5=2,\" in, \"))&$V$17&\" \"&ROUND(cal!BL55,1)&IF(cal!$Z$5=1,\" cm, \",IF(cal!$Z$5=2,\" in, \"))&$V$18&\" \"&ROUND(cal!BM55,1)&IF(cal!$Z$5=1,\" cm \",IF(cal!$Z$5=2,\" in \"))&$S47","v":"Briza 22 (230V) hoogte 54,5 cm, breedte 22 cm, lengte 155 cm (Type 08)"},{"$nulls":11},{"$f":"$U$27","v":"Bestelcode:"},{"$nulls":5},"(Type 08)"]
{"$rows_empty":7}
[{"$f":"cal!$AK$7&\" \"&$V$16&\" \"&ROUND(cal!BK63,1)&IF(cal!$Z$5=1,\" cm, \",IF(cal!$Z$5=2,\" in, \"))&$V$17&\" \"&ROUND(cal!BL63,1)&IF(cal!$Z$5=1,\" cm, \",IF(cal!$Z$5=2,\" in, \"))&$V$18&\" \"&ROUND(cal!BM63,1)&IF(cal!$Z$5=1,\" cm \",IF(cal!$Z$5=2,\" in \"))&$S55","v":"Briza 22 (230V) hoogte 54,5 cm, breedte 22 cm, lengte 190 cm (Type 10)"},{"$nulls":11},{"$f":"$U$27","v":"Bestelcode:"},{"$nulls":5},"(Type 10)"]
{"$rows_empty":7}
["*Waardes gemeten volgens EN 1397 waarbij toestel uitgerust met G2 filter.",{"$nulls":15},{"$f":"cal!Q63","v":0}]
["**Geluidsvermogen gemeten volgens ISO 3741:2010"]
["***Geluidsdruk bij een aangenomen ruimtedemping van 8 dB(A)."]
["****Berekende RV vlak na de warmtewisselaar, verondersteld met een plaatsonafhankelijke oppervlaktetemperatuur."]

{"sheet":"EN","index":3,"n_rows":66,"n_cols":23,"rows_kept":66,"hidden":true,"merged":[[2,6,2,9],[3,6,3,9],[5,11,5,12],[6,11,6,12],[6,16,6,17],[6,18,6,19],[7,0,7,2],[7,5,7,8],[7,16,9,17],[8,0,8,2],[8,5,8,8],[8,11,8,12],[9,5,9,8],[9,11,9,12],[14,0,14,11],[14,12,14,16],[22,0,22,11],[22,12,22,16],[30,0,30,11],[30,12,30,16],[38,0,38,11],[38,12,38,16],[46,0,46,11],[46,12,46,16],[54,0,54,11],[54,12,54,16]]}
[]
["Formulary"]
[{"$nulls":6},"Hydronic mix:",0,0,0]
["Conditions",{"$nulls":5},"Device - Ventilator - Utilization:",0,0,0]
[]
["Temperatures",{"$nulls":10},"Static pressure"]
["Heating:",{"$nulls":4},"Cooling:",{"$nulls":10},"Unit conversion",null,"Known variables"]
["Supply water",null,null,{"$f":"cal!E10","v":65},{"$f":"IF(cal!$Z$5=1,\"°C\",IF(cal!$Z$5=2,\"°F\"))","v":"°C"},{"$f":"A8","v":"Supply water"},{"$nulls":3},{"$f":"cal!K10","v":16},{"$f":"E8","v":"°C"}]
["Return water",null,null,{"$f":"cal!E11","v":55},{"$f":"E8","v":"°C"},{"$f":"A9","v":"Return water"},{"$nulls":3},{"$f":"cal!K11","v":18},{"$f":"E8","v":"°C"},"Altitude"]
["Entering air (dry bulb)",null,null,{"$f":"cal!E12","v":20},{"$f":"E8","v":"°C"},{"$f":"A10","v":"Entering air (dry bulb)"},{"$nulls":3},{"$f":"cal!K12","v":27},{"$f":"E8","v":"°C"},{"$nulls":9},"Desired flow rate"]
["Entering air (wet bulb)",{"$nulls":4},"Relative humidity",{"$nulls":3},{"$f":"cal!K14","v":{"v":0.5,"d":"50%"}},{"$nulls":10},"To calculate on"]
[]
[]
["Speed level","Control voltage [V]",{"$f":"CONCATENATE(\"Heat output * \",ROUND(D8,0),\"/\",ROUND(D9,0),\"/\",ROUND(D10,0),\" [\"&IF(cal!$Z$5=1,\"W\",IF(cal!$Z$5=2,\"Btu/h\"))&\"]\")","v":"Heat output * 65/55/20 [W]"},{"$f":"\"Water flowrate, heating [\"&IF(cal!$Z$5=1,\"l/h\",IF(cal!$Z$5=2,\"GPM\"))&\"]\"","v":"Water flowrate, heating [l/h]"},{"$f":"\"Water side pressure loss [\"&IF(cal!$Z$5=1,\"kPa\",IF(cal!$Z$5=2,\"ftH2O\"))&\"]\"","v":"Water side pressure loss [kPa]"},{"$f":"CONCATENATE(\"Sens. cooling capacity * \",ROUND(J8,0),\"/\",ROUND(J9,0),\"/\",ROUND(J10,0),\" [\"&IF(cal!$Z$5=1,\"W\",IF(cal!$Z$5=2,\"Btu/h\"))&\"]\")","v":"Sens. cooling capacity * 16/18/27 [W]"},{"$f":"CONCATENATE(\"Tot. cooling capacity \",ROUND(J8,0),\"/\",ROUND(J9,0),\"/\",ROUND(J10,0),\" [\"&IF(cal!$Z$5=1,\"W\",IF(cal!$Z$5=2,\"Btu/h\"))&\"]\")","v":"Tot. cooling capacity 16/18/27 [W]"},{"$f":"\"Water flowrate, cooling [\"&IF(cal!$Z$5=1,\"l/h\",IF(cal!$Z$5=2,\"GPM\"))&\"]\"","v":"Water flowrate, cooling [l/h]"},{"$f":"E14","v":"Water side pressure loss [kPa]"},"Sound pressure *** [dB(A)]","Sound power ** [dB(A)]","Electrical power [W]",{"$f":"\"Air flowrate [\"&IF(cal!$Z$5=1,\"m³/h\",IF(cal!$Z$5=2,\"CFM\"))&\"]\"","v":"Air flowrate [m³/h]"},{"$f":"\"Face velocity [\"&IF(cal!$Z$5=1,\"m/s\",IF(cal!$Z$5=2,\"ft/min\"))&\"]\"","v":"Face velocity [m/s]"},{"$f":"\"Air exhaust temp. heating [\"&IF(cal!$Z$5=1,\"°C\",IF(cal!$Z$5=2,\"°F\"))&\"]\"","v":"Air exhaust temp. heating [°C]"},{"$f":"\"Air exhaust temp. heating (wet bulb) [\"&IF(cal!$Z$5=1,\"°C\",IF(cal!$Z$5=2,\"°F\"))&\"]\"","v":"Air exhaust temp. heating (wet bulb) [°C]"},{"$f":"\"Air exhaust temp. cooling (dry bulb) [\"&IF(cal!$Z$5=1,\"°C\",IF(cal!$Z$5=2,\"°F\"))&\"]\"","v":"Air exhaust temp. cooling (dry bulb) [°C]"},{"$f":"\"Air exhaust temp. cooling (wet bulb) [\"&IF(cal!$Z$5=1,\"°C\",IF(cal!$Z$5=2,\"°F\"))&\"]\"","v":"Air exhaust temp. cooling (wet bulb) [°C]"},"Rel. humid. cooled air [%]","fan rotation frequency [revolutions/minute]","Specific fan power"]
[{"$f":"cal!$AK$7&\" \"&$V$16&\" \"&ROUND(cal!BK23,1)&IF(cal!$Z$5=1,\" cm, \",IF(cal!$Z$5=2,\" in, \"))&$V$17&\" \"&ROUND(cal!BL23,1)&IF(cal!$Z$5=1,\" cm, \",IF(cal!$Z$5=2,\" in, \"))&$V$18&\" \"&ROUND(cal!BM23,1)&IF(cal!$Z$5=1,\" cm \",IF(cal!$Z$5=2,\" in \"))&$S15","v":"Briza 22 (230V) height 54,5 cm, width 22 cm, length 55 cm (Type 02)"},{"$nulls":11},{"$f":"$U$27","v":"Order code:"},{"$nulls":5},"(Type 02)"]
[{"$nulls":20},"Δp high!","height","Copy all data"]
[{"$nulls":20},"Temp.","width","SI-units"]
[{"$nulls":20},"heating!","length","Imperial-units"]
[{"$nulls":20},"cooling!",null,"T,wb & RH"]
[{"$nulls":22},"T,db & RH"]
[{"$nulls":22},"T,db & T,wb"]
[{"$nulls":20},"Briza has multiple airflow supply and return air connection options. Visit our website for more information.",null,"Only on request!"]
[{"$f":"cal!$AK$7&\" \"&$V$16&\" \"&ROUND(cal!BK31,1)&IF(cal!$Z$5=1,\" cm, \",IF(cal!$Z$5=2,\" in, \"))&$V$17&\" \"&ROUND(cal!BL31,1)&IF(cal!$Z$5=1,\" cm, \",IF(cal!$Z$5=2,\" in, \"))&$V$18&\" \"&ROUND(cal!BM31,1)&IF(cal!$Z$5=1,\" cm \",IF(cal!$Z$5=2,\" in \"))&$S23","v":"Briza 22 (230V) height 54,5 cm, width 22 cm, length 75 cm (Type 03)"},{"$nulls":11},{"$f":"$U$27","v":"Order code:"},{"$nulls":5},"(Type 03)",{"$nulls":3},"Product not available with casing!"]
[{"$nulls":20},"Ceiling model"]
[{"$nulls":20},"Wall model"]
[]
[{"$nulls":20},"Order code:"]
[]
[]
[]
[{"$f":"cal!$AK$7&\" \"&$V$16&\" \"&ROUND(cal!BK39,1)&IF(cal!$Z$5=1,\" cm, \",IF(cal!$Z$5=2,\" in, \"))&$V$17&\" \"&ROUND(cal!BL39,1)&IF(cal!$Z$5=1,\" cm, \",IF(cal!$Z$5=2,\" in, \"))&$V$18&\" \"&ROUND(cal!BM39,1)&IF(cal!$Z$5=1,\" cm \",IF(cal!$Z$5=2,\" in \"))&$S31","v":"Briza 22 (230V) height 54,5 cm, width 22 cm, length 95 cm (Type 04)"},{"$nulls":11},{"$f":"$U$27","v":"Order code:"},{"$nulls":5},"(Type 04)"]
{"$rows_empty":7}
[{"$f":"cal!$AK$7&\" \"&$V$16&\" \"&ROUND(cal!BK47,1)&IF(cal!$Z$5=1,\" cm, \",IF(cal!$Z$5=2,\" in, \"))&$V$17&\" \"&ROUND(cal!BL47,1)&IF(cal!$Z$5=1,\" cm, \",IF(cal!$Z$5=2,\" in, \"))&$V$18&\" \"&ROUND(cal!BM47,1)&IF(cal!$Z$5=1,\" cm \",IF(cal!$Z$5=2,\" in \"))&$S39","v":"Briza 22 (230V) height 54,5 cm, width 22 cm, length 125 cm (Type 06)"},{"$nulls":11},{"$f":"$U$27","v":"Order code:"},{"$nulls":5},"(Type 06)"]
{"$rows_empty":7}
[{"$f":"cal!$AK$7&\" \"&$V$16&\" \"&ROUND(cal!BK55,1)&IF(cal!$Z$5=1,\" cm, \",IF(cal!$Z$5=2,\" in, \"))&$V$17&\" \"&ROUND(cal!BL55,1)&IF(cal!$Z$5=1,\" cm, \",IF(cal!$Z$5=2,\" in, \"))&$V$18&\" \"&ROUND(cal!BM55,1)&IF(cal!$Z$5=1,\" cm \",IF(cal!$Z$5=2,\" in \"))&$S47","v":"Briza 22 (230V) height 54,5 cm, width 22 cm, length 155 cm (Type 08)"},{"$nulls":11},{"$f":"$U$27","v":"Order code:"},{"$nulls":5},"(Type 08)"]
{"$rows_empty":7}
[{"$f":"cal!$AK$7&\" \"&$V$16&\" \"&ROUND(cal!BK63,1)&IF(cal!$Z$5=1,\" cm, \",IF(cal!$Z$5=2,\" in, \"))&$V$17&\" \"&ROUND(cal!BL63,1)&IF(cal!$Z$5=1,\" cm, \",IF(cal!$Z$5=2,\" in, \"))&$V$18&\" \"&ROUND(cal!BM63,1)&IF(cal!$Z$5=1,\" cm \",IF(cal!$Z$5=2,\" in \"))&$S55","v":"Briza 22 (230V) height 54,5 cm, width 22 cm, length 190 cm (Type 10)"},{"$nulls":11},{"$f":"$U$27","v":"Order code:"},{"$nulls":5},"(Type 10)"]
{"$rows_empty":7}
["*Values according to EN 1397 equipped with a G2 filter.",{"$nulls":15},{"$f":"cal!Q63","v":0}]
["**Sound power according to ISO 3741:2010"]
["***Sound pressure with an assumed room damping of 8dB(A)"]
["****Calculated RH directly after the heat exchanger, assumed with a location-independent surface temperature."]

{"sheet":"DE","index":4,"n_rows":66,"n_cols":23,"rows_kept":66,"hidden":true,"merged":[[2,6,2,9],[3,6,3,9],[5,11,5,12],[6,11,6,12],[6,16,6,17],[6,18,6,19],[7,0,7,2],[7,5,7,8],[7,16,9,17],[8,0,8,2],[8,5,8,8],[8,11,8,12],[9,0,9,2],[9,5,9,8],[9,11,9,12],[14,0,14,11],[14,12,14,16],[22,0,22,11],[22,12,22,16],[30,0,30,11],[30,12,30,16],[38,0,38,11],[38,12,38,16],[46,0,46,11],[46,12,46,16],[54,0,54,11],[54,12,54,16]]}
[]
["Eingabefelder"]
[{"$nulls":6},"Wassermischung:"]
["Auslegungsrandbedingungen",{"$nulls":5},"Gerät - Lüfter - Ausfürhung:",0,0,0]
[]
["Temperaturen",{"$nulls":10},"Statischer Druckabfall"]
["Heizen:",{"$nulls":4},"Kühlen:",{"$nulls":10},"Einheiten",null,"Bekannte Variablen"]
[{"$f":"\"Vorlauf wasser\"","v":"Vorlauf wasser"},null,null,{"$f":"cal!E10","v":65},{"$f":"IF(cal!$Z$5=1,\"°C\",IF(cal!$Z$5=2,\"°F\"))","v":"°C"},{"$f":"A8","v":"Vorlauf wasser"},{"$nulls":3},{"$f":"cal!K10","v":16},{"$f":"E8","v":"°C"}]
[{"$f":"\"Rücklauf wasser\"","v":"Rücklauf wasser"},null,null,{"$f":"cal!E11","v":55},{"$f":"E8","v":"°C"},{"$f":"A9","v":"Rücklauf wasser"},{"$nulls":3},{"$f":"cal!K11","v":18},{"$f":"E8","v":"°C"},"Platzierte Höhe"]
[{"$f":"\"Raum (trocken)\"","v":"Raum (trocken)"},null,null,{"$f":"cal!E12","v":20},{"$f":"E8","v":"°C"},{"$f":"A10","v":"Raum (trocken)"},{"$nulls":3},{"$f":"cal!K12","v":27},{"$f":"E8","v":"°C"},{"$nulls":9},"Gewünschte Durchflussmenge"]
["Raum (feuchtkugel)",{"$nulls":4},"Relative Luftfeuchtigkeit",{"$nulls":3},{"$f":"cal!K14","v":{"v":0.5,"d":"50%"}},{"$nulls":10},"Um zu berechnen"]
[]
[]
["Drehzahlstufe","Regelspannung [V]",{"$f":"CONCATENATE(\"Wärmeleistung * \",ROUND(D8,0),\"/\",ROUND(D9,0),\"/\",ROUND(D10,0),\" [\"&IF(cal!$Z$5=1,\"W\",IF(cal!$Z$5=2,\"Btu/h\"))&\"]\")","v":"Wärmeleistung * 65/55/20 [W]"},{"$f":"\"Heizmittelstrom [\"&IF(cal!$Z$5=1,\"l/h\",IF(cal!$Z$5=2,\"GPM\"))&\"]\"","v":"Heizmittelstrom [l/h]"},{"$f":"\"zug. wassers. Druckverlust [\"&IF(cal!$Z$5=1,\"kPa\",IF(cal!$Z$5=2,\"ftH2O\"))&\"]\"","v":"zug. wassers. Druckverlust [kPa]"},{"$f":"CONCATENATE(\"Sens. Kälteleistung * \",ROUND(J8,0),\"/\",ROUND(J9,0),\"/\",ROUND(J10,0),\" [\"&IF(cal!$Z$5=1,\"W\",IF(cal!$Z$5=2,\"Btu/h\"))&\"]\")","v":"Sens. Kälteleistung * 16/18/27 [W]"},{"$f":"CONCATENATE(\"Tot. Kälteleistung \",ROUND(J8,0),\"/\",ROUND(J9,0),\"/\",ROUND(J10,0),\" [\"&IF(cal!$Z$5=1,\"W\",IF(cal!$Z$5=2,\"Btu/h\"))&\"]\")","v":"Tot. Kälteleistung 16/18/27 [W]"},{"$f":"\"Kühlmittelstrom [\"&IF(cal!$Z$5=1,\"l/h\",IF(cal!$Z$5=2,\"GPM\"))&\"]\"","v":"Kühlmittelstrom [l/h]"},{"$f":"E14","v":"zug. wassers. Druckverlust [kPa]"},"Schalldruckpegel *** [dB(A)]","Schallleistungspegel ** [dB(A)]","Leistungsaufnahme [W]",{"$f":"\"Luftvolumenstrom [\"&IF(cal!$Z$5=1,\"m³/h\",IF(cal!$Z$5=2,\"CFM\"))&\"]\"","v":"Luftvolumenstrom [m³/h]"},{"$f":"\"Fluggeschwindigkeit [\"&IF(cal!$Z$5=1,\"m/s\",IF(cal!$Z$5=2,\"ft/min\"))&\"]\"","v":"Fluggeschwindigkeit [m/s]"},{"$f":"\"Luftaustrittstemp. Heizung [\"&IF(cal!$Z$5=1,\"°C\",IF(cal!$Z$5=2,\"°F\"))&\"]\"","v":"Luftaustrittstemp. Heizung [°C]"},{"$f":"\"Luftaustrittstemp. Heizung (feuchtkugeltemp.) [\"&IF(cal!$Z$5=1,\"°C\",IF(cal!$Z$5=2,\"°F\"))&\"]\"","v":"Luftaustrittstemp. Heizung (feuchtkugeltemp.) [°C]"},{"$f":"\"Luftaustrittstemp. kühlung (trockentemp.) [\"&IF(cal!$Z$5=1,\"°C\",IF(cal!$Z$5=2,\"°F\"))&\"]\"","v":"Luftaustrittstemp. kühlung (trockentemp.) [°C]"},{"$f":"\"Luftaustrittstemp. kühlung (feuchtkugeltemp.) [\"&IF(cal!$Z$5=1,\"°C\",IF(cal!$Z$5=2,\"°F\"))&\"]\"","v":"Luftaustrittstemp. kühlung (feuchtkugeltemp.) [°C]"},"Rel. Luftf. gekühlte Luft [%]","Lüfterdrehfrequenz [Umdreh./Minute]","Spezifische Lüfterleistung"]
[{"$f":"cal!$AK$7&\" \"&$V$16&\" \"&ROUND(cal!BK23,1)&IF(cal!$Z$5=1,\" cm, \",IF(cal!$Z$5=2,\" in, \"))&$V$17&\" \"&ROUND(cal!BL23,1)&IF(cal!$Z$5=1,\" cm, \",IF(cal!$Z$5=2,\" in, \"))&$V$18&\" \"&ROUND(cal!BM23,1)&IF(cal!$Z$5=1,\" cm \",IF(cal!$Z$5=2,\" in \"))&$S15","v":"Briza 22 (230V) höhe 54,5 cm, breite 22 cm, länge 55 cm (Type 02)"},{"$nulls":11},{"$f":"$U$27","v":"Bestellcode:"},{"$nulls":5},"(Type 02)"]
[{"$nulls":20},"Δp hoch!","höhe","Kopieren Sie alle daten"]
[{"$nulls":20},"Temp.","breite","SI-einheiten"]
[{"$nulls":20},"heizen!","länge","Imperiale-einheiten"]
[{"$nulls":20},"kühlen!",null,"T,f & RH"]
[{"$nulls":22},"T,t & RH"]
[{"$nulls":22},"T,t & T,f"]
[{"$nulls":20},"Briza hat mehrere Einlass- und Auslassvarianten für den Luftstrom. Besuchen Sie unsere Website für weitere Informationen.",null,"Nur auf Anfrage!"]
[{"$f":"cal!$AK$7&\" \"&$V$16&\" \"&ROUND(cal!BK31,1)&IF(cal!$Z$5=1,\" cm, \",IF(cal!$Z$5=2,\" in, \"))&$V$17&\" \"&ROUND(cal!BL31,1)&IF(cal!$Z$5=1,\" cm, \",IF(cal!$Z$5=2,\" in, \"))&$V$18&\" \"&ROUND(cal!BM31,1)&IF(cal!$Z$5=1,\" cm \",IF(cal!$Z$5=2,\" in \"))&$S23","v":"Briza 22 (230V) höhe 54,5 cm, breite 22 cm, länge 75 cm (Type 03)"},{"$nulls":11},{"$f":"$U$27","v":"Bestellcode:"},{"$nulls":5},"(Type 03)",{"$nulls":3},"Product nicht mit verkleidung erhältlich!"]
[{"$nulls":20},"Deckenmodell"]
[{"$nulls":20},"Wandmodell"]
[]
[{"$nulls":20},"Bestellcode:"]
[]
[]
[]
[{"$f":"cal!$AK$7&\" \"&$V$16&\" \"&ROUND(cal!BK39,1)&IF(cal!$Z$5=1,\" cm, \",IF(cal!$Z$5=2,\" in, \"))&$V$17&\" \"&ROUND(cal!BL39,1)&IF(cal!$Z$5=1,\" cm, \",IF(cal!$Z$5=2,\" in, \"))&$V$18&\" \"&ROUND(cal!BM39,1)&IF(cal!$Z$5=1,\" cm \",IF(cal!$Z$5=2,\" in \"))&$S31","v":"Briza 22 (230V) höhe 54,5 cm, breite 22 cm, länge 95 cm (Type 04)"},{"$nulls":11},{"$f":"$U$27","v":"Bestellcode:"},{"$nulls":5},"(Type 04)"]
{"$rows_empty":7}
[{"$f":"cal!$AK$7&\" \"&$V$16&\" \"&ROUND(cal!BK47,1)&IF(cal!$Z$5=1,\" cm, \",IF(cal!$Z$5=2,\" in, \"))&$V$17&\" \"&ROUND(cal!BL47,1)&IF(cal!$Z$5=1,\" cm, \",IF(cal!$Z$5=2,\" in, \"))&$V$18&\" \"&ROUND(cal!BM47,1)&IF(cal!$Z$5=1,\" cm \",IF(cal!$Z$5=2,\" in \"))&$S39","v":"Briza 22 (230V) höhe 54,5 cm, breite 22 cm, länge 125 cm (Type 06)"},{"$nulls":11},{"$f":"$U$27","v":"Bestellcode:"},{"$nulls":5},"(Type 06)"]
{"$rows_empty":7}
[{"$f":"cal!$AK$7&\" \"&$V$16&\" \"&ROUND(cal!BK55,1)&IF(cal!$Z$5=1,\" cm, \",IF(cal!$Z$5=2,\" in, \"))&$V$17&\" \"&ROUND(cal!BL55,1)&IF(cal!$Z$5=1,\" cm, \",IF(cal!$Z$5=2,\" in, \"))&$V$18&\" \"&ROUND(cal!BM55,1)&IF(cal!$Z$5=1,\" cm \",IF(cal!$Z$5=2,\" in \"))&$S47","v":"Briza 22 (230V) höhe 54,5 cm, breite 22 cm, länge 155 cm (Type 08)"},{"$nulls":11},{"$f":"$U$27","v":"Bestellcode:"},{"$nulls":5},"(Type 08)"]
{"$rows_empty":7}
[{"$f":"cal!$AK$7&\" \"&$V$16&\" \"&ROUND(cal!BK63,1)&IF(cal!$Z$5=1,\" cm, \",IF(cal!$Z$5=2,\" in, \"))&$V$17&\" \"&ROUND(cal!BL63,1)&IF(cal!$Z$5=1,\" cm, \",IF(cal!$Z$5=2,\" in, \"))&$V$18&\" \"&ROUND(cal!BM63,1)&IF(cal!$Z$5=1,\" cm \",IF(cal!$Z$5=2,\" in \"))&$S55","v":"Briza 22 (230V) höhe 54,5 cm, breite 22 cm, länge 190 cm (Type 10)"},{"$nulls":11},{"$f":"$U$27","v":"Bestellcode:"},{"$nulls":5},"(Type 10)"]
{"$rows_empty":7}
["*Leistungsangaben nach EN 1397 mit einem G2-filter.",{"$nulls":15},{"$f":"cal!Q63","v":0}]
["**Schallleistungspegel nach ISO 3741:2010"]
["***Schalldruckpegel bei angenommener Raumdämpfung von 8dB(A)"]
["****Berechnete relative Luftfeuchtigkeit unmittelbar nach dem Wärmetauscher, angenommen mit einer ortsunabhängigen Oberflächentemperatur."]

{"sheet":"FR","index":5,"n_rows":66,"n_cols":23,"rows_kept":66,"hidden":true,"merged":[[2,6,2,9],[3,6,3,9],[5,11,5,12],[6,11,6,12],[6,16,6,17],[6,18,6,19],[7,0,7,2],[7,5,7,8],[7,16,9,17],[8,0,8,2],[8,5,8,8],[8,11,8,12],[9,0,9,2],[9,5,9,8],[9,11,9,12],[14,0,14,11],[14,12,14,16],[22,0,22,11],[22,12,22,16],[30,0,30,11],[30,12,30,16],[38,0,38,11],[38,12,38,16],[46,0,46,11],[46,12,46,16],[54,0,54,11],[54,12,54,16]]}
[]
["Formulaire"]
[{"$nulls":6},"Mélange hydonique:"]
["Conditions",{"$nulls":5},"Appareil - Ventilateur - Version:",0,0,0]
[]
["Températures",{"$nulls":10},"Pression statique"]
["Chauffer:",{"$nulls":4},"Refroidir:",{"$nulls":10},"Système unitaire",null,"Variables connues"]
[{"$f":"\"Entrée de l'eau\"","v":"Entrée de l'eau"},null,null,{"$f":"cal!E10","v":65},{"$f":"IF(cal!$Z$5=1,\"°C\",IF(cal!$Z$5=2,\"°F\"))","v":"°C"},{"$f":"A8","v":"Entrée de l'eau"},{"$nulls":3},{"$f":"cal!K10","v":16},{"$f":"E8","v":"°C"}]
[{"$f":"\"Retour de l'eau\"","v":"Retour de l'eau"},null,null,{"$f":"cal!E11","v":55},{"$f":"E8","v":"°C"},{"$f":"A9","v":"Retour de l'eau"},{"$nulls":3},{"$f":"cal!K11","v":18},{"$f":"E8","v":"°C"},"Hauteur placée"]
[{"$f":"\"Ambiante (bulbe sec)\"","v":"Ambiante (bulbe sec)"},null,null,{"$f":"cal!E12","v":20},{"$f":"E8","v":"°C"},{"$f":"A10","v":"Ambiante (bulbe sec)"},{"$nulls":3},{"$f":"cal!K12","v":27},{"$f":"E8","v":"°C"},{"$nulls":9},"Débit souhaité"]
["Ambiante (bulbe hum.)",{"$nulls":4},"Humidité relative",{"$nulls":3},{"$f":"cal!K14","v":{"v":0.5,"d":"50%"}},{"$nulls":10},"Pour calculer sur"]
[]
[]
["Niveau de vitesse","Voltage [V]",{"$f":"CONCATENATE(\"Puissance de cha. * \",ROUND(D8,0),\"/\",ROUND(D9,0),\"/\",ROUND(D10,0),\" [\"&IF(cal!$Z$5=1,\"W\",IF(cal!$Z$5=2,\"Btu/h\"))&\"]\")","v":"Puissance de cha. * 65/55/20 [W]"},{"$f":"\"Débit d'eau, chauffer [\"&IF(cal!$Z$5=1,\"l/h\",IF(cal!$Z$5=2,\"GPM\"))&\"]\"","v":"Débit d'eau, chauffer [l/h]"},{"$f":"\"Perte de charge [\"&IF(cal!$Z$5=1,\"kPa\",IF(cal!$Z$5=2,\"ftH2O\"))&\"]\"","v":"Perte de charge [kPa]"},{"$f":"CONCATENATE(\"Puissance sens. de refr. * \",ROUND(J8,0),\"/\",ROUND(J9,0),\"/\",ROUND(J10,0),\" [\"&IF(cal!$Z$5=1,\"W\",IF(cal!$Z$5=2,\"Btu/h\"))&\"]\")","v":"Puissance sens. de refr. * 16/18/27 [W]"},{"$f":"CONCATENATE(\"Puissance tot. de refr. \",ROUND(J8,0),\"/\",ROUND(J9,0),\"/\",ROUND(J10,0),\" [\"&IF(cal!$Z$5=1,\"W\",IF(cal!$Z$5=2,\"Btu/h\"))&\"]\")","v":"Puissance tot. de refr. 16/18/27 [W]"},{"$f":"\"Débit d'eau, refroidir [\"&IF(cal!$Z$5=1,\"l/h\",IF(cal!$Z$5=2,\"GPM\"))&\"]\"","v":"Débit d'eau, refroidir [l/h]"},{"$f":"E14","v":"Perte de charge [kPa]"},"Pression sonore *** [dB(A)]","Puissance sonore ** [dB(A)]","Puissance absorbée [W]",{"$f":"\"Débit d'air [\"&IF(cal!$Z$5=1,\"m³/h\",IF(cal!$Z$5=2,\"CFM\"))&\"]\"","v":"Débit d'air [m³/h]"},{"$f":"\"Vitesse d'air [\"&IF(cal!$Z$5=1,\"m/s\",IF(cal!$Z$5=2,\"ft/min\"))&\"]\"","v":"Vitesse d'air [m/s]"},{"$f":"\"Temp. de la sortie d'air cha. [\"&IF(cal!$Z$5=1,\"°C\",IF(cal!$Z$5=2,\"°F\"))&\"]\"","v":"Temp. de la sortie d'air cha. [°C]"},{"$f":"\"Temp. de la sortie d'air cha. (temp. humide) [\"&IF(cal!$Z$5=1,\"°C\",IF(cal!$Z$5=2,\"°F\"))&\"]\"","v":"Temp. de la sortie d'air cha. (temp. humide) [°C]"},{"$f":"\"Temp. de la sortie d'air refr. (l'ampoule sèche) [\"&IF(cal!$Z$5=1,\"°C\",IF(cal!$Z$5=2,\"°F\"))&\"]\"","v":"Temp. de la sortie d'air refr. (l'ampoule sèche) [°C]"},{"$f":"\"Temp. de la sortie d'air refr. (temp. humide) [\"&IF(cal!$Z$5=1,\"°C\",IF(cal!$Z$5=2,\"°F\"))&\"]\"","v":"Temp. de la sortie d'air refr. (temp. humide) [°C]"},"Hum. rel. air refroidi [%]","fréquence de rotation du ventilateur [rotations/minute]","Puissance de ventilateur spécifique"]
[{"$f":"cal!$AK$7&\" \"&$V$16&\" \"&ROUND(cal!BK23,1)&IF(cal!$Z$5=1,\" cm, \",IF(cal!$Z$5=2,\" in, \"))&$V$17&\" \"&ROUND(cal!BL23,1)&IF(cal!$Z$5=1,\" cm, \",IF(cal!$Z$5=2,\" in, \"))&$V$18&\" \"&ROUND(cal!BM23,1)&IF(cal!$Z$5=1,\" cm \",IF(cal!$Z$5=2,\" in \"))&$S15","v":"Briza 22 (230V) hauteur 54,5 cm, largeur 22 cm, longueur 55 cm (Type 02)"},{"$nulls":11},{"$f":"$U$27","v":"Code de commande:"},{"$nulls":5},"(Type 02)"]
[{"$nulls":20},"Δp haut!","hauteur","Copier toutes des données"]
[{"$nulls":20},"Temp.","largeur","Unités-SI"]
[{"$nulls":20},"chauf.!","longueur","Unités-Impériales"]
[{"$nulls":20},"refr!",null,"T,bh & RH"]
[{"$nulls":22},"T,bs & RH"]
[{"$nulls":22},"T,bs & T,bh"]
[{"$nulls":20},"Briza a de multiples variations d'admission et d'échappement. Visitez notre site web pour plus d'informations.",null,"Uniquement sur demande!"]
[{"$f":"cal!$AK$7&\" \"&$V$16&\" \"&ROUND(cal!BK31,1)&IF(cal!$Z$5=1,\" cm, \",IF(cal!$Z$5=2,\" in, \"))&$V$17&\" \"&ROUND(cal!BL31,1)&IF(cal!$Z$5=1,\" cm, \",IF(cal!$Z$5=2,\" in, \"))&$V$18&\" \"&ROUND(cal!BM31,1)&IF(cal!$Z$5=1,\" cm \",IF(cal!$Z$5=2,\" in \"))&$S23","v":"Briza 22 (230V) hauteur 54,5 cm, largeur 22 cm, longueur 75 cm (Type 03)"},{"$nulls":11},{"$f":"$U$27","v":"Code de commande:"},{"$nulls":5},"(Type 03)",{"$nulls":3},"Produit non disponible avec caisson!"]
[{"$nulls":20},"Modèle de plafond"]
[{"$nulls":20},"Modèle mural"]
[]
[{"$nulls":20},"Code de commande:"]
[]
[]
[]
[{"$f":"cal!$AK$7&\" \"&$V$16&\" \"&ROUND(cal!BK39,1)&IF(cal!$Z$5=1,\" cm, \",IF(cal!$Z$5=2,\" in, \"))&$V$17&\" \"&ROUND(cal!BL39,1)&IF(cal!$Z$5=1,\" cm, \",IF(cal!$Z$5=2,\" in, \"))&$V$18&\" \"&ROUND(cal!BM39,1)&IF(cal!$Z$5=1,\" cm \",IF(cal!$Z$5=2,\" in \"))&$S31","v":"Briza 22 (230V) hauteur 54,5 cm, largeur 22 cm, longueur 95 cm (Type 04)"},{"$nulls":11},{"$f":"$U$27","v":"Code de commande:"},{"$nulls":5},"(Type 04)"]
{"$rows_empty":7}
[{"$f":"cal!$AK$7&\" \"&$V$16&\" \"&ROUND(cal!BK47,1)&IF(cal!$Z$5=1,\" cm, \",IF(cal!$Z$5=2,\" in, \"))&$V$17&\" \"&ROUND(cal!BL47,1)&IF(cal!$Z$5=1,\" cm, \",IF(cal!$Z$5=2,\" in, \"))&$V$18&\" \"&ROUND(cal!BM47,1)&IF(cal!$Z$5=1,\" cm \",IF(cal!$Z$5=2,\" in \"))&$S39","v":"Briza 22 (230V) hauteur 54,5 cm, largeur 22 cm, longueur 125 cm (Type 06)"},{"$nulls":11},{"$f":"$U$27","v":"Code de commande:"},{"$nulls":5},"(Type 06)"]
{"$rows_empty":7}
[{"$f":"cal!$AK$7&\" \"&$V$16&\" \"&ROUND(cal!BK55,1)&IF(cal!$Z$5=1,\" cm, \",IF(cal!$Z$5=2,\" in, \"))&$V$17&\" \"&ROUND(cal!BL55,1)&IF(cal!$Z$5=1,\" cm, \",IF(cal!$Z$5=2,\" in, \"))&$V$18&\" \"&ROUND(cal!BM55,1)&IF(cal!$Z$5=1,\" cm \",IF(cal!$Z$5=2,\" in \"))&$S47","v":"Briza 22 (230V) hauteur 54,5 cm, largeur 22 cm, longueur 155 cm (Type 08)"},{"$nulls":11},{"$f":"$U$27","v":"Code de commande:"},{"$nulls":5},"(Type 08)"]
{"$rows_empty":7}
[{"$f":"cal!$AK$7&\" \"&$V$16&\" \"&ROUND(cal!BK63,1)&IF(cal!$Z$5=1,\" cm, \",IF(cal!$Z$5=2,\" in, \"))&$V$17&\" \"&ROUND(cal!BL63,1)&IF(cal!$Z$5=1,\" cm, \",IF(cal!$Z$5=2,\" in, \"))&$V$18&\" \"&ROUND(cal!BM63,1)&IF(cal!$Z$5=1,\" cm \",IF(cal!$Z$5=2,\" in \"))&$S55","v":"Briza 22 (230V) hauteur 54,5 cm, largeur 22 cm, longueur 190 cm (Type 10)"},{"$nulls":11},{"$f":"$U$27","v":"Code de commande:"},{"$nulls":5},"(Type 10)"]
{"$rows_empty":7}
["*Testé selon EN 1397 avec un filtre G2.",{"$nulls":15},{"$f":"cal!Q63","v":0}]
["**Puissance sonore testé selon ISO 3741:2010"]
["***Pression sonore avec une atténuation ambiante du 8dB(A)"]
["****HR calculée immédiatement après l'échangeur de chaleur, supposée avec une température de surface indépendante de l'emplacement."]

{"sheet":"NR","index":6,"n_rows":66,"n_cols":23,"rows_kept":66,"hidden":true,"merged":[[2,6,2,9],[3,6,3,9],[5,11,5,12],[6,11,6,12],[6,16,6,17],[6,18,6,19],[7,0,7,2],[7,5,7,8],[7,16,9,17],[8,0,8,2],[8,5,8,8],[8,11,8,12],[9,0,9,2],[9,5,9,8],[9,11,9,12],[10,5,10,8],[14,0,14,11],[14,12,14,16],[22,0,22,11],[22,12,22,16],[30,0,30,11],[30,12,30,16],[38,0,38,11],[38,12,38,16],[46,0,46,11],[46,12,46,16],[54,0,54,11],[54,12,54,16]]}
[]
["Modell"]
[{"$nulls":6},"Hydronisk blanding:",0,0,0]
[{"$nulls":6},"Modell:",0,0,0]
[]
["Temperaturer",{"$nulls":10},"Statisk trykkfall"]
["Varme:",{"$nulls":4},"Kjøling:",{"$nulls":10},"Enhetssystem",null,"Kjente variabler"]
["Tur vann",0,0,{"$f":"cal!E10","v":65},{"$f":"IF(cal!$Z$5=1,\"°C\",IF(cal!$Z$5=2,\"°F\"))","v":"°C"},{"$f":"A8","v":"Tur vann"},{"$nulls":3},{"$f":"cal!K10","v":16},{"$f":"E8","v":"°C"}]
["Retur vann",0,0,{"$f":"cal!E11","v":55},{"$f":"E8","v":"°C"},{"$f":"A9","v":"Retur vann"},{"$nulls":3},{"$f":"cal!K11","v":18},{"$f":"E8","v":"°C"},"Plassert høyde"]
["Rom (tørr pære)",0,0,{"$f":"cal!E12","v":20},{"$f":"E8","v":"°C"},{"$f":"A10","v":"Rom (tørr pære)"},{"$nulls":3},{"$f":"cal!K12","v":27},{"$f":"E8","v":"°C"},{"$nulls":9},"Ønsket strømningshastighet"]
["Rom (våtpære)",{"$nulls":4},"Relativ fuktighet",{"$nulls":3},{"$f":"cal!K14","v":{"v":0.5,"d":"50%"}},{"$nulls":10},"Å beregne på"]
[]
[]
["Hastighet","Styresignal [V]",{"$f":"CONCATENATE(\"Varme effekt * \",ROUND(D8,0),\"/\",ROUND(D9,0),\"/\",ROUND(D10,0),\" [\"&IF(cal!$Z$5=1,\"W\",IF(cal!$Z$5=2,\"Btu/h\"))&\"]\")","v":"Varme effekt * 65/55/20 [W]"},{"$f":"\"Vannmengde, varme [\"&IF(cal!$Z$5=1,\"l/h\",IF(cal!$Z$5=2,\"GPM\"))&\"]\"","v":"Vannmengde, varme [l/h]"},{"$f":"\"Trykktap [\"&IF(cal!$Z$5=1,\"kPa\",IF(cal!$Z$5=2,\"ftH2O\"))&\"]\"","v":"Trykktap [kPa]"},{"$f":"CONCATENATE(\"Sens. Kjøling effekt * \",ROUND(J8,0),\"/\",ROUND(J9,0),\"/\",ROUND(J10,0),\" [\"&IF(cal!$Z$5=1,\"W\",IF(cal!$Z$5=2,\"Btu/h\"))&\"]\")","v":"Sens. Kjøling effekt * 16/18/27 [W]"},{"$f":"CONCATENATE(\"Tot. Kjøle effekt * \",ROUND(J8,0),\"/\",ROUND(J9,0),\"/\",ROUND(J10,0),\" [\"&IF(cal!$Z$5=1,\"W\",IF(cal!$Z$5=2,\"Btu/h\"))&\"]\")","v":"Tot. Kjøle effekt * 16/18/27 [W]"},{"$f":"\"Vannmengde, kjøling [\"&IF(cal!$Z$5=1,\"l/h\",IF(cal!$Z$5=2,\"GPM\"))&\"]\"","v":"Vannmengde, kjøling [l/h]"},{"$f":"E14","v":"Trykktap [kPa]"},"Lydtrykk *** [dB(A)]","Lydeffekt ** [dB(A)]","Elektrisk effekt [W]",{"$f":"\"Luftmengde [\"&IF(cal!$Z$5=1,\"m³/h\",IF(cal!$Z$5=2,\"CFM\"))&\"]\"","v":"Luftmengde [m³/h]"},{"$f":"\"Flyhastighet [\"&IF(cal!$Z$5=1,\"m/s\",IF(cal!$Z$5=2,\"ft/min\"))&\"]\"","v":"Flyhastighet [m/s]"},{"$f":"\"Utluft temperatur, Varme [\"&IF(cal!$Z$5=1,\"°C\",IF(cal!$Z$5=2,\"°F\"))&\"]\"","v":"Utluft temperatur, Varme [°C]"},{"$f":"\"Utluft temperatur, (våte pære) Varme [\"&IF(cal!$Z$5=1,\"°C\",IF(cal!$Z$5=2,\"°F\"))&\"]\"","v":"Utluft temperatur, (våte pære) Varme [°C]"},{"$f":"\"Utluft temperatur, (tørr pære) Kjøling [\"&IF(cal!$Z$5=1,\"°C\",IF(cal!$Z$5=2,\"°F\"))&\"]\"","v":"Utluft temperatur, (tørr pære) Kjøling [°C]"},{"$f":"\"Utluft temperatur, (våte pære) Kjøling [\"&IF(cal!$Z$5=1,\"°C\",IF(cal!$Z$5=2,\"°F\"))&\"]\"","v":"Utluft temperatur, (våte pære) Kjøling [°C]"},"Rel. fuktighet avkjølt luft [%]","vifte rotasjonsfrekvens [rotasjoner/minutt]","Spesifikk viftekraft"]
[{"$f":"cal!$AK$7&\" \"&$V$16&\" \"&ROUND(cal!BK23,1)&IF(cal!$Z$5=1,\" cm, \",IF(cal!$Z$5=2,\" in, \"))&$V$17&\" \"&ROUND(cal!BL23,1)&IF(cal!$Z$5=1,\" cm, \",IF(cal!$Z$5=2,\" in, \"))&$V$18&\" \"&ROUND(cal!BM23,1)&IF(cal!$Z$5=1,\" cm \",IF(cal!$Z$5=2,\" in \"))&$S15","v":"Briza 22 (230V) høyde 54,5 cm, bredde 22 cm, lengde 55 cm (Type 02)"},{"$nulls":11},{"$f":"$U$27","v":"Ordrekode:"},{"$nulls":5},"(Type 02)"]
[{"$nulls":20},"Δp høyt!","høyde","Kopier alle data"]
[{"$nulls":20},"Temp.","bredde","SI-enheter"]
[{"$nulls":20},"varme!","lengde","Imperiale-enheter"]
[{"$nulls":20},"kjøling!",null,"T,vp & RF"]
[{"$nulls":22},"T,tp & RF"]
[{"$nulls":22},"T,tp & T,vp"]
[{"$nulls":20},"Briza har flere luftmengdeinntak og eksosvariasjoner. Besøk vår hjemmeside for mer informasjon.",null,"Bare på forespørsel!"]
[{"$f":"cal!$AK$7&\" \"&$V$16&\" \"&ROUND(cal!BK31,1)&IF(cal!$Z$5=1,\" cm, \",IF(cal!$Z$5=2,\" in, \"))&$V$17&\" \"&ROUND(cal!BL31,1)&IF(cal!$Z$5=1,\" cm, \",IF(cal!$Z$5=2,\" in, \"))&$V$18&\" \"&ROUND(cal!BM31,1)&IF(cal!$Z$5=1,\" cm \",IF(cal!$Z$5=2,\" in \"))&$S23","v":"Briza 22 (230V) høyde 54,5 cm, bredde 22 cm, lengde 75 cm (Type 03)"},{"$nulls":11},{"$f":"$U$27","v":"Ordrekode:"},{"$nulls":5},"(Type 03)",{"$nulls":3},"Produktet er ikke tilgjengelig med hus!"]
[{"$nulls":20},"Takmodell"]
[{"$nulls":20},"Veggmodell"]
[]
[{"$nulls":20},"Ordrekode:"]
[]
[]
[]
[{"$f":"cal!$AK$7&\" \"&$V$16&\" \"&ROUND(cal!BK39,1)&IF(cal!$Z$5=1,\" cm, \",IF(cal!$Z$5=2,\" in, \"))&$V$17&\" \"&ROUND(cal!BL39,1)&IF(cal!$Z$5=1,\" cm, \",IF(cal!$Z$5=2,\" in, \"))&$V$18&\" \"&ROUND(cal!BM39,1)&IF(cal!$Z$5=1,\" cm \",IF(cal!$Z$5=2,\" in \"))&$S31","v":"Briza 22 (230V) høyde 54,5 cm, bredde 22 cm, lengde 95 cm (Type 04)"},{"$nulls":11},{"$f":"$U$27","v":"Ordrekode:"},{"$nulls":5},"(Type 04)"]
{"$rows_empty":7}
[{"$f":"cal!$AK$7&\" \"&$V$16&\" \"&ROUND(cal!BK47,1)&IF(cal!$Z$5=1,\" cm, \",IF(cal!$Z$5=2,\" in, \"))&$V$17&\" \"&ROUND(cal!BL47,1)&IF(cal!$Z$5=1,\" cm, \",IF(cal!$Z$5=2,\" in, \"))&$V$18&\" \"&ROUND(cal!BM47,1)&IF(cal!$Z$5=1,\" cm \",IF(cal!$Z$5=2,\" in \"))&$S39","v":"Briza 22 (230V) høyde 54,5 cm, bredde 22 cm, lengde 125 cm (Type 06)"},{"$nulls":11},{"$f":"$U$27","v":"Ordrekode:"},{"$nulls":5},"(Type 06)"]
{"$rows_empty":7}
[{"$f":"cal!$AK$7&\" \"&$V$16&\" \"&ROUND(cal!BK55,1)&IF(cal!$Z$5=1,\" cm, \",IF(cal!$Z$5=2,\" in, \"))&$V$17&\" \"&ROUND(cal!BL55,1)&IF(cal!$Z$5=1,\" cm, \",IF(cal!$Z$5=2,\" in, \"))&$V$18&\" \"&ROUND(cal!BM55,1)&IF(cal!$Z$5=1,\" cm \",IF(cal!$Z$5=2,\" in \"))&$S47","v":"Briza 22 (230V) høyde 54,5 cm, bredde 22 cm, lengde 155 cm (Type 08)"},{"$nulls":11},{"$f":"$U$27","v":"Ordrekode:"},{"$nulls":5},"(Type 08)"]
{"$rows_empty":7}
[{"$f":"cal!$AK$7&\" \"&$V$16&\" \"&ROUND(cal!BK63,1)&IF(cal!$Z$5=1,\" cm, \",IF(cal!$Z$5=2,\" in, \"))&$V$17&\" \"&ROUND(cal!BL63,1)&IF(cal!$Z$5=1,\" cm, \",IF(cal!$Z$5=2,\" in, \"))&$V$18&\" \"&ROUND(cal!BM63,1)&IF(cal!$Z$5=1,\" cm \",IF(cal!$Z$5=2,\" in \"))&$S55","v":"Briza 22 (230V) høyde 54,5 cm, bredde 22 cm, lengde 190 cm (Type 10)"},{"$nulls":11},{"$f":"$U$27","v":"Ordrekode:"},{"$nulls":5},"(Type 10)"]
{"$rows_empty":7}
["*Values according to EN 1397 met et G2-filter.",{"$nulls":15},{"$f":"cal!Q63","v":0}]
["**Sound power according to ISO 3741:2010"]
["***Sound pressure with an assumed room damping of 8dB(A)"]
["****Beregnet RH umiddelbart etter varmeveksleren, antatt med en stedsuavhengig overflatetemperatur."]

{"sheet":"SP","index":7,"n_rows":66,"n_cols":23,"rows_kept":66,"hidden":true,"merged":[[2,6,2,9],[3,6,3,9],[5,11,5,12],[6,11,6,12],[6,16,6,17],[6,18,6,19],[7,0,7,2],[7,5,7,8],[7,16,9,17],[8,0,8,2],[8,5,8,8],[8,11,8,12],[9,0,9,2],[9,5,9,8],[9,11,9,12],[10,5,10,8],[14,0,14,11],[14,12,14,16],[22,0,22,11],[22,12,22,16],[30,0,30,11],[30,12,30,16],[38,0,38,11],[38,12,38,16],[46,0,46,11],[46,12,46,16],[54,0,54,11],[54,12,54,16]]}
[]
["Model"]
[{"$nulls":6},"Mezcla de agua:","Hydronic mix:",0,0]
[{"$nulls":6},"Equipo - Ventilador - Montaje:","Device - Ventilator - Utilization:",0,0]
[]
["Temperaturas",{"$nulls":10},"Δp conductos"]
["Calefacción:",{"$nulls":4},"Enfriamiento:",{"$nulls":10},"Convers. de unidades",null,"Variables conocidas"]
["Agua impulsión",0,0,{"$f":"cal!E10","v":65},{"$f":"IF(cal!$Z$5=1,\"°C\",IF(cal!$Z$5=2,\"°F\"))","v":"°C"},{"$f":"A8","v":"Agua impulsión"},{"$nulls":3},{"$f":"cal!K10","v":16},{"$f":"E8","v":"°C"}]
["Agua retorno",0,0,{"$f":"cal!E11","v":55},{"$f":"E8","v":"°C"},{"$f":"A9","v":"Agua retorno"},{"$nulls":3},{"$f":"cal!K11","v":18},{"$f":"E8","v":"°C"},"Altitud"]
["Ambiente (bulbo seco)",0,0,{"$f":"cal!E12","v":20},{"$f":"E8","v":"°C"},{"$f":"A10","v":"Ambiente (bulbo seco)"},{"$nulls":3},{"$f":"cal!K12","v":27},{"$f":"E8","v":"°C"},{"$nulls":9},"Caudal deseado"]
["Ambiente (bulbo hum.)",{"$nulls":4},"Humedad relativa",{"$nulls":3},{"$f":"cal!K14","v":{"v":0.5,"d":"50%"}},{"$nulls":10},"Para calcular en"]
[]
[]
["Nivel de velocidad"," Voltaje control [V]",{"$f":"CONCATENATE(\"Capacidad calefacción * \",ROUND(D8,0),\"/\",ROUND(D9,0),\"/\",ROUND(D10,0),\" [\"&IF(cal!$Z$5=1,\"W\",IF(cal!$Z$5=2,\"Btu/h\"))&\"]\")","v":"Capacidad calefacción * 65/55/20 [W]"},{"$f":"\"Caudal de agua, calefacción [\"&IF(cal!$Z$5=1,\"l/h\",IF(cal!$Z$5=2,\"GPM\"))&\"]\"","v":"Caudal de agua, calefacción [l/h]"},{"$f":"\"Pérdida de carga del agua [\"&IF(cal!$Z$5=1,\"kPa\",IF(cal!$Z$5=2,\"ftH2O\"))&\"]\"","v":"Pérdida de carga del agua [kPa]"},{"$f":"CONCATENATE(\"Capacidad sensible Frío * \",ROUND(J8,0),\"/\",ROUND(J9,0),\"/\",ROUND(J10,0),\" [\"&IF(cal!$Z$5=1,\"W\",IF(cal!$Z$5=2,\"Btu/h\"))&\"]\")","v":"Capacidad sensible Frío * 16/18/27 [W]"},{"$f":"CONCATENATE(\"Capacidad total Frío * \",ROUND(J8,0),\"/\",ROUND(J9,0),\"/\",ROUND(J10,0),\" [\"&IF(cal!$Z$5=1,\"W\",IF(cal!$Z$5=2,\"Btu/h\"))&\"]\")","v":"Capacidad total Frío * 16/18/27 [W]"},{"$f":"\"Caudal de agua, Frío [\"&IF(cal!$Z$5=1,\"l/h\",IF(cal!$Z$5=2,\"GPM\"))&\"]\"","v":"Caudal de agua, Frío [l/h]"},{"$f":"E14","v":"Pérdida de carga del agua [kPa]"},"Presión sonora *** [dB(A)]","Potencia sonora ** [dB(A)]","Potencia eléctrica absorbida [W]",{"$f":"\"Caudal de aire [\"&IF(cal!$Z$5=1,\"m³/h\",IF(cal!$Z$5=2,\"CFM\"))&\"]\"","v":"Caudal de aire [m³/h]"},{"$f":"\"Velocidad de aire [\"&IF(cal!$Z$5=1,\"m/s\",IF(cal!$Z$5=2,\"ft/min\"))&\"]\"","v":"Velocidad de aire [m/s]"},{"$f":"\"Temperatura salida de aire calefacción [\"&IF(cal!$Z$5=1,\"°C\",IF(cal!$Z$5=2,\"°F\"))&\"]\"","v":"Temperatura salida de aire calefacción [°C]"},{"$f":"\"Temperatura salida de aire calefacción (bulbo hum.) [\"&IF(cal!$Z$5=1,\"°C\",IF(cal!$Z$5=2,\"°F\"))&\"]\"","v":"Temperatura salida de aire calefacción (bulbo hum.) [°C]"},{"$f":"\"Temperatura salida de aire refrigeración (bulbo seco) [\"&IF(cal!$Z$5=1,\"°C\",IF(cal!$Z$5=2,\"°F\"))&\"]\"","v":"Temperatura salida de aire refrigeración (bulbo seco) [°C]"},{"$f":"\"Temperatura salida de aire refrigeración (bulbo hum.) [\"&IF(cal!$Z$5=1,\"°C\",IF(cal!$Z$5=2,\"°F\"))&\"]\"","v":"Temperatura salida de aire refrigeración (bulbo hum.) [°C]"},"Hum. relativa del aire enfriado [%]","frecuencia de rotación del ventilador [rotaciones/minuto]","Potencia de ventilador específica"]
[{"$f":"cal!$AK$7&\" \"&$V$16&\" \"&ROUND(cal!BK23,1)&IF(cal!$Z$5=1,\" cm, \",IF(cal!$Z$5=2,\" in, \"))&$V$17&\" \"&ROUND(cal!BL23,1)&IF(cal!$Z$5=1,\" cm, \",IF(cal!$Z$5=2,\" in, \"))&$V$18&\" \"&ROUND(cal!BM23,1)&IF(cal!$Z$5=1,\" cm \",IF(cal!$Z$5=2,\" in \"))&$S15","v":"Briza 22 (230V) altura 54,5 cm, ancho 22 cm, longitud 55 cm (Type 02)"},{"$nulls":11},{"$f":"$U$27","v":"Código de orden:"},{"$nulls":5},"(Type 02)"]
[{"$nulls":20},"Δp Muy Alto!","altura","Copiar todos los datos"]
[{"$nulls":20},"Temp.","ancho","Unidades-SI"]
[{"$nulls":20},"calefac.","longitud","Unidades-Imperial"]
[{"$nulls":20},"enfria.",null,"T,bh & RH"]
[{"$nulls":22},"T,bs & RH"]
[{"$nulls":22},"T,bs & T,bh"]
[{"$nulls":20},"Briza tiene múltiples opciones de entrada y salida de aire. Visita nuestro sitio web para más información.",null,"Solo bajo pedido!"]
[{"$f":"cal!$AK$7&\" \"&$V$16&\" \"&ROUND(cal!BK31,1)&IF(cal!$Z$5=1,\" cm, \",IF(cal!$Z$5=2,\" in, \"))&$V$17&\" \"&ROUND(cal!BL31,1)&IF(cal!$Z$5=1,\" cm, \",IF(cal!$Z$5=2,\" in, \"))&$V$18&\" \"&ROUND(cal!BM31,1)&IF(cal!$Z$5=1,\" cm \",IF(cal!$Z$5=2,\" in \"))&$S23","v":"Briza 22 (230V) altura 54,5 cm, ancho 22 cm, longitud 75 cm (Type 03)"},{"$nulls":11},{"$f":"$U$27","v":"Código de orden:"},{"$nulls":5},"(Type 03)",{"$nulls":3},"Producto no disponible con carcasa!"]
[{"$nulls":20},"Modelo de techo"]
[{"$nulls":20},"Modelo de pared"]
[]
[{"$nulls":20},"Código de orden:"]
[]
[]
[]
[{"$f":"cal!$AK$7&\" \"&$V$16&\" \"&ROUND(cal!BK39,1)&IF(cal!$Z$5=1,\" cm, \",IF(cal!$Z$5=2,\" in, \"))&$V$17&\" \"&ROUND(cal!BL39,1)&IF(cal!$Z$5=1,\" cm, \",IF(cal!$Z$5=2,\" in, \"))&$V$18&\" \"&ROUND(cal!BM39,1)&IF(cal!$Z$5=1,\" cm \",IF(cal!$Z$5=2,\" in \"))&$S31","v":"Briza 22 (230V) altura 54,5 cm, ancho 22 cm, longitud 95 cm (Type 04)"},{"$nulls":11},{"$f":"$U$27","v":"Código de orden:"},{"$nulls":5},"(Type 04)"]
{"$rows_empty":7}
[{"$f":"cal!$AK$7&\" \"&$V$16&\" \"&ROUND(cal!BK47,1)&IF(cal!$Z$5=1,\" cm, \",IF(cal!$Z$5=2,\" in, \"))&$V$17&\" \"&ROUND(cal!BL47,1)&IF(cal!$Z$5=1,\" cm, \",IF(cal!$Z$5=2,\" in, \"))&$V$18&\" \"&ROUND(cal!BM47,1)&IF(cal!$Z$5=1,\" cm \",IF(cal!$Z$5=2,\" in \"))&$S39","v":"Briza 22 (230V) altura 54,5 cm, ancho 22 cm, longitud 125 cm (Type 06)"},{"$nulls":11},{"$f":"$U$27","v":"Código de orden:"},{"$nulls":5},"(Type 06)"]
{"$rows_empty":7}
[{"$f":"cal!$AK$7&\" \"&$V$16&\" \"&ROUND(cal!BK55,1)&IF(cal!$Z$5=1,\" cm, \",IF(cal!$Z$5=2,\" in, \"))&$V$17&\" \"&ROUND(cal!BL55,1)&IF(cal!$Z$5=1,\" cm, \",IF(cal!$Z$5=2,\" in, \"))&$V$18&\" \"&ROUND(cal!BM55,1)&IF(cal!$Z$5=1,\" cm \",IF(cal!$Z$5=2,\" in \"))&$S47","v":"Briza 22 (230V) altura 54,5 cm, ancho 22 cm, longitud 155 cm (Type 08)"},{"$nulls":11},{"$f":"$U$27","v":"Código de orden:"},{"$nulls":5},"(Type 08)"]
{"$rows_empty":7}
[{"$f":"cal!$AK$7&\" \"&$V$16&\" \"&ROUND(cal!BK63,1)&IF(cal!$Z$5=1,\" cm, \",IF(cal!$Z$5=2,\" in, \"))&$V$17&\" \"&ROUND(cal!BL63,1)&IF(cal!$Z$5=1,\" cm, \",IF(cal!$Z$5=2,\" in, \"))&$V$18&\" \"&ROUND(cal!BM63,1)&IF(cal!$Z$5=1,\" cm \",IF(cal!$Z$5=2,\" in \"))&$S55","v":"Briza 22 (230V) altura 54,5 cm, ancho 22 cm, longitud 190 cm (Type 10)"},{"$nulls":11},{"$f":"$U$27","v":"Código de orden:"},{"$nulls":5},"(Type 10)"]
{"$rows_empty":7}
["*Valores de acuerdo a EN 1397 con un filtro G2.",{"$nulls":15},{"$f":"cal!Q63","v":0}]
["**Potencia sonora de acuerdo a ISO 3741:2010"]
["***Presión sonora asumiendo una reducción de la estancia de  8dB(A)"]
["****HR calculada inmediatamente después del intercambiador de calor, asumido con una temperatura de superficie independiente de la ubicación."]

{"sheet":"SW","index":8,"n_rows":66,"n_cols":23,"rows_kept":66,"hidden":true,"merged":[[2,6,2,9],[3,6,3,9],[5,11,5,12],[6,11,6,12],[6,16,6,17],[6,18,6,19],[7,0,7,2],[7,5,7,8],[7,16,9,17],[8,0,8,2],[8,5,8,8],[8,11,8,12],[9,5,9,8],[9,11,9,12],[10,5,10,8],[14,0,14,11],[14,12,14,16],[22,0,22,11],[22,12,22,16],[30,0,30,11],[30,12,30,16],[38,0,38,11],[38,12,38,16],[46,0,46,11],[46,12,46,16],[54,0,54,11],[54,12,54,16]]}
[]
["Modell"]
[{"$nulls":6},"Vattenblandning:","Hydronic mix:",0,0]
[{"$nulls":6},"Utrustning - Fläkt - Montering:","Device - Ventilator - Utilization:",0,0]
[]
["Temperaturer",{"$nulls":10},"Δp kanaler"]
["Värme:",{"$nulls":4},"Kyla:",{"$nulls":10},"Enhetssystem",null,"Kända variabler"]
["Tillopp",null,null,{"$f":"cal!E10","v":65},{"$f":"IF(cal!$Z$5=1,\"°C\",IF(cal!$Z$5=2,\"°F\"))","v":"°C"},{"$f":"A8","v":"Tillopp"},{"$nulls":3},{"$f":"cal!K10","v":16},{"$f":"E8","v":"°C"}]
["Retur",null,null,{"$f":"cal!E11","v":55},{"$f":"E8","v":"°C"},{"$f":"A9","v":"Retur"},{"$nulls":3},{"$f":"cal!K11","v":18},{"$f":"E8","v":"°C"},"Höjd över havet"]
["Rum (torr)",null,null,{"$f":"cal!E12","v":20},{"$f":"E8","v":"°C"},{"$f":"A10","v":"Rum (torr)"},{"$nulls":3},{"$f":"cal!K12","v":27},{"$f":"E8","v":"°C"},{"$nulls":9},"Önskat flöde"]
["Rum (våt)",{"$nulls":4},"rel. Fuktighet",{"$nulls":3},{"$f":"cal!K14","v":{"v":0.5,"d":"50%"}},{"$nulls":10},"Para beräknar och"]
[]
[]
["Fläkthastighet","Spänning, Fläkt [V]",{"$f":"CONCATENATE(\"Värme effekt * \",ROUND(D8,0),\"/\",ROUND(D9,0),\"/\",ROUND(D10,0),\" [\"&IF(cal!$Z$5=1,\"W\",IF(cal!$Z$5=2,\"Btu/h\"))&\"]\")","v":"Värme effekt * 65/55/20 [W]"},{"$f":"\"Vattenflöde, värme [\"&IF(cal!$Z$5=1,\"l/h\",IF(cal!$Z$5=2,\"GPM\"))&\"]\"","v":"Vattenflöde, värme [l/h]"},{"$f":"\"Tryckfall, vatten [\"&IF(cal!$Z$5=1,\"kPa\",IF(cal!$Z$5=2,\"ftH2O\"))&\"]\"","v":"Tryckfall, vatten [kPa]"},{"$f":"CONCATENATE(\"Märkbar kylkapacitet * \",ROUND(J8,0),\"/\",ROUND(J9,0),\"/\",ROUND(J10,0),\" [\"&IF(cal!$Z$5=1,\"W\",IF(cal!$Z$5=2,\"Btu/h\"))&\"]\")","v":"Märkbar kylkapacitet * 16/18/27 [W]"},{"$f":"CONCATENATE(\"Total kylkapacitet * \",ROUND(J8,0),\"/\",ROUND(J9,0),\"/\",ROUND(J10,0),\" [\"&IF(cal!$Z$5=1,\"W\",IF(cal!$Z$5=2,\"Btu/h\"))&\"]\")","v":"Total kylkapacitet * 16/18/27 [W]"},{"$f":"\"Vattenflöde, kyla [\"&IF(cal!$Z$5=1,\"l/h\",IF(cal!$Z$5=2,\"GPM\"))&\"]\"","v":"Vattenflöde, kyla [l/h]"},{"$f":"E14","v":"Tryckfall, vatten [kPa]"},"Ljudtryck *** [dB(A)]","Ljudeffekt ** [dB(A)]","Effektförbrukning [W]",{"$f":"\"Luftflöde [\"&IF(cal!$Z$5=1,\"m³/h\",IF(cal!$Z$5=2,\"CFM\"))&\"]\"","v":"Luftflöde [m³/h]"},{"$f":"\"Luft hastighet [\"&IF(cal!$Z$5=1,\"m/s\",IF(cal!$Z$5=2,\"ft/min\"))&\"]\"","v":"Luft hastighet [m/s]"},{"$f":"\"Uppvärmningsluftens temp. [\"&IF(cal!$Z$5=1,\"°C\",IF(cal!$Z$5=2,\"°F\"))&\"]\"","v":"Uppvärmningsluftens temp. [°C]"},{"$f":"\"Värme luft utloppstemp. (hum. Lampa) [\"&IF(cal!$Z$5=1,\"°C\",IF(cal!$Z$5=2,\"°F\"))&\"]\"","v":"Värme luft utloppstemp. (hum. Lampa) [°C]"},{"$f":"\"Utloppstemp. för kylluft (torr lampa) [\"&IF(cal!$Z$5=1,\"°C\",IF(cal!$Z$5=2,\"°F\"))&\"]\"","v":"Utloppstemp. för kylluft (torr lampa) [°C]"},{"$f":"\"Kylluftens utloppstemp. (hum. Lampa) [\"&IF(cal!$Z$5=1,\"°C\",IF(cal!$Z$5=2,\"°F\"))&\"]\"","v":"Kylluftens utloppstemp. (hum. Lampa) [°C]"},"Relativ fuktighet för kyld luft [%]","fläktens rotationsfrekvens [rotationer/minut]","Specifik fläktkraft"]
[{"$f":"cal!$AK$7&\" \"&$V$16&\" \"&ROUND(cal!BK23,1)&IF(cal!$Z$5=1,\" cm, \",IF(cal!$Z$5=2,\" in, \"))&$V$17&\" \"&ROUND(cal!BL23,1)&IF(cal!$Z$5=1,\" cm, \",IF(cal!$Z$5=2,\" in, \"))&$V$18&\" \"&ROUND(cal!BM23,1)&IF(cal!$Z$5=1,\" cm \",IF(cal!$Z$5=2,\" in \"))&$S15","v":"Briza 22 (230V) höjd 54,5 cm, djup 22 cm, längd 55 cm (Typ 02)"},{"$nulls":11},{"$f":"$U$27","v":"Beställningskod:"},{"$nulls":5},"(Typ 02)"]
[{"$nulls":20},"Δp Väldigt högt!","höjd","Kopiera all data"]
[{"$nulls":20},"Temp.","djup","SI-enheter"]
[{"$nulls":20},"värme","längd","Imperiella-enheter"]
[{"$nulls":20},"kyla",null,"T,wb & RH"]
[{"$nulls":22},"T,db & RH"]
[{"$nulls":22},"T,db & T,wb"]
[{"$nulls":20},"Briza har flera alternativ för luftinlopp och utlopp. Besök vår hemsida för mer information.",null,"Endast på begäran!"]
[{"$f":"cal!$AK$7&\" \"&$V$16&\" \"&ROUND(cal!BK31,1)&IF(cal!$Z$5=1,\" cm, \",IF(cal!$Z$5=2,\" in, \"))&$V$17&\" \"&ROUND(cal!BL31,1)&IF(cal!$Z$5=1,\" cm, \",IF(cal!$Z$5=2,\" in, \"))&$V$18&\" \"&ROUND(cal!BM31,1)&IF(cal!$Z$5=1,\" cm \",IF(cal!$Z$5=2,\" in \"))&$S23","v":"Briza 22 (230V) höjd 54,5 cm, djup 22 cm, längd 75 cm (Typ 03)"},{"$nulls":11},{"$f":"$U$27","v":"Beställningskod:"},{"$nulls":5},"(Typ 03)",{"$nulls":3},"Produkten finns inte med höljet!"]
[{"$nulls":20},"Takmodell"]
[{"$nulls":20},"Väggmodell"]
[]
[{"$nulls":20},"Beställningskod:"]
[]
[]
[]
[{"$f":"cal!$AK$7&\" \"&$V$16&\" \"&ROUND(cal!BK39,1)&IF(cal!$Z$5=1,\" cm, \",IF(cal!$Z$5=2,\" in, \"))&$V$17&\" \"&ROUND(cal!BL39,1)&IF(cal!$Z$5=1,\" cm, \",IF(cal!$Z$5=2,\" in, \"))&$V$18&\" \"&ROUND(cal!BM39,1)&IF(cal!$Z$5=1,\" cm \",IF(cal!$Z$5=2,\" in \"))&$S31","v":"Briza 22 (230V) höjd 54,5 cm, djup 22 cm, längd 95 cm (Typ 04)"},{"$nulls":11},{"$f":"$U$27","v":"Beställningskod:"},{"$nulls":5},"(Typ 04)"]
{"$rows_empty":7}
[{"$f":"cal!$AK$7&\" \"&$V$16&\" \"&ROUND(cal!BK47,1)&IF(cal!$Z$5=1,\" cm, \",IF(cal!$Z$5=2,\" in, \"))&$V$17&\" \"&ROUND(cal!BL47,1)&IF(cal!$Z$5=1,\" cm, \",IF(cal!$Z$5=2,\" in, \"))&$V$18&\" \"&ROUND(cal!BM47,1)&IF(cal!$Z$5=1,\" cm \",IF(cal!$Z$5=2,\" in \"))&$S39","v":"Briza 22 (230V) höjd 54,5 cm, djup 22 cm, längd 125 cm (Typ 06)"},{"$nulls":11},{"$f":"$U$27","v":"Beställningskod:"},{"$nulls":5},"(Typ 06)"]
{"$rows_empty":7}
[{"$f":"cal!$AK$7&\" \"&$V$16&\" \"&ROUND(cal!BK55,1)&IF(cal!$Z$5=1,\" cm, \",IF(cal!$Z$5=2,\" in, \"))&$V$17&\" \"&ROUND(cal!BL55,1)&IF(cal!$Z$5=1,\" cm, \",IF(cal!$Z$5=2,\" in, \"))&$V$18&\" \"&ROUND(cal!BM55,1)&IF(cal!$Z$5=1,\" cm \",IF(cal!$Z$5=2,\" in \"))&$S47","v":"Briza 22 (230V) höjd 54,5 cm, djup 22 cm, längd 155 cm (Typ 08)"},{"$nulls":11},{"$f":"$U$27","v":"Beställningskod:"},{"$nulls":5},"(Typ 08)"]
{"$rows_empty":7}
[{"$f":"cal!$AK$7&\" \"&$V$16&\" \"&ROUND(cal!BK63,1)&IF(cal!$Z$5=1,\" cm, \",IF(cal!$Z$5=2,\" in, \"))&$V$17&\" \"&ROUND(cal!BL63,1)&IF(cal!$Z$5=1,\" cm, \",IF(cal!$Z$5=2,\" in, \"))&$V$18&\" \"&ROUND(cal!BM63,1)&IF(cal!$Z$5=1,\" cm \",IF(cal!$Z$5=2,\" in \"))&$S55","v":"Briza 22 (230V) höjd 54,5 cm, djup 22 cm, längd 190 cm (Typ 10)"},{"$nulls":11},{"$f":"$U$27","v":"Beställningskod:"},{"$nulls":5},"(Typ 10)"]
{"$rows_empty":7}
["*Värden enligt EN 1397 med ett G2-filter.",{"$nulls":15},{"$f":"cal!Q63","v":0}]
["**Ljudeffekt enligt ISO 3741: 2010"]
["***Ljudtryck med en antagen rumsdämpning på 8dB (A)"]
["****RH beräknas omedelbart efter värmeväxlaren, antas med en platsoberoende yttemperatur."]

{"sheet":"TS","index":9,"n_rows":66,"n_cols":23,"rows_kept":66,"hidden":true,"merged":[[2,6,2,9],[3,6,3,9],[5,11,5,12],[6,11,6,12],[6,16,6,17],[6,18,6,19],[7,0,7,2],[7,5,7,8],[7,16,9,17],[8,0,8,2],[8,5,8,8],[8,11,8,12],[9,0,9,2],[9,5,9,8],[9,11,9,12],[14,0,14,11],[14,12,14,16],[22,0,22,11],[22,12,22,16],[30,0,30,11],[30,12,30,16],[38,0,38,11],[38,12,38,16],[46,0,46,11],[46,12,46,16],[54,0,54,11],[54,12,54,16]]}
[]
["Formulary"]
[{"$nulls":6},"Směs vody:",0,0,0]
["Conditions",{"$nulls":5},"Těleso - Ventilátor - Verze:",0,0,0]
[]
["Teploty",{"$nulls":10},"Statický tlak"]
["Topení:",{"$nulls":4},"Chlazení:",{"$nulls":10},"Převod jednotek",null,"Známé proměnné"]
[{"$f":"\"Voda na přívodu\"","v":"Voda na přívodu"},null,null,{"$f":"cal!E10","v":65},{"$f":"IF(cal!$Z$5=1,\"°C\",IF(cal!$Z$5=2,\"°F\"))","v":"°C"},{"$f":"A8","v":"Voda na přívodu"},{"$nulls":3},{"$f":"cal!K10","v":16},{"$f":"E8","v":"°C"}]
[{"$f":"\"Voda na zpátečce\"","v":"Voda na zpátečce"},null,null,{"$f":"cal!E11","v":55},{"$f":"E8","v":"°C"},{"$f":"A9","v":"Voda na zpátečce"},{"$nulls":3},{"$f":"cal!K11","v":18},{"$f":"E8","v":"°C"},"Výška umístění"]
["\"Suchá\" teplota vzduchu",null,null,{"$f":"cal!E12","v":20},{"$f":"E8","v":"°C"},{"$f":"A10","v":"\"Suchá\" teplota vzduchu"},{"$nulls":3},{"$f":"cal!K12","v":27},{"$f":"E8","v":"°C"},{"$nulls":9},"Požadovaný průtok"]
["Teplota mokrého teploměru",{"$nulls":4},"Relativní vlhkost",{"$nulls":3},{"$f":"cal!K14","v":{"v":0.5,"d":"50%"}},{"$nulls":10},"Počítat dál"]
[]
[]
["Rychlost","Ovládací napětí [V]",{"$f":"CONCATENATE(\"Výkon Topení * \",ROUND(D8,0),\"/\",ROUND(D9,0),\"/\",ROUND(D10,0),\" [\"&IF(cal!$Z$5=1,\"W\",IF(cal!$Z$5=2,\"Btu/h\"))&\"]\")","v":"Výkon Topení * 65/55/20 [W]"},{"$f":"\"Průtok vody, topení [\"&IF(cal!$Z$5=1,\"l/h\",IF(cal!$Z$5=2,\"GPM\"))&\"]\"","v":"Průtok vody, topení [l/h]"},{"$f":"\"Tlaková ztráta [\"&IF(cal!$Z$5=1,\"kPa\",IF(cal!$Z$5=2,\"ftH2O\"))&\"]\"","v":"Tlaková ztráta [kPa]"},{"$f":"CONCATENATE(\"Výkon chlazení Znatelný * \",ROUND(J8,0),\"/\",ROUND(J9,0),\"/\",ROUND(J10,0),\" [\"&IF(cal!$Z$5=1,\"W\",IF(cal!$Z$5=2,\"Btu/h\"))&\"]\")","v":"Výkon chlazení Znatelný * 16/18/27 [W]"},{"$f":"CONCATENATE(\"Výkon chlazení Celkový \",ROUND(J8,0),\"/\",ROUND(J9,0),\"/\",ROUND(J10,0),\" [\"&IF(cal!$Z$5=1,\"W\",IF(cal!$Z$5=2,\"Btu/h\"))&\"]\")","v":"Výkon chlazení Celkový 16/18/27 [W]"},{"$f":"\"Průtok vody,chlazení [\"&IF(cal!$Z$5=1,\"l/h\",IF(cal!$Z$5=2,\"GPM\"))&\"]\"","v":"Průtok vody,chlazení [l/h]"},{"$f":"E14","v":"Tlaková ztráta [kPa]"},"Akustický tlak *** [dB(A)]","Akustický výkon ** [dB(A)]","Elektrický výkon [W]",{"$f":"\"Průtok vzduchu [\"&IF(cal!$Z$5=1,\"m³/h\",IF(cal!$Z$5=2,\"CFM\"))&\"]\"","v":"Průtok vzduchu [m³/h]"},{"$f":"\"Rychlost proudění vzduchu [\"&IF(cal!$Z$5=1,\"m/s\",IF(cal!$Z$5=2,\"ft/min\"))&\"]\"","v":"Rychlost proudění vzduchu [m/s]"},{"$f":"\"Výfuková teplota vzduchu topení [\"&IF(cal!$Z$5=1,\"°C\",IF(cal!$Z$5=2,\"°F\"))&\"]\"","v":"Výfuková teplota vzduchu topení [°C]"},{"$f":"\"Air exhaust temp. heating (wet bulb) [\"&IF(cal!$Z$5=1,\"°C\",IF(cal!$Z$5=2,\"°F\"))&\"]\"","v":"Air exhaust temp. heating (wet bulb) [°C]"},{"$f":"\"Výfuková teplota vzduchu chlazení („suchá“ tepl. vzduchu) [\"&IF(cal!$Z$5=1,\"°C\",IF(cal!$Z$5=2,\"°F\"))&\"]\"","v":"Výfuková teplota vzduchu chlazení („suchá“ tepl. vzduchu) [°C]"},{"$f":"\"Výfuková teplota vzduchu chlazení (tepl. mokrého teploměru) [\"&IF(cal!$Z$5=1,\"°C\",IF(cal!$Z$5=2,\"°F\"))&\"]\"","v":"Výfuková teplota vzduchu chlazení (tepl. mokrého teploměru) [°C]"},"Rel. vlhkost chlazeného vzduchu [%]","Frekvence otáčení ventilátoru [otáčky/minuta]","Specifický výkon ventilátoru"]
[{"$f":"cal!$AK$7&\", \"&$V$16&\" \"&ROUND(cal!BK23,1)&IF(cal!$Z$5=1,\" cm, \",IF(cal!$Z$5=2,\" in, \"))&$V$17&\" \"&ROUND(cal!BL23,1)&IF(cal!$Z$5=1,\" cm, \",IF(cal!$Z$5=2,\" in, \"))&$V$18&\" \"&ROUND(cal!BM23,1)&IF(cal!$Z$5=1,\" cm \",IF(cal!$Z$5=2,\" in \"))&$S15","v":"Briza 22 (230V), Výška 54,5 cm, Šířka 22 cm, Délka 55 cm (Typ 02)"},{"$nulls":11},{"$f":"$U$27","v":"Objednací kód:"},{"$nulls":5},"(Typ 02)"]
[{"$nulls":20},"Δp vysoká!","Výška","Kopírovat všechna data"]
[{"$nulls":20},"Teploty","Šířka","Mezinárodní (Sl)"]
[{"$nulls":20},"topení!","Délka","Imperiální"]
[{"$nulls":20},"chlazení!",null,"T,wb & RH"]
[{"$nulls":22},"T,db & RH"]
[{"$nulls":22},"T,db & T,wb"]
[{"$nulls":20},"Briza má několik možností připojení nasávacího a výfukového příslušenství. Další informace najdete na našich webových stránkách.",null,"Pouze na vyžádání!"]
[{"$f":"cal!$AK$7&\", \"&$V$16&\" \"&ROUND(cal!BK31,1)&IF(cal!$Z$5=1,\" cm, \",IF(cal!$Z$5=2,\" in, \"))&$V$17&\" \"&ROUND(cal!BL31,1)&IF(cal!$Z$5=1,\" cm, \",IF(cal!$Z$5=2,\" in, \"))&$V$18&\" \"&ROUND(cal!BM31,1)&IF(cal!$Z$5=1,\" cm \",IF(cal!$Z$5=2,\" in \"))&$S23","v":"Briza 22 (230V), Výška 54,5 cm, Šířka 22 cm, Délka 75 cm (Typ 03)"},{"$nulls":11},{"$f":"$U$27","v":"Objednací kód:"},{"$nulls":5},"(Typ 03)",{"$nulls":3},"Produkt není k dispozici s pouzdrem!"]
[{"$nulls":20},"Stropní model"]
[{"$nulls":20},"Nástěnný model"]
[]
[{"$nulls":20},"Objednací kód:"]
[]
[]
[]
[{"$f":"cal!$AK$7&\", \"&$V$16&\" \"&ROUND(cal!BK39,1)&IF(cal!$Z$5=1,\" cm, \",IF(cal!$Z$5=2,\" in, \"))&$V$17&\" \"&ROUND(cal!BL39,1)&IF(cal!$Z$5=1,\" cm, \",IF(cal!$Z$5=2,\" in, \"))&$V$18&\" \"&ROUND(cal!BM39,1)&IF(cal!$Z$5=1,\" cm \",IF(cal!$Z$5=2,\" in \"))&$S31","v":"Briza 22 (230V), Výška 54,5 cm, Šířka 22 cm, Délka 95 cm (Typ 04)"},{"$nulls":11},{"$f":"$U$27","v":"Objednací kód:"},{"$nulls":5},"(Typ 04)"]
{"$rows_empty":7}
[{"$f":"cal!$AK$7&\", \"&$V$16&\" \"&ROUND(cal!BK47,1)&IF(cal!$Z$5=1,\" cm, \",IF(cal!$Z$5=2,\" in, \"))&$V$17&\" \"&ROUND(cal!BL47,1)&IF(cal!$Z$5=1,\" cm, \",IF(cal!$Z$5=2,\" in, \"))&$V$18&\" \"&ROUND(cal!BM47,1)&IF(cal!$Z$5=1,\" cm \",IF(cal!$Z$5=2,\" in \"))&$S39","v":"Briza 22 (230V), Výška 54,5 cm, Šířka 22 cm, Délka 125 cm (Typ 06)"},{"$nulls":11},{"$f":"$U$27","v":"Objednací kód:"},{"$nulls":5},"(Typ 06)"]
{"$rows_empty":7}
[{"$f":"cal!$AK$7&\", \"&$V$16&\" \"&ROUND(cal!BK55,1)&IF(cal!$Z$5=1,\" cm, \",IF(cal!$Z$5=2,\" in, \"))&$V$17&\" \"&ROUND(cal!BL55,1)&IF(cal!$Z$5=1,\" cm, \",IF(cal!$Z$5=2,\" in, \"))&$V$18&\" \"&ROUND(cal!BM55,1)&IF(cal!$Z$5=1,\" cm \",IF(cal!$Z$5=2,\" in \"))&$S47","v":"Briza 22 (230V), Výška 54,5 cm, Šířka 22 cm, Délka 155 cm (Typ 08)"},{"$nulls":11},{"$f":"$U$27","v":"Objednací kód:"},{"$nulls":5},"(Typ 08)"]
{"$rows_empty":7}
[{"$f":"cal!$AK$7&\", \"&$V$16&\" \"&ROUND(cal!BK63,1)&IF(cal!$Z$5=1,\" cm, \",IF(cal!$Z$5=2,\" in, \"))&$V$17&\" \"&ROUND(cal!BL63,1)&IF(cal!$Z$5=1,\" cm, \",IF(cal!$Z$5=2,\" in, \"))&$V$18&\" \"&ROUND(cal!BM63,1)&IF(cal!$Z$5=1,\" cm \",IF(cal!$Z$5=2,\" in \"))&$S55","v":"Briza 22 (230V), Výška 54,5 cm, Šířka 22 cm, Délka 190 cm (Typ 10)"},{"$nulls":11},{"$f":"$U$27","v":"Objednací kód:"},{"$nulls":5},"(Typ 10)"]
{"$rows_empty":7}
["*Hodnoty podle EN 1397 s filtrem třídy G2.",{"$nulls":15},{"$f":"cal!Q63","v":0}]
["**Akustický tlak podle ISO 3741:2010"]
["***Akustický výkon s předpokládaným útlumem místnosti 8 dB (A)."]
["****Relativní vlhkost vypočítaná bezprostředně za výměníkem tepla, předpokládaná s teplotou povrchu nezávislou na místě."]

{"sheet":"ExtraTaal1","index":10,"n_rows":66,"n_cols":23,"rows_kept":66,"hidden":true,"merged":[[2,6,2,9],[3,6,3,9],[5,11,5,12],[6,11,6,12],[6,16,6,17],[6,18,6,19],[7,0,7,2],[7,5,7,8],[7,16,9,17],[8,0,8,2],[8,5,8,8],[8,11,8,12],[9,5,9,8],[9,11,9,12],[14,0,14,11],[14,12,14,16],[22,0,22,11],[22,12,22,16],[30,0,30,11],[30,12,30,16],[38,0,38,11],[38,12,38,16],[46,0,46,11],[46,12,46,16],[54,0,54,11],[54,12,54,16]]}
[]
["Formulary"]
[{"$nulls":6},"Hydronic mix:",0,0,0]
["Conditions",{"$nulls":5},"Device - Ventilator - Utilization:",0,0,0]
[]
["Temperatures",{"$nulls":10},"Static pressure"]
["Heating:",{"$nulls":4},"Cooling:",{"$nulls":10},"Unit conversion",null,"Known variables"]
["Supply water",null,null,{"$f":"cal!E10","v":65},{"$f":"IF(cal!$Z$5=1,\"°C\",IF(cal!$Z$5=2,\"°F\"))","v":"°C"},{"$f":"A8","v":"Supply water"},{"$nulls":3},{"$f":"cal!K10","v":16},{"$f":"E8","v":"°C"}]
["Return water",null,null,{"$f":"cal!E11","v":55},{"$f":"E8","v":"°C"},{"$f":"A9","v":"Return water"},{"$nulls":3},{"$f":"cal!K11","v":18},{"$f":"E8","v":"°C"},"Altitude"]
["Entering air (dry bulb)",null,null,{"$f":"cal!E12","v":20},{"$f":"E8","v":"°C"},{"$f":"A10","v":"Entering air (dry bulb)"},{"$nulls":3},{"$f":"cal!K12","v":27},{"$f":"E8","v":"°C"},{"$nulls":9},"Desired flow rate"]
["Entering air (wet bulb)",{"$nulls":4},"Relative humidity",{"$nulls":3},{"$f":"cal!K14","v":{"v":0.5,"d":"50%"}},{"$nulls":10},"To calculate on"]
[]
[]
["Speed level","Control voltage [V]",{"$f":"CONCATENATE(\"Heat output * \",ROUND(D8,0),\"/\",ROUND(D9,0),\"/\",ROUND(D10,0),\" [\"&IF(cal!$Z$5=1,\"W\",IF(cal!$Z$5=2,\"Btu/h\"))&\"]\")","v":"Heat output * 65/55/20 [W]"},{"$f":"\"Water flowrate, heating [\"&IF(cal!$Z$5=1,\"l/h\",IF(cal!$Z$5=2,\"GPM\"))&\"]\"","v":"Water flowrate, heating [l/h]"},{"$f":"\"Water side pressure loss [\"&IF(cal!$Z$5=1,\"kPa\",IF(cal!$Z$5=2,\"ftH2O\"))&\"]\"","v":"Water side pressure loss [kPa]"},{"$f":"CONCATENATE(\"Sens. cooling capacity * \",ROUND(J8,0),\"/\",ROUND(J9,0),\"/\",ROUND(J10,0),\" [\"&IF(cal!$Z$5=1,\"W\",IF(cal!$Z$5=2,\"Btu/h\"))&\"]\")","v":"Sens. cooling capacity * 16/18/27 [W]"},{"$f":"CONCATENATE(\"Tot. cooling capacity \",ROUND(J8,0),\"/\",ROUND(J9,0),\"/\",ROUND(J10,0),\" [\"&IF(cal!$Z$5=1,\"W\",IF(cal!$Z$5=2,\"Btu/h\"))&\"]\")","v":"Tot. cooling capacity 16/18/27 [W]"},{"$f":"\"Water flowrate, cooling [\"&IF(cal!$Z$5=1,\"l/h\",IF(cal!$Z$5=2,\"GPM\"))&\"]\"","v":"Water flowrate, cooling [l/h]"},{"$f":"E14","v":"Water side pressure loss [kPa]"},"Sound pressure *** [dB(A)]","Sound power ** [dB(A)]","Electrical power [W]",{"$f":"\"Air flowrate [\"&IF(cal!$Z$5=1,\"m³/h\",IF(cal!$Z$5=2,\"CFM\"))&\"]\"","v":"Air flowrate [m³/h]"},{"$f":"\"Face velocity [\"&IF(cal!$Z$5=1,\"m/s\",IF(cal!$Z$5=2,\"ft/min\"))&\"]\"","v":"Face velocity [m/s]"},{"$f":"\"Air exhaust temp. heating [\"&IF(cal!$Z$5=1,\"°C\",IF(cal!$Z$5=2,\"°F\"))&\"]\"","v":"Air exhaust temp. heating [°C]"},{"$f":"\"Air exhaust temp. heating (wet bulb) [\"&IF(cal!$Z$5=1,\"°C\",IF(cal!$Z$5=2,\"°F\"))&\"]\"","v":"Air exhaust temp. heating (wet bulb) [°C]"},{"$f":"\"Air exhaust temp. cooling (dry bulb) [\"&IF(cal!$Z$5=1,\"°C\",IF(cal!$Z$5=2,\"°F\"))&\"]\"","v":"Air exhaust temp. cooling (dry bulb) [°C]"},{"$f":"\"Air exhaust temp. cooling (wet bulb) [\"&IF(cal!$Z$5=1,\"°C\",IF(cal!$Z$5=2,\"°F\"))&\"]\"","v":"Air exhaust temp. cooling (wet bulb) [°C]"},"Rel. humid. cooled air [%]","fan rotation frequency [revolutions/minute]","Specific fan power"]
[{"$f":"cal!$AK$7&\" \"&$V$16&\" \"&ROUND(cal!BK23,1)&IF(cal!$Z$5=1,\" cm, \",IF(cal!$Z$5=2,\" in, \"))&$V$17&\" \"&ROUND(cal!BL23,1)&IF(cal!$Z$5=1,\" cm, \",IF(cal!$Z$5=2,\" in, \"))&$V$18&\" \"&ROUND(cal!BM23,1)&IF(cal!$Z$5=1,\" cm \",IF(cal!$Z$5=2,\" in \"))&$S15","v":"Briza 22 (230V) height 54,5 cm, width 22 cm, length 55 cm (Type 02)"},{"$nulls":11},{"$f":"$U$27","v":"Order code:"},{"$nulls":5},"(Type 02)"]
[{"$nulls":20},"Δp high!","height","Copy all data"]
[{"$nulls":20},"Temp.","width","SI-units"]
[{"$nulls":20},"heating!","length","Imperial-units"]
[{"$nulls":20},"cooling!",null,"T,wb & RH"]
[{"$nulls":22},"T,db & RH"]
[{"$nulls":22},"T,db & T,wb"]
[{"$nulls":20},"Briza has multiple airflow supply and return air connection options. Visit our website for more information.",null,"Only on request!"]
[{"$f":"cal!$AK$7&\" \"&$V$16&\" \"&ROUND(cal!BK31,1)&IF(cal!$Z$5=1,\" cm, \",IF(cal!$Z$5=2,\" in, \"))&$V$17&\" \"&ROUND(cal!BL31,1)&IF(cal!$Z$5=1,\" cm, \",IF(cal!$Z$5=2,\" in, \"))&$V$18&\" \"&ROUND(cal!BM31,1)&IF(cal!$Z$5=1,\" cm \",IF(cal!$Z$5=2,\" in \"))&$S23","v":"Briza 22 (230V) height 54,5 cm, width 22 cm, length 75 cm (Type 03)"},{"$nulls":11},{"$f":"$U$27","v":"Order code:"},{"$nulls":5},"(Type 03)",{"$nulls":3},"Product not available with casing!"]
[{"$nulls":20},"Ceiling model"]
[{"$nulls":20},"Wall model"]
[]
[{"$nulls":20},"Order code:"]
[]
[]
[]
[{"$f":"cal!$AK$7&\" \"&$V$16&\" \"&ROUND(cal!BK39,1)&IF(cal!$Z$5=1,\" cm, \",IF(cal!$Z$5=2,\" in, \"))&$V$17&\" \"&ROUND(cal!BL39,1)&IF(cal!$Z$5=1,\" cm, \",IF(cal!$Z$5=2,\" in, \"))&$V$18&\" \"&ROUND(cal!BM39,1)&IF(cal!$Z$5=1,\" cm \",IF(cal!$Z$5=2,\" in \"))&$S31","v":"Briza 22 (230V) height 54,5 cm, width 22 cm, length 95 cm (Type 04)"},{"$nulls":11},{"$f":"$U$27","v":"Order code:"},{"$nulls":5},"(Type 04)"]
{"$rows_empty":7}
[{"$f":"cal!$AK$7&\" \"&$V$16&\" \"&ROUND(cal!BK47,1)&IF(cal!$Z$5=1,\" cm, \",IF(cal!$Z$5=2,\" in, \"))&$V$17&\" \"&ROUND(cal!BL47,1)&IF(cal!$Z$5=1,\" cm, \",IF(cal!$Z$5=2,\" in, \"))&$V$18&\" \"&ROUND(cal!BM47,1)&IF(cal!$Z$5=1,\" cm \",IF(cal!$Z$5=2,\" in \"))&$S39","v":"Briza 22 (230V) height 54,5 cm, width 22 cm, length 125 cm (Type 06)"},{"$nulls":11},{"$f":"$U$27","v":"Order code:"},{"$nulls":5},"(Type 06)"]
{"$rows_empty":7}
[{"$f":"cal!$AK$7&\" \"&$V$16&\" \"&ROUND(cal!BK55,1)&IF(cal!$Z$5=1,\" cm, \",IF(cal!$Z$5=2,\" in, \"))&$V$17&\" \"&ROUND(cal!BL55,1)&IF(cal!$Z$5=1,\" cm, \",IF(cal!$Z$5=2,\" in, \"))&$V$18&\" \"&ROUND(cal!BM55,1)&IF(cal!$Z$5=1,\" cm \",IF(cal!$Z$5=2,\" in \"))&$S47","v":"Briza 22 (230V) height 54,5 cm, width 22 cm, length 155 cm (Type 08)"},{"$nulls":11},{"$f":"$U$27","v":"Order code:"},{"$nulls":5},"(Type 08)"]
{"$rows_empty":7}
[{"$f":"cal!$AK$7&\" \"&$V$16&\" \"&ROUND(cal!BK63,1)&IF(cal!$Z$5=1,\" cm, \",IF(cal!$Z$5=2,\" in, \"))&$V$17&\" \"&ROUND(cal!BL63,1)&IF(cal!$Z$5=1,\" cm, \",IF(cal!$Z$5=2,\" in, \"))&$V$18&\" \"&ROUND(cal!BM63,1)&IF(cal!$Z$5=1,\" cm \",IF(cal!$Z$5=2,\" in \"))&$S55","v":"Briza 22 (230V) height 54,5 cm, width 22 cm, length 190 cm (Type 10)"},{"$nulls":11},{"$f":"$U$27","v":"Order code:"},{"$nulls":5},"(Type 10)"]
{"$rows_empty":7}
["*Values according to EN 1397 equipped with a G2 filter.",{"$nulls":15},{"$f":"cal!Q63","v":0}]
["**Sound power according to ISO 3741:2010"]
["***Sound pressure with an assumed room damping of 8dB(A)"]
["****Calculated RH directly after the heat exchanger, assumed with a location-independent surface temperature."]

{"sheet":"ExtraTaal2","index":11,"n_rows":66,"n_cols":23,"rows_kept":66,"hidden":true,"merged":[[2,6,2,9],[3,6,3,9],[5,11,5,12],[6,11,6,12],[6,16,6,17],[6,18,6,19],[7,0,7,2],[7,5,7,8],[7,16,9,17],[8,0,8,2],[8,5,8,8],[8,11,8,12],[9,5,9,8],[9,11,9,12],[14,0,14,11],[14,12,14,16],[22,0,22,11],[22,12,22,16],[30,0,30,11],[30,12,30,16],[38,0,38,11],[38,12,38,16],[46,0,46,11],[46,12,46,16],[54,0,54,11],[54,12,54,16]]}
[]
["Formulary"]
[{"$nulls":6},"Hydronic mix:",0,0,0]
["Conditions",{"$nulls":5},"Device - Ventilator - Utilization:",0,0,0]
[]
["Temperatures",{"$nulls":10},"Static pressure"]
["Heating:",{"$nulls":4},"Cooling:",{"$nulls":10},"Unit conversion",null,"Known variables"]
["Supply water",null,null,{"$f":"cal!E10","v":65},{"$f":"IF(cal!$Z$5=1,\"°C\",IF(cal!$Z$5=2,\"°F\"))","v":"°C"},{"$f":"A8","v":"Supply water"},{"$nulls":3},{"$f":"cal!K10","v":16},{"$f":"E8","v":"°C"}]
["Return water",null,null,{"$f":"cal!E11","v":55},{"$f":"E8","v":"°C"},{"$f":"A9","v":"Return water"},{"$nulls":3},{"$f":"cal!K11","v":18},{"$f":"E8","v":"°C"},"Altitude"]
["Entering air (dry bulb)",null,null,{"$f":"cal!E12","v":20},{"$f":"E8","v":"°C"},{"$f":"A10","v":"Entering air (dry bulb)"},{"$nulls":3},{"$f":"cal!K12","v":27},{"$f":"E8","v":"°C"},{"$nulls":9},"Desired flow rate"]
["Entering air (wet bulb)",{"$nulls":4},"Relative humidity",{"$nulls":3},{"$f":"cal!K14","v":{"v":0.5,"d":"50%"}},{"$nulls":10},"To calculate on"]
[]
[]
["Speed level","Control voltage [V]",{"$f":"CONCATENATE(\"Heat output * \",ROUND(D8,0),\"/\",ROUND(D9,0),\"/\",ROUND(D10,0),\" [\"&IF(cal!$Z$5=1,\"W\",IF(cal!$Z$5=2,\"Btu/h\"))&\"]\")","v":"Heat output * 65/55/20 [W]"},{"$f":"\"Water flowrate, heating [\"&IF(cal!$Z$5=1,\"l/h\",IF(cal!$Z$5=2,\"GPM\"))&\"]\"","v":"Water flowrate, heating [l/h]"},{"$f":"\"Water side pressure loss [\"&IF(cal!$Z$5=1,\"kPa\",IF(cal!$Z$5=2,\"ftH2O\"))&\"]\"","v":"Water side pressure loss [kPa]"},{"$f":"CONCATENATE(\"Sens. cooling capacity * \",ROUND(J8,0),\"/\",ROUND(J9,0),\"/\",ROUND(J10,0),\" [\"&IF(cal!$Z$5=1,\"W\",IF(cal!$Z$5=2,\"Btu/h\"))&\"]\")","v":"Sens. cooling capacity * 16/18/27 [W]"},{"$f":"CONCATENATE(\"Tot. cooling capacity \",ROUND(J8,0),\"/\",ROUND(J9,0),\"/\",ROUND(J10,0),\" [\"&IF(cal!$Z$5=1,\"W\",IF(cal!$Z$5=2,\"Btu/h\"))&\"]\")","v":"Tot. cooling capacity 16/18/27 [W]"},{"$f":"\"Water flowrate, cooling [\"&IF(cal!$Z$5=1,\"l/h\",IF(cal!$Z$5=2,\"GPM\"))&\"]\"","v":"Water flowrate, cooling [l/h]"},{"$f":"E14","v":"Water side pressure loss [kPa]"},"Sound pressure *** [dB(A)]","Sound power ** [dB(A)]","Electrical power [W]",{"$f":"\"Air flowrate [\"&IF(cal!$Z$5=1,\"m³/h\",IF(cal!$Z$5=2,\"CFM\"))&\"]\"","v":"Air flowrate [m³/h]"},{"$f":"\"Face velocity [\"&IF(cal!$Z$5=1,\"m/s\",IF(cal!$Z$5=2,\"ft/min\"))&\"]\"","v":"Face velocity [m/s]"},{"$f":"\"Air exhaust temp. heating [\"&IF(cal!$Z$5=1,\"°C\",IF(cal!$Z$5=2,\"°F\"))&\"]\"","v":"Air exhaust temp. heating [°C]"},{"$f":"\"Air exhaust temp. heating (wet bulb) [\"&IF(cal!$Z$5=1,\"°C\",IF(cal!$Z$5=2,\"°F\"))&\"]\"","v":"Air exhaust temp. heating (wet bulb) [°C]"},{"$f":"\"Air exhaust temp. cooling (dry bulb) [\"&IF(cal!$Z$5=1,\"°C\",IF(cal!$Z$5=2,\"°F\"))&\"]\"","v":"Air exhaust temp. cooling (dry bulb) [°C]"},{"$f":"\"Air exhaust temp. cooling (wet bulb) [\"&IF(cal!$Z$5=1,\"°C\",IF(cal!$Z$5=2,\"°F\"))&\"]\"","v":"Air exhaust temp. cooling (wet bulb) [°C]"},"Rel. humid. cooled air [%]","fan rotation frequency [revolutions/minute]","Specific fan power"]
[{"$f":"cal!$AK$7&\" \"&$V$16&\" \"&ROUND(cal!BK23,1)&IF(cal!$Z$5=1,\" cm, \",IF(cal!$Z$5=2,\" in, \"))&$V$17&\" \"&ROUND(cal!BL23,1)&IF(cal!$Z$5=1,\" cm, \",IF(cal!$Z$5=2,\" in, \"))&$V$18&\" \"&ROUND(cal!BM23,1)&IF(cal!$Z$5=1,\" cm \",IF(cal!$Z$5=2,\" in \"))&$S15","v":"Briza 22 (230V) height 54,5 cm, width 22 cm, length 55 cm (Type 02)"},{"$nulls":11},{"$f":"$U$27","v":"Order code:"},{"$nulls":5},"(Type 02)"]
[{"$nulls":20},"Δp high!","height","Copy all data"]
[{"$nulls":20},"Temp.","width","SI-units"]
[{"$nulls":20},"heating!","length","Imperial-units"]
[{"$nulls":20},"cooling!",null,"T,wb & RH"]
[{"$nulls":22},"T,db & RH"]
[{"$nulls":22},"T,db & T,wb"]
[{"$nulls":20},"Briza has multiple airflow supply and return air connection options. Visit our website for more information.",null,"Only on request!"]
[{"$f":"cal!$AK$7&\" \"&$V$16&\" \"&ROUND(cal!BK31,1)&IF(cal!$Z$5=1,\" cm, \",IF(cal!$Z$5=2,\" in, \"))&$V$17&\" \"&ROUND(cal!BL31,1)&IF(cal!$Z$5=1,\" cm, \",IF(cal!$Z$5=2,\" in, \"))&$V$18&\" \"&ROUND(cal!BM31,1)&IF(cal!$Z$5=1,\" cm \",IF(cal!$Z$5=2,\" in \"))&$S23","v":"Briza 22 (230V) height 54,5 cm, width 22 cm, length 75 cm (Type 03)"},{"$nulls":11},{"$f":"$U$27","v":"Order code:"},{"$nulls":5},"(Type 03)",{"$nulls":3},"Product not available with casing!"]
[{"$nulls":20},"Ceiling model"]
[{"$nulls":20},"Wall model"]
[]
[{"$nulls":20},"Order code:"]
[]
[]
[]
[{"$f":"cal!$AK$7&\" \"&$V$16&\" \"&ROUND(cal!BK39,1)&IF(cal!$Z$5=1,\" cm, \",IF(cal!$Z$5=2,\" in, \"))&$V$17&\" \"&ROUND(cal!BL39,1)&IF(cal!$Z$5=1,\" cm, \",IF(cal!$Z$5=2,\" in, \"))&$V$18&\" \"&ROUND(cal!BM39,1)&IF(cal!$Z$5=1,\" cm \",IF(cal!$Z$5=2,\" in \"))&$S31","v":"Briza 22 (230V) height 54,5 cm, width 22 cm, length 95 cm (Type 04)"},{"$nulls":11},{"$f":"$U$27","v":"Order code:"},{"$nulls":5},"(Type 04)"]
{"$rows_empty":7}
[{"$f":"cal!$AK$7&\" \"&$V$16&\" \"&ROUND(cal!BK47,1)&IF(cal!$Z$5=1,\" cm, \",IF(cal!$Z$5=2,\" in, \"))&$V$17&\" \"&ROUND(cal!BL47,1)&IF(cal!$Z$5=1,\" cm, \",IF(cal!$Z$5=2,\" in, \"))&$V$18&\" \"&ROUND(cal!BM47,1)&IF(cal!$Z$5=1,\" cm \",IF(cal!$Z$5=2,\" in \"))&$S39","v":"Briza 22 (230V) height 54,5 cm, width 22 cm, length 125 cm (Type 06)"},{"$nulls":11},{"$f":"$U$27","v":"Order code:"},{"$nulls":5},"(Type 06)"]
{"$rows_empty":7}
[{"$f":"cal!$AK$7&\" \"&$V$16&\" \"&ROUND(cal!BK55,1)&IF(cal!$Z$5=1,\" cm, \",IF(cal!$Z$5=2,\" in, \"))&$V$17&\" \"&ROUND(cal!BL55,1)&IF(cal!$Z$5=1,\" cm, \",IF(cal!$Z$5=2,\" in, \"))&$V$18&\" \"&ROUND(cal!BM55,1)&IF(cal!$Z$5=1,\" cm \",IF(cal!$Z$5=2,\" in \"))&$S47","v":"Briza 22 (230V) height 54,5 cm, width 22 cm, length 155 cm (Type 08)"},{"$nulls":11},{"$f":"$U$27","v":"Order code:"},{"$nulls":5},"(Type 08)"]
{"$rows_empty":7}
[{"$f":"cal!$AK$7&\" \"&$V$16&\" \"&ROUND(cal!BK63,1)&IF(cal!$Z$5=1,\" cm, \",IF(cal!$Z$5=2,\" in, \"))&$V$17&\" \"&ROUND(cal!BL63,1)&IF(cal!$Z$5=1,\" cm, \",IF(cal!$Z$5=2,\" in, \"))&$V$18&\" \"&ROUND(cal!BM63,1)&IF(cal!$Z$5=1,\" cm \",IF(cal!$Z$5=2,\" in \"))&$S55","v":"Briza 22 (230V) height 54,5 cm, width 22 cm, length 190 cm (Type 10)"},{"$nulls":11},{"$f":"$U$27","v":"Order code:"},{"$nulls":5},"(Type 10)"]
{"$rows_empty":7}
["*Values according to EN 1397 equipped with a G2 filter.",{"$nulls":15},{"$f":"cal!Q63","v":0}]
["**Sound power according to ISO 3741:2010"]
["***Sound pressure with an assumed room damping of 8dB(A)"]
["****Calculated RH directly after the heat exchanger, assumed with a location-independent surface temperature."]

{"sheet":"ExtraTaal3","index":12,"n_rows":66,"n_cols":23,"rows_kept":66,"hidden":true,"merged":[[2,6,2,9],[3,6,3,9],[5,11,5,12],[6,11,6,12],[6,16,6,17],[6,18,6,19],[7,0,7,2],[7,5,7,8],[7,16,9,17],[8,0,8,2],[8,5,8,8],[8,11,8,12],[9,5,9,8],[9,11,9,12],[14,0,14,11],[14,12,14,16],[22,0,22,11],[22,12,22,16],[30,0,30,11],[30,12,30,16],[38,0,38,11],[38,12,38,16],[46,0,46,11],[46,12,46,16],[54,0,54,11],[54,12,54,16]]}
[]
["Formulary"]
[{"$nulls":6},"Hydronic mix:",0,0,0]
["Conditions",{"$nulls":5},"Device - Ventilator - Utilization:",0,0,0]
[]
["Temperatures",{"$nulls":10},"Static pressure"]
["Heating:",{"$nulls":4},"Cooling:",{"$nulls":10},"Unit conversion",null,"Known variables"]
["Supply water",null,null,{"$f":"cal!E10","v":65},{"$f":"IF(cal!$Z$5=1,\"°C\",IF(cal!$Z$5=2,\"°F\"))","v":"°C"},{"$f":"A8","v":"Supply water"},{"$nulls":3},{"$f":"cal!K10","v":16},{"$f":"E8","v":"°C"}]
["Return water",null,null,{"$f":"cal!E11","v":55},{"$f":"E8","v":"°C"},{"$f":"A9","v":"Return water"},{"$nulls":3},{"$f":"cal!K11","v":18},{"$f":"E8","v":"°C"},"Altitude"]
["Entering air (dry bulb)",null,null,{"$f":"cal!E12","v":20},{"$f":"E8","v":"°C"},{"$f":"A10","v":"Entering air (dry bulb)"},{"$nulls":3},{"$f":"cal!K12","v":27},{"$f":"E8","v":"°C"},{"$nulls":9},"Desired flow rate"]
["Entering air (wet bulb)",{"$nulls":4},"Relative humidity",{"$nulls":3},{"$f":"cal!K14","v":{"v":0.5,"d":"50%"}},{"$nulls":10},"To calculate on"]
[]
[]
["Speed level","Control voltage [V]",{"$f":"CONCATENATE(\"Heat output * \",ROUND(D8,0),\"/\",ROUND(D9,0),\"/\",ROUND(D10,0),\" [\"&IF(cal!$Z$5=1,\"W\",IF(cal!$Z$5=2,\"Btu/h\"))&\"]\")","v":"Heat output * 65/55/20 [W]"},{"$f":"\"Water flowrate, heating [\"&IF(cal!$Z$5=1,\"l/h\",IF(cal!$Z$5=2,\"GPM\"))&\"]\"","v":"Water flowrate, heating [l/h]"},{"$f":"\"Water side pressure loss [\"&IF(cal!$Z$5=1,\"kPa\",IF(cal!$Z$5=2,\"ftH2O\"))&\"]\"","v":"Water side pressure loss [kPa]"},{"$f":"CONCATENATE(\"Sens. cooling capacity * \",ROUND(J8,0),\"/\",ROUND(J9,0),\"/\",ROUND(J10,0),\" [\"&IF(cal!$Z$5=1,\"W\",IF(cal!$Z$5=2,\"Btu/h\"))&\"]\")","v":"Sens. cooling capacity * 16/18/27 [W]"},{"$f":"CONCATENATE(\"Tot. cooling capacity \",ROUND(J8,0),\"/\",ROUND(J9,0),\"/\",ROUND(J10,0),\" [\"&IF(cal!$Z$5=1,\"W\",IF(cal!$Z$5=2,\"Btu/h\"))&\"]\")","v":"Tot. cooling capacity 16/18/27 [W]"},{"$f":"\"Water flowrate, cooling [\"&IF(cal!$Z$5=1,\"l/h\",IF(cal!$Z$5=2,\"GPM\"))&\"]\"","v":"Water flowrate, cooling [l/h]"},{"$f":"E14","v":"Water side pressure loss [kPa]"},"Sound pressure *** [dB(A)]","Sound power ** [dB(A)]","Electrical power [W]",{"$f":"\"Air flowrate [\"&IF(cal!$Z$5=1,\"m³/h\",IF(cal!$Z$5=2,\"CFM\"))&\"]\"","v":"Air flowrate [m³/h]"},{"$f":"\"Face velocity [\"&IF(cal!$Z$5=1,\"m/s\",IF(cal!$Z$5=2,\"ft/min\"))&\"]\"","v":"Face velocity [m/s]"},{"$f":"\"Air exhaust temp. heating [\"&IF(cal!$Z$5=1,\"°C\",IF(cal!$Z$5=2,\"°F\"))&\"]\"","v":"Air exhaust temp. heating [°C]"},{"$f":"\"Air exhaust temp. heating (wet bulb) [\"&IF(cal!$Z$5=1,\"°C\",IF(cal!$Z$5=2,\"°F\"))&\"]\"","v":"Air exhaust temp. heating (wet bulb) [°C]"},{"$f":"\"Air exhaust temp. cooling (dry bulb) [\"&IF(cal!$Z$5=1,\"°C\",IF(cal!$Z$5=2,\"°F\"))&\"]\"","v":"Air exhaust temp. cooling (dry bulb) [°C]"},{"$f":"\"Air exhaust temp. cooling (wet bulb) [\"&IF(cal!$Z$5=1,\"°C\",IF(cal!$Z$5=2,\"°F\"))&\"]\"","v":"Air exhaust temp. cooling (wet bulb) [°C]"},"Rel. humid. cooled air [%]","fan rotation frequency [revolutions/minute]","Specific fan power"]
[{"$f":"cal!$AK$7&\" \"&$V$16&\" \"&ROUND(cal!BK23,1)&IF(cal!$Z$5=1,\" cm, \",IF(cal!$Z$5=2,\" in, \"))&$V$17&\" \"&ROUND(cal!BL23,1)&IF(cal!$Z$5=1,\" cm, \",IF(cal!$Z$5=2,\" in, \"))&$V$18&\" \"&ROUND(cal!BM23,1)&IF(cal!$Z$5=1,\" cm \",IF(cal!$Z$5=2,\" in \"))&$S15","v":"Briza 22 (230V) height 54,5 cm, width 22 cm, length 55 cm (Type 02)"},{"$nulls":11},{"$f":"$U$27","v":"Order code:"},{"$nulls":5},"(Type 02)"]
[{"$nulls":20},"Δp high!","height","Copy all data"]
[{"$nulls":20},"Temp.","width","SI-units"]
[{"$nulls":20},"heating!","length","Imperial-units"]
[{"$nulls":20},"cooling!",null,"T,wb & RH"]
[{"$nulls":22},"T,db & RH"]
[{"$nulls":22},"T,db & T,wb"]
[{"$nulls":20},"Briza has multiple airflow supply and return air connection options. Visit our website for more information.",null,"Only on request!"]
[{"$f":"cal!$AK$7&\" \"&$V$16&\" \"&ROUND(cal!BK31,1)&IF(cal!$Z$5=1,\" cm, \",IF(cal!$Z$5=2,\" in, \"))&$V$17&\" \"&ROUND(cal!BL31,1)&IF(cal!$Z$5=1,\" cm, \",IF(cal!$Z$5=2,\" in, \"))&$V$18&\" \"&ROUND(cal!BM31,1)&IF(cal!$Z$5=1,\" cm \",IF(cal!$Z$5=2,\" in \"))&$S23","v":"Briza 22 (230V) height 54,5 cm, width 22 cm, length 75 cm (Type 03)"},{"$nulls":11},{"$f":"$U$27","v":"Order code:"},{"$nulls":5},"(Type 03)",{"$nulls":3},"Product not available with casing!"]
[{"$nulls":20},"Ceiling model"]
[{"$nulls":20},"Wall model"]
[]
[{"$nulls":20},"Order code:"]
[]
[]
[]
[{"$f":"cal!$AK$7&\" \"&$V$16&\" \"&ROUND(cal!BK39,1)&IF(cal!$Z$5=1,\" cm, \",IF(cal!$Z$5=2,\" in, \"))&$V$17&\" \"&ROUND(cal!BL39,1)&IF(cal!$Z$5=1,\" cm, \",IF(cal!$Z$5=2,\" in, \"))&$V$18&\" \"&ROUND(cal!BM39,1)&IF(cal!$Z$5=1,\" cm \",IF(cal!$Z$5=2,\" in \"))&$S31","v":"Briza 22 (230V) height 54,5 cm, width 22 cm, length 95 cm (Type 04)"},{"$nulls":11},{"$f":"$U$27","v":"Order code:"},{"$nulls":5},"(Type 04)"]
{"$rows_empty":7}
[{"$f":"cal!$AK$7&\" \"&$V$16&\" \"&ROUND(cal!BK47,1)&IF(cal!$Z$5=1,\" cm, \",IF(cal!$Z$5=2,\" in, \"))&$V$17&\" \"&ROUND(cal!BL47,1)&IF(cal!$Z$5=1,\" cm, \",IF(cal!$Z$5=2,\" in, \"))&$V$18&\" \"&ROUND(cal!BM47,1)&IF(cal!$Z$5=1,\" cm \",IF(cal!$Z$5=2,\" in \"))&$S39","v":"Briza 22 (230V) height 54,5 cm, width 22 cm, length 125 cm (Type 06)"},{"$nulls":11},{"$f":"$U$27","v":"Order code:"},{"$nulls":5},"(Type 06)"]
{"$rows_empty":7}
[{"$f":"cal!$AK$7&\" \"&$V$16&\" \"&ROUND(cal!BK55,1)&IF(cal!$Z$5=1,\" cm, \",IF(cal!$Z$5=2,\" in, \"))&$V$17&\" \"&ROUND(cal!BL55,1)&IF(cal!$Z$5=1,\" cm, \",IF(cal!$Z$5=2,\" in, \"))&$V$18&\" \"&ROUND(cal!BM55,1)&IF(cal!$Z$5=1,\" cm \",IF(cal!$Z$5=2,\" in \"))&$S47","v":"Briza 22 (230V) height 54,5 cm, width 22 cm, length 155 cm (Type 08)"},{"$nulls":11},{"$f":"$U$27","v":"Order code:"},{"$nulls":5},"(Type 08)"]
{"$rows_empty":7}
[{"$f":"cal!$AK$7&\" \"&$V$16&\" \"&ROUND(cal!BK63,1)&IF(cal!$Z$5=1,\" cm, \",IF(cal!$Z$5=2,\" in, \"))&$V$17&\" \"&ROUND(cal!BL63,1)&IF(cal!$Z$5=1,\" cm, \",IF(cal!$Z$5=2,\" in, \"))&$V$18&\" \"&ROUND(cal!BM63,1)&IF(cal!$Z$5=1,\" cm \",IF(cal!$Z$5=2,\" in \"))&$S55","v":"Briza 22 (230V) height 54,5 cm, width 22 cm, length 190 cm (Type 10)"},{"$nulls":11},{"$f":"$U$27","v":"Order code:"},{"$nulls":5},"(Type 10)"]
{"$rows_empty":7}
["*Values according to EN 1397 equipped with a G2 filter.",{"$nulls":15},{"$f":"cal!Q63","v":0}]
["**Sound power according to ISO 3741:2010"]
["***Sound pressure with an assumed room damping of 8dB(A)"]
["****Calculated RH directly after the heat exchanger, assumed with a location-independent surface temperature."]